module github.com/gookit/color

go 1.18

require (
	github.com/stretchr/testify v1.8.2
	github.com/xo/terminfo v0.0.0-20210125001918-ca9a967f8778
	golang.org/x/sys v0.8.0
)

require (
	github.com/davecgh/go-spew v1.1.1 // indirect
	github.com/pmezard/go-difflib v1.0.0 // indirect
	gopkg.in/yaml.v3 v3.0.1 // indirect
)
