{
  "name": "net-snmp",
  "secfixes": {
    "5.9.3-r2": [
      "CVE-2015-8100",
      "CVE-2022-44792",
      "CVE-2022-44793"
    ],
    "5.9.3-r0": [
      "CVE-2022-24805",
      "CVE-2022-24806",
      "CVE-2022-24807",
      "CVE-2022-24808",
      "CVE-2022-24809",
      "CVE-2022-24810"
    ]
  },
  "apkurl": "{{urlprefix}}/{{distroversion}}/{{reponame}}/{{arch}}/{{pkg.name}}-{{pkg.ver}}.apk",
  "archs": [
    "aarch64",
    "armhf",
    "armv7",
    "mips64",
    "mips64el",
    "ppc64le",
    "s390x",
    "x86",
    "x86_64"
  ],
  "urlprefix": "https://dl-cdn.alpinelinux.org/alpine",
  "reponame": "main",
  "distroversion": "v3.19"
}