{
  "name": "gst-plugins-base",
  "secfixes": {
    "1.24.10-r0": [
      "CVE-2024-47542",
      "CVE-2024-47600",
      "CVE-2024-47538",
      "CVE-2024-47541",
      "CVE-2024-47607",
      "CVE-2024-47615",
      "CVE-2024-47835"
    ],
    "1.18.4-r0": [
      "CVE-2021-3522"
    ],
    "1.16.0-r0": [
      "CVE-2019-9928"
    ]
  },
  "apkurl": "{{urlprefix}}/{{distroversion}}/{{reponame}}/{{arch}}/{{pkg.name}}-{{pkg.ver}}.apk",
  "archs": [
    "aarch64",
    "armhf",
    "armv7",
    "mips64",
    "mips64el",
    "ppc64le",
    "s390x",
    "x86",
    "x86_64"
  ],
  "urlprefix": "https://dl-cdn.alpinelinux.org/alpine",
  "reponame": "main",
  "distroversion": "v3.21"
}