{
  "name": "ncurses",
  "secfixes": {
    "6.0_p20171125-r1": [
      "CVE-2018-10754"
    ],
    "6.0_p20171125-r0": [
      "CVE-2017-16879"
    ],
    "6.0_p20170701-r0": [
      "CVE-2017-11112",
      "CVE-2017-11113",
      "CVE-2017-13728",
      "CVE-2017-13729",
      "CVE-2017-13730",
      "CVE-2017-13731",
      "CVE-2017-13732",
      "CVE-2017-13733",
      "CVE-2017-13734"
    ],
    "6.0-r8": [
      "CVE-2017-10684",
      "CVE-2017-10685"
    ]
  },
  "apkurl": "{{urlprefix}}/{{distroversion}}/{{reponame}}/{{arch}}/{{pkg.name}}-{{pkg.ver}}.apk",
  "archs": [
    "aarch64",
    "armhf",
    "armv7",
    "mips64",
    "mips64el",
    "ppc64le",
    "s390x",
    "x86",
    "x86_64"
  ],
  "urlprefix": "https://dl-cdn.alpinelinux.org/alpine",
  "reponame": "main",
  "distroversion": "v3.5"
}