{
  "name": "apache-ant",
  "secfixes": {
    "1.10.11-r0": [
      "CVE-2021-36373",
      "CVE-2021-36374"
    ],
    "1.10.9-r0": [
      "CVE-2020-11979"
    ],
    "1.10.8-r0": [
      "CVE-2020-1945"
    ]
  },
  "apkurl": "{{urlprefix}}/{{distroversion}}/{{reponame}}/{{arch}}/{{pkg.name}}-{{pkg.ver}}.apk",
  "archs": [

  ],
  "urlprefix": "https://dl-cdn.alpinelinux.org/alpine",
  "reponame": "community",
  "distroversion": "v3.20"
}