{
  "name": "openssl1.1-compat",
  "secfixes": {
    "1.1.1u-r1": [
      "CVE-2023-3446"
    ],
    "1.1.1t-r2": [
      "CVE-2023-0465"
    ],
    "1.1.1t-r1": [
      "CVE-2023-0464"
    ],
    "1.1.1t-r0": [
      "CVE-2022-4304",
      "CVE-2022-4450",
      "CVE-2023-0215",
      "CVE-2023-0286"
    ],
    "1.1.1q-r0": [
      "CVE-2022-2097"
    ],
    "1.1.1n-r0": [
      "CVE-2022-0778"
    ],
    "1.1.1l-r0": [
      "CVE-2021-3711",
      "CVE-2021-3712"
    ],
    "1.1.1k-r0": [
      "CVE-2021-3449",
      "CVE-2021-3450"
    ],
    "1.1.1j-r0": [
      "CVE-2021-23841",
      "CVE-2021-23840",
      "CVE-2021-23839"
    ],
    "1.1.1i-r0": [
      "CVE-2020-1971"
    ],
    "1.1.1g-r0": [
      "CVE-2020-1967"
    ],
    "1.1.1d-r3": [
      "CVE-2019-1551"
    ],
    "1.1.1d-r1": [
      "CVE-2019-1547",
      "CVE-2019-1549",
      "CVE-2019-1563"
    ],
    "1.1.1b-r1": [
      "CVE-2019-1543"
    ],
    "1.1.1a-r0": [
      "CVE-2018-0734",
      "CVE-2018-0735"
    ],
    "0": [
      "CVE-2022-1292",
      "CVE-2022-2068",
      "CVE-2023-0466"
    ]
  },
  "apkurl": "{{urlprefix}}/{{distroversion}}/{{reponame}}/{{arch}}/{{pkg.name}}-{{pkg.ver}}.apk",
  "archs": [
    "aarch64",
    "armhf",
    "armv7",
    "mips64",
    "mips64el",
    "ppc64le",
    "s390x",
    "x86",
    "x86_64"
  ],
  "urlprefix": "https://dl-cdn.alpinelinux.org/alpine",
  "reponame": "community",
  "distroversion": "v3.18"
}