{
  "name": "ffmpeg",
  "secfixes": {
    "3.1.11-r1": [
      "CVE-2017-15186"
    ],
    "3.1.11-r0": [
      "CVE-2017-14054",
      "CVE-2017-14055",
      "CVE-2017-14056",
      "CVE-2017-14057",
      "CVE-2017-14058",
      "CVE-2017-14059",
      "CVE-2017-14169",
      "CVE-2017-14170",
      "CVE-2017-14171",
      "CVE-2017-14222",
      "CVE-2017-14223",
      "CVE-2017-14225",
      "CVE-2017-14767"
    ],
    "3.1.10-r0": [
      "CVE-2017-11399",
      "CVE-2017-11665",
      "CVE-2017-11719"
    ],
    "3.1.9-r0": [
      "CVE-2017-9993"
    ],
    "3.1.8-r0": [
      "CVE-2017-9991",
      "CVE-2017-9992",
      "CVE-2017-9994",
      "CVE-2017-9996"
    ],
    "3.1.7-r0": [
      "CVE-2017-5024",
      "CVE-2017-5025"
    ]
  },
  "apkurl": "{{urlprefix}}/{{distroversion}}/{{reponame}}/{{arch}}/{{pkg.name}}-{{pkg.ver}}.apk",
  "archs": [
    "aarch64",
    "armhf",
    "armv7",
    "mips64",
    "mips64el",
    "ppc64le",
    "s390x",
    "x86",
    "x86_64"
  ],
  "urlprefix": "https://dl-cdn.alpinelinux.org/alpine",
  "reponame": "main",
  "distroversion": "v3.5"
}