{
  "name": "xrdp",
  "secfixes": {
    "0.9.18.1-r0": [
      "CVE-2022-23613"
    ],
    "0.9.15-r1": [
      "CVE-2021-36158"
    ],
    "0.9.13.1-r0": [
      "CVE-2020-4044"
    ]
  },
  "apkurl": "{{urlprefix}}/{{distroversion}}/{{reponame}}/{{arch}}/{{pkg.name}}-{{pkg.ver}}.apk",
  "archs": [
    "aarch64",
    "armhf",
    "armv7",
    "mips64",
    "mips64el",
    "ppc64le",
    "s390x",
    "x86",
    "x86_64"
  ],
  "urlprefix": "https://dl-cdn.alpinelinux.org/alpine",
  "reponame": "community",
  "distroversion": "v3.16"
}