{
  "name": "rssh",
  "secfixes": {
    "2.3.4-r2": [
      "CVE-2019-3463",
      "CVE-2019-1000018"
    ],
    "2.3.4-r1": [
      "CVE-2019-3464"
    ]
  },
  "apkurl": "{{urlprefix}}/{{distroversion}}/{{reponame}}/{{arch}}/{{pkg.name}}-{{pkg.ver}}.apk",
  "archs": [
    "aarch64",
    "armhf",
    "armv7",
    "mips64",
    "mips64el",
    "ppc64le",
    "s390x",
    "x86",
    "x86_64"
  ],
  "urlprefix": "https://dl-cdn.alpinelinux.org/alpine",
  "reponame": "main",
  "distroversion": "v3.20"
}