{
  "name": "git-lfs",
  "secfixes": {
    "3.1.2-r4": [
      "CVE-2022-27191"
    ],
    "3.1.2-r3": [
      "CVE-2021-38561"
    ],
    "0": [
      "CVE-2020-27955"
    ]
  },
  "apkurl": "{{urlprefix}}/{{distroversion}}/{{reponame}}/{{arch}}/{{pkg.name}}-{{pkg.ver}}.apk",
  "archs": [
    "aarch64",
    "armhf",
    "armv7",
    "mips64",
    "mips64el",
    "ppc64le",
    "s390x",
    "x86",
    "x86_64"
  ],
  "urlprefix": "https://dl-cdn.alpinelinux.org/alpine",
  "reponame": "community",
  "distroversion": "v3.19"
}