{
  "name": "go",
  "secfixes": {
    "0": [
      "CVE-2022-41716",
      "CVE-2022-41720",
      "CVE-2022-41722",
      "CVE-2024-24787"
    ],
    "1.23.6-r0": [
      "CVE-2025-22866"
    ],
    "1.23.5-r0": [
      "CVE-2024-45336",
      "CVE-2024-45341"
    ],
    "1.23.1-r0": [
      "CVE-2024-34155",
      "CVE-2024-34156",
      "CVE-2024-34158"
    ],
    "1.22.5-r0": [
      "CVE-2024-24791"
    ],
    "1.22.4-r0": [
      "CVE-2024-24789",
      "CVE-2024-24790"
    ],
    "1.22.3-r0": [
      "CVE-2024-24788"
    ],
    "1.22.2-r0": [
      "CVE-2023-45288"
    ],
    "1.22.1-r0": [
      "CVE-2024-24783",
      "CVE-2023-45290",
      "CVE-2023-45289",
      "CVE-2024-24785",
      "CVE-2024-24784"
    ],
    "1.21.5-r0": [
      "CVE-2023-39324",
      "CVE-2023-39326"
    ],
    "1.21.3-r0": [
      "CVE-2023-39325",
      "CVE-2023-44487"
    ],
    "1.21.2-r0": [
      "CVE-2023-39323"
    ],
    "1.21.1-r0": [
      "CVE-2023-39318",
      "CVE-2023-39319",
      "CVE-2023-39320",
      "CVE-2023-39321",
      "CVE-2023-39322"
    ],
    "1.20.7-r0": [
      "CVE-2023-29409"
    ],
    "1.20.6-r0": [
      "CVE-2023-29406"
    ],
    "1.20.5-r0": [
      "CVE-2023-29402",
      "CVE-2023-29403",
      "CVE-2023-29404",
      "CVE-2023-29405"
    ],
    "1.20.4-r0": [
      "CVE-2023-24539",
      "CVE-2023-24540",
      "CVE-2023-29400"
    ],
    "1.20.3-r0": [
      "CVE-2023-24537",
      "CVE-2023-24538",
      "CVE-2023-24534",
      "CVE-2023-24536"
    ],
    "1.20.2-r0": [
      "CVE-2023-24532"
    ],
    "1.20.1-r0": [
      "CVE-2022-41725",
      "CVE-2022-41724",
      "CVE-2022-41723"
    ],
    "1.19.4-r0": [
      "CVE-2022-41717"
    ],
    "1.19.2-r0": [
      "CVE-2022-2879",
      "CVE-2022-2880",
      "CVE-2022-41715"
    ],
    "1.19.1-r0": [
      "CVE-2022-27664",
      "CVE-2022-32190"
    ],
    "1.18.5-r0": [
      "CVE-2022-32189"
    ],
    "1.18.4-r0": [
      "CVE-2022-1705",
      "CVE-2022-1962",
      "CVE-2022-28131",
      "CVE-2022-30630",
      "CVE-2022-30631",
      "CVE-2022-30632",
      "CVE-2022-30633",
      "CVE-2022-30635",
      "CVE-2022-32148"
    ],
    "1.18.1-r0": [
      "CVE-2022-28327",
      "CVE-2022-27536",
      "CVE-2022-24675"
    ],
    "1.17.8-r0": [
      "CVE-2022-24921"
    ],
    "1.17.7-r0": [
      "CVE-2022-23772",
      "CVE-2022-23773",
      "CVE-2022-23806"
    ],
    "1.17.6-r0": [
      "CVE-2021-44716",
      "CVE-2021-44717"
    ],
    "1.17.3-r0": [
      "CVE-2021-41772",
      "CVE-2021-41771"
    ],
    "1.17.2-r0": [
      "CVE-2021-38297"
    ],
    "1.17.1-r0": [
      "CVE-2021-39293"
    ],
    "1.17-r0": [
      "CVE-2020-29509",
      "CVE-2020-29511",
      "CVE-2021-29923"
    ],
    "1.16.7-r0": [
      "CVE-2021-36221"
    ],
    "1.16.6-r0": [
      "CVE-2021-34558"
    ],
    "1.16.5-r0": [
      "CVE-2021-33195",
      "CVE-2021-33196",
      "CVE-2021-33197",
      "CVE-2021-33198"
    ],
    "1.16.4-r0": [
      "CVE-2021-31525"
    ],
    "1.16.2-r0": [
      "CVE-2021-27918",
      "CVE-2021-27919"
    ],
    "1.15.7-r0": [
      "CVE-2021-3114",
      "CVE-2021-3115"
    ],
    "1.15.5-r0": [
      "CVE-2020-28362",
      "CVE-2020-28366",
      "CVE-2020-28367"
    ],
    "1.15.2-r0": [
      "CVE-2020-24553"
    ],
    "1.15-r0": [
      "CVE-2020-16845"
    ],
    "1.14.5-r0": [
      "CVE-2020-15586"
    ],
    "1.13.7-r0": [
      "CVE-2020-7919"
    ],
    "1.13.2-r0": [
      "CVE-2019-17596"
    ],
    "1.13.1-r0": [
      "CVE-2019-16276"
    ],
    "1.12.8-r0": [
      "CVE-2019-9512",
      "CVE-2019-9514",
      "CVE-2019-14809"
    ],
    "1.11.5-r0": [
      "CVE-2019-6486"
    ],
    "1.9.4-r0": [
      "CVE-2018-6574"
    ]
  },
  "apkurl": "{{urlprefix}}/{{distroversion}}/{{reponame}}/{{arch}}/{{pkg.name}}-{{pkg.ver}}.apk",
  "archs": [
    "aarch64",
    "armhf",
    "armv7",
    "mips64",
    "mips64el",
    "ppc64le",
    "s390x",
    "x86",
    "x86_64"
  ],
  "urlprefix": "https://dl-cdn.alpinelinux.org/alpine",
  "reponame": "community",
  "distroversion": "vedge"
}