{
  "name": "sdl2_image",
  "secfixes": {
    "2.0.5-r1": [
      "CVE-2019-13616"
    ],
    "2.0.3-r0": [
      "CVE-2017-12122",
      "CVE-2017-14440",
      "CVE-2017-14441",
      "CVE-2017-14442",
      "CVE-2017-14448",
      "CVE-2017-14449",
      "CVE-2017-14450"
    ]
  },
  "apkurl": "{{urlprefix}}/{{distroversion}}/{{reponame}}/{{arch}}/{{pkg.name}}-{{pkg.ver}}.apk",
  "archs": [
    "aarch64",
    "armhf",
    "armv7",
    "mips64",
    "mips64el",
    "ppc64le",
    "s390x",
    "x86",
    "x86_64"
  ],
  "urlprefix": "https://dl-cdn.alpinelinux.org/alpine",
  "reponame": "community",
  "distroversion": "v3.17"
}