{
  "name": "traefik",
  "secfixes": {
    "2.9.10-r0": [
      "CVE-2023-29013",
      "CVE-2023-24534"
    ],
    "2.9.6-r0": [
      "CVE-2022-23469",
      "CVE-2022-46153"
    ],
    "2.2.8-r0": [
      "CVE-2020-15129"
    ]
  },
  "apkurl": "{{urlprefix}}/{{distroversion}}/{{reponame}}/{{arch}}/{{pkg.name}}-{{pkg.ver}}.apk",
  "archs": [
    "aarch64",
    "armhf",
    "armv7",
    "mips64",
    "mips64el",
    "ppc64le",
    "s390x",
    "x86",
    "x86_64"
  ],
  "urlprefix": "https://dl-cdn.alpinelinux.org/alpine",
  "reponame": "community",
  "distroversion": "v3.18"
}