{
  "name": "sudo",
  "secfixes": {
    "1.8.25_p1-r3": [
      "CVE-2019-14287",
      "CVE-2019-18634"
    ],
    "1.8.20_p2-r0": [
      "CVE-2017-1000368"
    ]
  },
  "apkurl": "{{urlprefix}}/{{distroversion}}/{{reponame}}/{{arch}}/{{pkg.name}}-{{pkg.ver}}.apk",
  "archs": [
    "aarch64",
    "armhf",
    "armv7",
    "mips64",
    "mips64el",
    "ppc64le",
    "s390x",
    "x86",
    "x86_64"
  ],
  "urlprefix": "https://dl-cdn.alpinelinux.org/alpine",
  "reponame": "main",
  "distroversion": "v3.9"
}