{
  "name": "open-vm-tools",
  "secfixes": {
    "12.3.0-r0": [
      "CVE-2023-20900"
    ],
    "12.2.5-r0": [
      "CVE-2023-20867"
    ],
    "12.1.0-r0": [
      "CVE-2022-31676"
    ]
  },
  "apkurl": "{{urlprefix}}/{{distroversion}}/{{reponame}}/{{arch}}/{{pkg.name}}-{{pkg.ver}}.apk",
  "archs": [
    "aarch64",
    "x86",
    "x86_64"
  ],
  "urlprefix": "https://dl-cdn.alpinelinux.org/alpine",
  "reponame": "community",
  "distroversion": "v3.19"
}