{
  "name": "neovim",
  "secfixes": {
    "0.1.6-r1": [
      "CVE-2016-1248"
    ],
    "0.2.0-r0": [
      "CVE-2017-5953",
      "CVE-2017-6349",
      "CVE-2017-6350"
    ]
  },
  "apkurl": "{{urlprefix}}/{{distroversion}}/{{reponame}}/{{arch}}/{{pkg.name}}-{{pkg.ver}}.apk",
  "archs": [
    "armhf",
    "armv7",
    "mips64",
    "mips64el",
    "ppc64le",
    "x86",
    "x86_64"
  ],
  "urlprefix": "https://dl-cdn.alpinelinux.org/alpine",
  "reponame": "community",
  "distroversion": "v3.9"
}