{
  "name": "ghostscript",
  "secfixes": {
    "9.52-r1": [
      "CVE-2020-15900"
    ],
    "9.50-r0": [
      "CVE-2019-14869"
    ],
    "9.27-r4": [
      "CVE-2019-14817"
    ],
    "9.27-r3": [
      "CVE-2019-14811",
      "CVE-2019-14812",
      "CVE-2019-14813"
    ],
    "9.27-r2": [
      "CVE-2019-10216"
    ],
    "9.26-r2": [
      "CVE-2019-3835",
      "CVE-2019-3838",
      "CVE-2019-6116"
    ],
    "9.26-r0": [
      "CVE-2018-19409",
      "CVE-2018-19475",
      "CVE-2018-19476",
      "CVE-2018-19477"
    ],
    "9.25-r1": [
      "CVE-2018-17961",
      "CVE-2018-18073",
      "CVE-2018-18284"
    ],
    "9.25-r0": [
      "CVE-2018-16802"
    ],
    "9.24-r0": [
      "CVE-2018-15908",
      "CVE-2018-15909",
      "CVE-2018-15910",
      "CVE-2018-15911"
    ],
    "9.23-r0": [
      "CVE-2018-10194"
    ],
    "9.21-r2": [
      "CVE-2017-8291"
    ],
    "9.21-r3": [
      "CVE-2017-7207",
      "CVE-2017-5951"
    ]
  },
  "apkurl": "{{urlprefix}}/{{distroversion}}/{{reponame}}/{{arch}}/{{pkg.name}}-{{pkg.ver}}.apk",
  "archs": [
    "aarch64",
    "armhf",
    "armv7",
    "mips64",
    "mips64el",
    "ppc64le",
    "s390x",
    "x86",
    "x86_64"
  ],
  "urlprefix": "https://dl-cdn.alpinelinux.org/alpine",
  "reponame": "main",
  "distroversion": "v3.12"
}