{
  "name": "buildkit",
  "secfixes": {
    "0.12.5-r0": [
      "CVE-2024-23650",
      "CVE-2024-23651",
      "CVE-2024-23652",
      "CVE-2024-23653"
    ]
  },
  "apkurl": "{{urlprefix}}/{{distroversion}}/{{reponame}}/{{arch}}/{{pkg.name}}-{{pkg.ver}}.apk",
  "archs": [
    "aarch64",
    "armhf",
    "armv7",
    "mips64",
    "mips64el",
    "ppc64le",
    "s390x",
    "x86",
    "x86_64"
  ],
  "urlprefix": "https://dl-cdn.alpinelinux.org/alpine",
  "reponame": "community",
  "distroversion": "v3.21"
}