{
  "name": "krb5",
  "secfixes": {
    "1.20.3-r0": [
      "CVE-2024-37370",
      "CVE-2024-37371"
    ],
    "1.20.1-r0": [
      "CVE-2022-42898"
    ],
    "1.19.3-r0": [
      "CVE-2021-37750"
    ],
    "1.18.4-r0": [
      "CVE-2021-36222"
    ],
    "1.18.3-r0": [
      "CVE-2020-28196"
    ],
    "1.15.4-r0": [
      "CVE-2018-20217"
    ],
    "1.15.3-r0": [
      "CVE-2017-15088",
      "CVE-2018-5709",
      "CVE-2018-5710"
    ]
  },
  "apkurl": "{{urlprefix}}/{{distroversion}}/{{reponame}}/{{arch}}/{{pkg.name}}-{{pkg.ver}}.apk",
  "archs": [
    "aarch64",
    "armhf",
    "armv7",
    "mips64",
    "mips64el",
    "ppc64le",
    "s390x",
    "x86",
    "x86_64"
  ],
  "urlprefix": "https://dl-cdn.alpinelinux.org/alpine",
  "reponame": "main",
  "distroversion": "v3.20"
}