{
  "name": "xwayland",
  "secfixes": {
    "23.2.5-r0": [
      "CVE-2024-31080",
      "CVE-2024-31081",
      "CVE-2024-31083"
    ],
    "23.2.4-r0": [
      "CVE-2023-6816",
      "CVE-2024-0229",
      "CVE-2024-21885",
      "CVE-2024-21886",
      "CVE-2024-0408",
      "CVE-2024-0409"
    ],
    "23.2.2-r0": [
      "CVE-2023-5367"
    ],
    "22.1.8-r0": [
      "CVE-2023-0494"
    ],
    "22.1.6-r0": [
      "CVE-2022-4283",
      "CVE-2022-46340",
      "CVE-2022-46341",
      "CVE-2022-46342",
      "CVE-2022-46343",
      "CVE-2022-46344"
    ],
    "21.1.4-r0": [
      "CVE-2021-4008",
      "CVE-2021-4009",
      "CVE-2021-4010",
      "CVE-2021-4011"
    ],
    "21.1.0-r4": [
      "CVE-2021-3472"
    ]
  },
  "apkurl": "{{urlprefix}}/{{distroversion}}/{{reponame}}/{{arch}}/{{pkg.name}}-{{pkg.ver}}.apk",
  "archs": [
    "aarch64",
    "armhf",
    "armv7",
    "mips64",
    "mips64el",
    "ppc64le",
    "s390x",
    "x86",
    "x86_64"
  ],
  "urlprefix": "https://dl-cdn.alpinelinux.org/alpine",
  "reponame": "community",
  "distroversion": "v3.19"
}