{
  "name": "postgresql13",
  "secfixes": {
    "13.14-r0": [
      "CVE-2024-0985"
    ],
    "13.12-r0": [
      "CVE-2023-39418",
      "CVE-2023-39417"
    ],
    "13.11-r0": [
      "CVE-2023-2454",
      "CVE-2023-2455"
    ],
    "13.10-r0": [
      "CVE-2022-41862"
    ],
    "13.8-r0": [
      "CVE-2022-2625"
    ],
    "13.7-r0": [
      "CVE-2022-1552"
    ],
    "13.5-r0": [
      "CVE-2021-23214",
      "CVE-2021-23222"
    ],
    "13.4-r0": [
      "CVE-2021-3677"
    ],
    "13.3-r0": [
      "CVE-2021-32027",
      "CVE-2021-32028",
      "CVE-2021-32029"
    ],
    "13.2-r0": [
      "CVE-2021-3393",
      "CVE-2021-20229"
    ]
  },
  "apkurl": "{{urlprefix}}/{{distroversion}}/{{reponame}}/{{arch}}/{{pkg.name}}-{{pkg.ver}}.apk",
  "archs": [
    "aarch64",
    "armhf",
    "armv7",
    "mips64",
    "mips64el",
    "ppc64le",
    "s390x",
    "x86",
    "x86_64"
  ],
  "urlprefix": "https://dl-cdn.alpinelinux.org/alpine",
  "reponame": "main",
  "distroversion": "v3.16"
}