{
  "name": "xen",
  "secfixes": {
    "4.7.0-r0": [
      "CVE-2016-6258",
      "CVE-2016-6259",
      "CVE-2016-5403"
    ],
    "4.7.0-r1": [
      "CVE-2016-7092",
      "CVE-2016-7093",
      "CVE-2016-7094"
    ],
    "4.7.0-r5": [
      "CVE-2016-7777"
    ],
    "4.7.1-r1": [
      "CVE-2016-9386",
      "CVE-2016-9382",
      "CVE-2016-9385",
      "CVE-2016-9384",
      "CVE-2016-9383",
      "CVE-2016-9377",
      "CVE-2016-9378",
      "CVE-2016-9381",
      "CVE-2016-9379",
      "CVE-2016-9380"
    ],
    "4.7.1-r3": [
      "CVE-2016-9932",
      "CVE-2016-9815",
      "CVE-2016-9816",
      "CVE-2016-9817",
      "CVE-2016-9818"
    ],
    "4.7.1-r4": [
      "CVE-2016-10024",
      "CVE-2016-10025",
      "CVE-2016-10013"
    ],
    "4.7.1-r5": [

    ],
    "- XSA-207": [
      "CVE-2017-2615",
      "CVE-2017-2620"
    ],
    "- XSA-210": [

    ],
    "4.7.2-r0": [
      "CVE-2016-9603",
      "CVE-2017-7228"
    ],
    "4.8.1-r2": [
      "CVE-2017-8903",
      "CVE-2017-8904"
    ],
    "4.9.0-r0": [
      "CVE-2017-10911",
      "CVE-2017-10912",
      "CVE-2017-10913",
      "CVE-2017-10914",
      "CVE-2017-10915",
      "CVE-2017-10916",
      "CVE-2017-10917",
      "CVE-2017-10918",
      "CVE-2017-10919",
      "CVE-2017-10920",
      "CVE-2017-10921",
      "CVE-2017-10922",
      "CVE-2017-10923"
    ],
    "4.9.0-r1": [
      "CVE-2017-12135",
      "CVE-2017-12137",
      "CVE-2017-12136",
      "CVE-2017-12855"
    ],
    "4.9.0-r2": [

    ],
    "- XSA-235": [

    ],
    "4.9.0-r4": [
      "CVE-2017-14316",
      "CVE-2017-14318",
      "CVE-2017-14317",
      "CVE-2017-14319"
    ],
    "4.9.0-r5": [

    ],
    "- XSA-245": [

    ],
    "4.9.0-r6": [
      "CVE-2017-15590"
    ],
    "- XSA-238": [
      "CVE-2017-15589",
      "CVE-2017-15595",
      "CVE-2017-15588",
      "CVE-2017-15593",
      "CVE-2017-15592",
      "CVE-2017-15594"
    ],
    "4.9.0-r7": [
      "CVE-2017-15597"
    ],
    "4.9.1-r1": [

    ],
    "- XSA-246": [

    ],
    "- XSA-247": [

    ],
    "4.10.0-r1": [

    ],
    "- XSA-248": [

    ],
    "- XSA-249": [

    ],
    "- XSA-250": [

    ],
    "- XSA-251": [

    ],
    "- XSA-253": [

    ],
    "- XSA-254": [

    ],
    "4.10.0-r2": [
      "CVE-2018-7540",
      "CVE-2018-7541",
      "CVE-2018-7542"
    ],
    "4.10.1-r0": [
      "CVE-2018-10472",
      "CVE-2018-10471"
    ],
    "4.10.1-r1": [
      "CVE-2018-8897",
      "CVE-2018-10982",
      "CVE-2018-10981"
    ],
    "4.11.0-r0": [
      "CVE-2018-3639",
      "CVE-2018-12891",
      "CVE-2018-12893",
      "CVE-2018-12892",
      "CVE-2018-3665"
    ],
    "4.11.1-r0": [
      "CVE-2018-15469",
      "CVE-2018-15468",
      "CVE-2018-15470",
      "CVE-2018-3620",
      "CVE-2018-3646",
      "CVE-2018-19961",
      "CVE-2018-19962",
      "CVE-2018-19963",
      "CVE-2018-19964",
      "CVE-2018-18883",
      "CVE-2018-19965",
      "CVE-2018-19966",
      "CVE-2018-19967"
    ],
    "4.12.0-r2": [
      "CVE-2018-12126",
      "CVE-2018-12127",
      "CVE-2018-12130",
      "CVE-2019-11091"
    ],
    "4.12.1-r0": [
      "CVE-2019-17350"
    ],
    "4.12.1-r1": [
      "CVE-2019-18425",
      "CVE-2019-18421",
      "CVE-2019-18423",
      "CVE-2019-18424",
      "CVE-2019-18422",
      "CVE-2018-12207",
      "CVE-2019-11135"
    ],
    "4.12.2-r0": [
      "CVE-2019-19579",
      "CVE-2019-19582",
      "CVE-2019-19583",
      "CVE-2019-19578",
      "CVE-2019-19580",
      "CVE-2019-19577"
    ],
    "4.12.2-r1": [
      "CVE-2020-11741",
      "CVE-2020-11739",
      "CVE-2020-11743",
      "CVE-2020-11742"
    ],
    "4.12.3-r0": [

    ],
    "- XSA-312": [

    ],
    "4.12.3-r1": [
      "CVE-2020-0543"
    ],
    "4.12.3-r2": [
      "CVE-2020-15566",
      "CVE-2020-15563",
      "CVE-2020-15565",
      "CVE-2020-15564",
      "CVE-2020-15567"
    ],
    "4.12.3-r3": [
      "CVE-2020-14364"
    ],
    "4.12.3-r4": [
      "CVE-2020-25602",
      "CVE-2020-25598",
      "CVE-2020-25604",
      "CVE-2020-25595",
      "CVE-2020-25597",
      "CVE-2020-25596",
      "CVE-2020-25603",
      "CVE-2020-25600",
      "CVE-2020-25599",
      "CVE-2020-25601"
    ],
    "4.12.4-r0": [
      "CVE-2020-27674",
      "CVE-2020-27672",
      "CVE-2020-27671",
      "CVE-2020-27670",
      "CVE-2020-28368",
      "CVE-2020-29040"
    ]
  },
  "apkurl": "{{urlprefix}}/{{distroversion}}/{{reponame}}/{{arch}}/{{pkg.name}}-{{pkg.ver}}.apk",
  "archs": [
    "aarch64",
    "armhf",
    "x86_64"
  ],
  "urlprefix": "https://dl-cdn.alpinelinux.org/alpine",
  "reponame": "main",
  "distroversion": "v3.10"
}