{
  "name": "sudo",
  "secfixes": {
    "1.9.12_p2-r0": [
      "CVE-2023-22809"
    ],
    "1.9.12-r1": [
      "CVE-2022-43995"
    ],
    "1.9.5p2-r0": [
      "CVE-2021-3156"
    ],
    "1.9.5-r0": [
      "CVE-2021-23239",
      "CVE-2021-23240"
    ],
    "1.8.31-r0": [
      "CVE-2019-18634"
    ],
    "1.8.28-r0": [
      "CVE-2019-14287"
    ],
    "1.8.20_p2-r0": [
      "CVE-2017-1000368"
    ]
  },
  "apkurl": "{{urlprefix}}/{{distroversion}}/{{reponame}}/{{arch}}/{{pkg.name}}-{{pkg.ver}}.apk",
  "archs": [
    "aarch64",
    "armhf",
    "armv7",
    "mips64",
    "mips64el",
    "ppc64le",
    "s390x",
    "x86",
    "x86_64"
  ],
  "urlprefix": "https://dl-cdn.alpinelinux.org/alpine",
  "reponame": "main",
  "distroversion": "v3.14"
}