{
  "name": "qt6-qtwebengine",
  "secfixes": {
    "6.6.3-r6": [
      "CVE-2024-5496",
      "CVE-2024-5499"
    ],
    "6.6.3-r5": [
      "CVE-2024-5274"
    ],
    "6.6.3-r4": [
      "CVE-2024-3840",
      "CVE-2024-4558",
      "CVE-2024-4671"
    ],
    "6.6.3-r3": [
      "CVE-2024-3837",
      "CVE-2024-3839",
      "CVE-2024-3914",
      "CVE-2024-4058",
      "CVE-2024-4331"
    ],
    "6.6.3-r2": [
      "CVE-2024-2625",
      "CVE-2024-2626",
      "CVE-2024-2887",
      "CVE-2024-3157",
      "CVE-2024-3159",
      "CVE-2024-3516"
    ],
    "6.6.3-r1": [
      "CVE-2023-7104",
      "CVE-2024-25062"
    ],
    "6.6.2-r1": [
      "CVE-2024-1670",
      "CVE-2024-1671",
      "CVE-2024-1672",
      "CVE-2024-1676"
    ],
    "6.6.1-r8": [
      "CVE-2024-1059",
      "CVE-2024-1060",
      "CVE-2024-1077",
      "CVE-2024-1283",
      "CVE-2024-1284"
    ],
    "6.6.1-r7": [
      "CVE-2024-0807",
      "CVE-2024-0808",
      "CVE-2024-0810"
    ],
    "6.6.1-r5": [
      "CVE-2024-0518",
      "CVE-2024-0519"
    ],
    "6.6.1-r4": [
      "CVE-2023-7024",
      "CVE-2024-0222",
      "CVE-2024-0223",
      "CVE-2024-0224",
      "CVE-2024-0225",
      "CVE-2024-0333"
    ],
    "6.6.1-r3": [
      "CVE-2023-6702",
      "CVE-2023-6703",
      "CVE-2023-6705",
      "CVE-2023-6706"
    ],
    "6.6.1-r2": [
      "CVE-2023-6510"
    ],
    "6.6.1-r1": [
      "CVE-2023-6345",
      "CVE-2023-6346",
      "CVE-2023-6347"
    ],
    "6.6.0-r6": [
      "CVE-2023-5997",
      "CVE-2023-6112"
    ],
    "6.6.0-r5": [
      "CVE-2023-5996"
    ],
    "6.6.0-r2": [
      "CVE-2023-5482",
      "CVE-2023-5849"
    ],
    "6.6.0-r1": [
      "CVE-2023-5218",
      "CVE-2023-5474",
      "CVE-2023-5475",
      "CVE-2023-5476",
      "CVE-2023-5484",
      "CVE-2023-5486",
      "CVE-2023-5487",
      "CVE-2023-45853"
    ]
  },
  "apkurl": "{{urlprefix}}/{{distroversion}}/{{reponame}}/{{arch}}/{{pkg.name}}-{{pkg.ver}}.apk",
  "archs": [
    "aarch64",
    "armv7",
    "mips64",
    "mips64el",
    "x86",
    "x86_64"
  ],
  "urlprefix": "https://dl-cdn.alpinelinux.org/alpine",
  "reponame": "community",
  "distroversion": "v3.20"
}