{
  "name": "ruby2.2",
  "secfixes": {
    "2.2.8-r0": [
      "CVE-2017-0898",
      "CVE-2017-10784",
      "CVE-2017-14033",
      "CVE-2017-14064",
      "CVE-2017-0899",
      "CVE-2017-0900",
      "CVE-2017-0901",
      "CVE-2017-0902"
    ],
    "": [

    ]
  },
  "apkurl": "{{urlprefix}}/{{distroversion}}/{{reponame}}/{{arch}}/{{pkg.name}}-{{pkg.ver}}.apk",
  "archs": [
    "aarch64",
    "armhf",
    "armv7",
    "mips64",
    "mips64el",
    "ppc64le",
    "s390x",
    "x86",
    "x86_64"
  ],
  "urlprefix": "https://dl-cdn.alpinelinux.org/alpine",
  "reponame": "community",
  "distroversion": "v3.5"
}