{
  "name": "rust",
  "secfixes": {
    "1.56.1-r0": [
      "CVE-2021-42574"
    ],
    "1.52.1-r1": [
      "CVE-2021-29922"
    ],
    "1.51.0-r2": [
      "CVE-2020-36323",
      "CVE-2021-31162"
    ],
    "1.34.2-r0": [
      "CVE-2019-12083"
    ],
    "1.26.0-r0": [
      "CVE-2019-16760"
    ]
  },
  "apkurl": "{{urlprefix}}/{{distroversion}}/{{reponame}}/{{arch}}/{{pkg.name}}-{{pkg.ver}}.apk",
  "archs": [
    "aarch64",
    "armhf",
    "armv7",
    "mips64",
    "mips64el",
    "ppc64le",
    "s390x",
    "x86",
    "x86_64"
  ],
  "urlprefix": "https://dl-cdn.alpinelinux.org/alpine",
  "reponame": "community",
  "distroversion": "v3.17"
}