{
  "name": "xen",
  "secfixes": {
    "0": [
      "CVE-2020-29568",
      "CVE-2020-29569",
      "CVE-2022-21127",
      "CVE-2023-46840"
    ],
    "4.7.0-r0": [
      "CVE-2016-6258",
      "CVE-2016-6259",
      "CVE-2016-5403"
    ],
    "4.7.0-r1": [
      "CVE-2016-7092",
      "CVE-2016-7093",
      "CVE-2016-7094"
    ],
    "4.7.0-r5": [
      "CVE-2016-7777"
    ],
    "4.7.1-r1": [
      "CVE-2016-9386",
      "CVE-2016-9382",
      "CVE-2016-9385",
      "CVE-2016-9384",
      "CVE-2016-9383",
      "CVE-2016-9377",
      "CVE-2016-9378",
      "CVE-2016-9381",
      "CVE-2016-9379",
      "CVE-2016-9380"
    ],
    "4.7.1-r3": [
      "CVE-2016-9932",
      "CVE-2016-9815",
      "CVE-2016-9816",
      "CVE-2016-9817",
      "CVE-2016-9818"
    ],
    "4.7.1-r4": [
      "CVE-2016-10024",
      "CVE-2016-10025",
      "CVE-2016-10013"
    ],
    "4.7.1-r5": [

    ],
    "- XSA-207": [
      "CVE-2017-2615",
      "CVE-2017-2620"
    ],
    "- XSA-210": [

    ],
    "4.7.2-r0": [
      "CVE-2016-9603",
      "CVE-2017-7228"
    ],
    "4.8.1-r2": [
      "CVE-2017-8903",
      "CVE-2017-8904"
    ],
    "4.9.0-r0": [
      "CVE-2017-10911",
      "CVE-2017-10912",
      "CVE-2017-10913",
      "CVE-2017-10914",
      "CVE-2017-10915",
      "CVE-2017-10916",
      "CVE-2017-10917",
      "CVE-2017-10918",
      "CVE-2017-10919",
      "CVE-2017-10920",
      "CVE-2017-10921",
      "CVE-2017-10922",
      "CVE-2017-10923"
    ],
    "4.9.0-r1": [
      "CVE-2017-12135",
      "CVE-2017-12137",
      "CVE-2017-12136",
      "CVE-2017-12855"
    ],
    "4.9.0-r2": [

    ],
    "- XSA-235": [

    ],
    "4.9.0-r4": [
      "CVE-2017-14316",
      "CVE-2017-14318",
      "CVE-2017-14317",
      "CVE-2017-14319"
    ],
    "4.9.0-r5": [

    ],
    "- XSA-245": [

    ],
    "4.9.0-r6": [
      "CVE-2017-15590"
    ],
    "- XSA-238": [
      "CVE-2017-15589",
      "CVE-2017-15595",
      "CVE-2017-15588",
      "CVE-2017-15593",
      "CVE-2017-15592",
      "CVE-2017-15594"
    ],
    "4.9.0-r7": [
      "CVE-2017-15597"
    ],
    "4.9.1-r1": [

    ],
    "- XSA-246": [

    ],
    "- XSA-247": [

    ],
    "4.10.0-r1": [

    ],
    "- XSA-248": [

    ],
    "- XSA-249": [

    ],
    "- XSA-250": [

    ],
    "- XSA-251": [
      "CVE-2018-5244"
    ],
    "- XSA-254": [

    ],
    "4.10.0-r2": [
      "CVE-2018-7540",
      "CVE-2018-7541",
      "CVE-2018-7542"
    ],
    "4.10.1-r0": [
      "CVE-2018-10472",
      "CVE-2018-10471"
    ],
    "4.10.1-r1": [
      "CVE-2018-8897",
      "CVE-2018-10982",
      "CVE-2018-10981"
    ],
    "4.11.0-r0": [
      "CVE-2018-3639",
      "CVE-2018-12891",
      "CVE-2018-12893",
      "CVE-2018-12892",
      "CVE-2018-3665"
    ],
    "4.11.1-r0": [
      "CVE-2018-15469",
      "CVE-2018-15468",
      "CVE-2018-15470",
      "CVE-2018-3620",
      "CVE-2018-3646",
      "CVE-2018-19961",
      "CVE-2018-19962",
      "CVE-2018-19963",
      "CVE-2018-19964",
      "CVE-2018-18883",
      "CVE-2018-19965",
      "CVE-2018-19966",
      "CVE-2018-19967"
    ],
    "4.12.0-r2": [
      "CVE-2018-12126",
      "CVE-2018-12127",
      "CVE-2018-12130",
      "CVE-2019-11091"
    ],
    "4.12.1-r0": [
      "CVE-2019-17350"
    ],
    "4.13.0-r0": [
      "CVE-2019-18425",
      "CVE-2019-18421",
      "CVE-2019-18423",
      "CVE-2019-18424",
      "CVE-2019-18422",
      "CVE-2018-12207",
      "CVE-2019-11135",
      "CVE-2019-19579",
      "CVE-2019-19582",
      "CVE-2019-19583",
      "CVE-2019-19578",
      "CVE-2019-19580",
      "CVE-2019-19577"
    ],
    "4.13.0-r3": [
      "CVE-2020-11741",
      "CVE-2020-11739",
      "CVE-2020-11743",
      "CVE-2020-11742"
    ],
    "4.13.1-r0": [

    ],
    "- XSA-312": [

    ],
    "4.13.1-r3": [
      "CVE-2020-0543"
    ],
    "4.13.1-r4": [
      "CVE-2020-15566",
      "CVE-2020-15563",
      "CVE-2020-15565",
      "CVE-2020-15564",
      "CVE-2020-15567"
    ],
    "4.13.1-r5": [
      "CVE-2020-14364"
    ],
    "4.14.0-r1": [
      "CVE-2020-25602",
      "CVE-2020-25598",
      "CVE-2020-25604",
      "CVE-2020-25595",
      "CVE-2020-25597",
      "CVE-2020-25596",
      "CVE-2020-25603",
      "CVE-2020-25600",
      "CVE-2020-25599",
      "CVE-2020-25601"
    ],
    "4.14.0-r2": [
      "CVE-2020-27674",
      "CVE-2020-27672",
      "CVE-2020-27671",
      "CVE-2020-27670",
      "CVE-2020-28368"
    ],
    "4.14.0-r3": [
      "CVE-2020-29040"
    ],
    "4.14.1-r0": [
      "CVE-2020-29480",
      "CVE-2020-29481",
      "CVE-2020-29482",
      "CVE-2020-29484",
      "CVE-2020-29483",
      "CVE-2020-29485",
      "CVE-2020-29566",
      "CVE-2020-29486",
      "CVE-2020-29479",
      "CVE-2020-29567",
      "CVE-2020-29570",
      "CVE-2020-29571"
    ],
    "4.14.1-r2": [
      "CVE-2021-3308"
    ],
    "4.14.1-r3": [
      "CVE-2021-26933"
    ],
    "4.15.0-r0": [
      "CVE-2021-28687"
    ],
    "4.15.0-r1": [
      "CVE-2021-28693",
      "CVE-2021-28692",
      "CVE-2021-0089",
      "CVE-2021-28690"
    ],
    "4.15.0-r2": [
      "CVE-2021-28694",
      "CVE-2021-28695",
      "CVE-2021-28696",
      "CVE-2021-28697",
      "CVE-2021-28698",
      "CVE-2021-28699",
      "CVE-2021-28700"
    ],
    "4.15.0-r3": [
      "CVE-2021-28701"
    ],
    "4.15.1-r1": [
      "CVE-2021-28702",
      "CVE-2021-28703",
      "CVE-2021-28710"
    ],
    "4.15.1-r2": [
      "CVE-2021-28704",
      "CVE-2021-28707",
      "CVE-2021-28708",
      "CVE-2021-28705",
      "CVE-2021-28709"
    ],
    "4.16.1-r0": [
      "CVE-2022-23033",
      "CVE-2022-23034",
      "CVE-2022-23035",
      "CVE-2022-26356"
    ],
    "- XSA-398": [
      "CVE-2022-26357",
      "CVE-2022-26358",
      "CVE-2022-26359",
      "CVE-2022-26360",
      "CVE-2022-26361"
    ],
    "4.16.1-r2": [
      "CVE-2022-26362",
      "CVE-2022-26363",
      "CVE-2022-26364"
    ],
    "4.16.1-r3": [
      "CVE-2022-21123",
      "CVE-2022-21125",
      "CVE-2022-21166"
    ],
    "4.16.1-r4": [
      "CVE-2022-26365",
      "CVE-2022-33740",
      "CVE-2022-33741",
      "CVE-2022-33742"
    ],
    "4.16.1-r5": [
      "CVE-2022-23816",
      "CVE-2022-23825",
      "CVE-2022-29900"
    ],
    "4.16.1-r6": [
      "CVE-2022-33745"
    ],
    "4.16.2-r1": [
      "CVE-2022-42327",
      "CVE-2022-42309"
    ],
    "4.16.2-r2": [
      "CVE-2022-23824"
    ],
    "4.17.0-r0": [
      "CVE-2022-42311",
      "CVE-2022-42312",
      "CVE-2022-42313",
      "CVE-2022-42314",
      "CVE-2022-42315",
      "CVE-2022-42316",
      "CVE-2022-42317",
      "CVE-2022-42318",
      "CVE-2022-33747",
      "CVE-2022-33746",
      "CVE-2022-33748",
      "CVE-2022-33749",
      "CVE-2022-42310",
      "CVE-2022-42319",
      "CVE-2022-42320",
      "CVE-2022-42321",
      "CVE-2022-42322",
      "CVE-2022-42323",
      "CVE-2022-42324",
      "CVE-2022-42325",
      "CVE-2022-42326"
    ],
    "4.17.0-r2": [
      "CVE-2022-42330",
      "CVE-2022-27672"
    ],
    "4.17.0-r5": [
      "CVE-2022-42332",
      "CVE-2022-43334",
      "CVE-2022-42331",
      "CVE-2022-42335"
    ],
    "4.17.1-r1": [
      "CVE-2022-42336"
    ],
    "4.17.1-r3": [
      "CVE-2023-20593"
    ],
    "4.17.1-r5": [
      "CVE-2023-34320"
    ],
    "4.17.2-r0": [
      "CVE-2023-20569",
      "CVE-2022-40982"
    ],
    "4.17.2-r1": [
      "CVE-2023-34321",
      "CVE-2023-34322"
    ],
    "4.17.2-r2": [
      "CVE-2023-20588"
    ],
    "4.17.2-r3": [
      "CVE-2023-34323",
      "CVE-2023-34326",
      "CVE-2023-34325",
      "CVE-2023-34327",
      "CVE-2023-34328"
    ],
    "4.17.2-r4": [
      "CVE-2023-46835",
      "CVE-2023-46836"
    ],
    "4.18.0-r2": [
      "CVE-2023-46837"
    ],
    "4.18.0-r3": [
      "CVE-2023-46839"
    ],
    "4.18.0-r4": [
      "CVE-2023-46841"
    ],
    "4.18.0-r5": [
      "CVE-2023-28746",
      "CVE-2024-2193"
    ],
    "4.18.2-r0": [
      "CVE-2023-46842",
      "CVE-2024-31142",
      "CVE-2024-2201"
    ],
    "4.19.0-r0": [
      "CVE-2024-31143",
      "CVE-2024-31145",
      "CVE-2024-45817"
    ],
    "4.19.0-r1": [
      "CVE-2024-45818",
      "CVE-2024-45819"
    ],
    "4.19.1-r1": [
      "CVE-2025-1713"
    ]
  },
  "apkurl": "{{urlprefix}}/{{distroversion}}/{{reponame}}/{{arch}}/{{pkg.name}}-{{pkg.ver}}.apk",
  "archs": [
    "aarch64",
    "armv7",
    "x86_64"
  ],
  "urlprefix": "https://dl-cdn.alpinelinux.org/alpine",
  "reponame": "main",
  "distroversion": "vedge"
}