{
  "name": "avahi",
  "secfixes": {
    "0.8-r16": [
      "CVE-2023-38470"
    ],
    "0.8-r15": [
      "CVE-2023-38469",
      "CVE-2023-38471"
    ],
    "0.8-r14": [
      "CVE-2023-1981",
      "CVE-2023-38472",
      "CVE-2023-38473"
    ],
    "0.8-r5": [
      "CVE-2021-3502"
    ],
    "0.8-r4": [
      "CVE-2021-3468"
    ],
    "0.7-r2": [
      "CVE-2017-6519",
      "CVE-2018-1000845"
    ],
    "0": [
      "CVE-2021-26720"
    ]
  },
  "apkurl": "{{urlprefix}}/{{distroversion}}/{{reponame}}/{{arch}}/{{pkg.name}}-{{pkg.ver}}.apk",
  "archs": [
    "aarch64",
    "armhf",
    "armv7",
    "mips64",
    "mips64el",
    "ppc64le",
    "s390x",
    "x86",
    "x86_64"
  ],
  "urlprefix": "https://dl-cdn.alpinelinux.org/alpine",
  "reponame": "main",
  "distroversion": "v3.21"
}