{
  "name": "frr",
  "secfixes": {
    "8.2.1-r0": [
      "CVE-2022-26125",
      "CVE-2022-26126",
      "CVE-2022-26127",
      "CVE-2022-26128",
      "CVE-2022-26129"
    ]
  },
  "apkurl": "{{urlprefix}}/{{distroversion}}/{{reponame}}/{{arch}}/{{pkg.name}}-{{pkg.ver}}.apk",
  "archs": [
    "aarch64",
    "armhf",
    "armv7",
    "mips64",
    "mips64el",
    "ppc64le",
    "s390x",
    "x86",
    "x86_64"
  ],
  "urlprefix": "https://dl-cdn.alpinelinux.org/alpine",
  "reponame": "community",
  "distroversion": "v3.16"
}