{
  "name": "python2",
  "secfixes": {
    "2.7.18-r0": [
      "CVE-2019-18348"
    ],
    "2.7.17-r0": [
      "CVE-2019-15903"
    ],
    "2.7.16-r1": [
      "CVE-2019-9636",
      "CVE-2019-9948"
    ],
    "2.7.16-r0": [
      "CVE-2018-14647"
    ],
    "2.7.15-r3": [
      "CVE-2019-5010"
    ],
    "2.7.15-r0": [
      "CVE-2018-1060",
      "CVE-2018-1061"
    ]
  },
  "apkurl": "{{urlprefix}}/{{distroversion}}/{{reponame}}/{{arch}}/{{pkg.name}}-{{pkg.ver}}.apk",
  "archs": [
    "aarch64",
    "armhf",
    "armv7",
    "mips64",
    "mips64el",
    "ppc64le",
    "s390x",
    "x86",
    "x86_64"
  ],
  "urlprefix": "https://dl-cdn.alpinelinux.org/alpine",
  "reponame": "main",
  "distroversion": "v3.9"
}