{
  "name": "libmad",
  "secfixes": {
    "0.15.1b-r9": [
      "CVE-2017-8372",
      "CVE-2017-8373",
      "CVE-2017-8374",
      "CVE-2017-11552",
      "CVE-2018-7263"
    ]
  },
  "apkurl": "{{urlprefix}}/{{distroversion}}/{{reponame}}/{{arch}}/{{pkg.name}}-{{pkg.ver}}.apk",
  "archs": [
    "aarch64",
    "armhf",
    "armv7",
    "mips64",
    "mips64el",
    "ppc64le",
    "s390x",
    "x86",
    "x86_64"
  ],
  "urlprefix": "https://dl-cdn.alpinelinux.org/alpine",
  "reponame": "community",
  "distroversion": "v3.14"
}