{
  "name": "consul",
  "secfixes": {
    "1.14.1-r0": [
      "CVE-2022-3920"
    ],
    "1.13.2-r0": [
      "CVE-2021-41803",
      "CVE-2022-40716"
    ],
    "1.11.3-r0": [
      "CVE-2022-24687"
    ],
    "1.11.1-r0": [
      "CVE-2021-44761"
    ],
    "1.9.5-r0": [
      "CVE-2020-25864",
      "CVE-2021-28156"
    ]
  },
  "apkurl": "{{urlprefix}}/{{distroversion}}/{{reponame}}/{{arch}}/{{pkg.name}}-{{pkg.ver}}.apk",
  "archs": [
    "aarch64",
    "armhf",
    "armv7",
    "mips64",
    "mips64el",
    "ppc64le",
    "s390x",
    "x86",
    "x86_64"
  ],
  "urlprefix": "https://dl-cdn.alpinelinux.org/alpine",
  "reponame": "community",
  "distroversion": "v3.17"
}