{
  "name": "openjpeg",
  "secfixes": {
    "2.5.0-r0": [
      "CVE-2021-3575",
      "CVE-2022-1122"
    ],
    "2.4.0-r1": [
      "CVE-2021-29338"
    ],
    "2.4.0-r0": [
      "CVE-2020-27844"
    ],
    "2.3.1-r6": [
      "CVE-2020-27814",
      "CVE-2020-27823",
      "CVE-2020-27824"
    ],
    "2.3.1-r5": [
      "CVE-2019-12973",
      "CVE-2020-15389"
    ],
    "2.3.1-r3": [
      "CVE-2020-6851",
      "CVE-2020-8112"
    ],
    "2.3.0-r3": [
      "CVE-2018-5785"
    ],
    "2.3.0-r2": [
      "CVE-2018-14423",
      "CVE-2018-6616"
    ],
    "2.3.0-r1": [
      "CVE-2017-17480",
      "CVE-2018-18088"
    ],
    "2.3.0-r0": [
      "CVE-2017-14039"
    ],
    "2.2.0-r2": [
      "CVE-2017-14040",
      "CVE-2017-14041",
      "CVE-2017-14151",
      "CVE-2017-14152",
      "CVE-2017-14164"
    ],
    "2.2.0-r1": [
      "CVE-2017-12982"
    ],
    "2.1.2-r1": [
      "CVE-2016-9580",
      "CVE-2016-9581"
    ]
  },
  "apkurl": "{{urlprefix}}/{{distroversion}}/{{reponame}}/{{arch}}/{{pkg.name}}-{{pkg.ver}}.apk",
  "archs": [
    "aarch64",
    "armhf",
    "armv7",
    "mips64",
    "mips64el",
    "ppc64le",
    "s390x",
    "x86",
    "x86_64"
  ],
  "urlprefix": "https://dl-cdn.alpinelinux.org/alpine",
  "reponame": "main",
  "distroversion": "v3.17"
}