{
  "name": "libreoffice",
  "secfixes": {
    "7.6.7.2-r0": [
      "CVE-2024-3044"
    ],
    "7.3.6.2-r0": [
      "CVE-2022-3140"
    ],
    "7.2.7.2-r0": [
      "CVE-2022-26305",
      "CVE-2022-26306",
      "CVE-2022-26307"
    ],
    "7.2.5.2-r0": [
      "CVE-2021-25636"
    ],
    "7.2.2.2-r0": [
      "CVE-2021-25631",
      "CVE-2021-25632",
      "CVE-2021-25633",
      "CVE-2021-25634",
      "CVE-2021-25635"
    ],
    "6.4.4.2-r0": [
      "CVE-2020-12802",
      "CVE-2020-12803"
    ],
    "6.4.3.2-r0": [
      "CVE-2020-12801"
    ],
    "6.3.1.2-r0": [
      "CVE-2019-9854",
      "CVE-2019-9855"
    ],
    "6.3.0.4-r0": [
      "CVE-2019-9850",
      "CVE-2019-9851",
      "CVE-2019-9852"
    ],
    "6.2.5.2-r0": [
      "CVE-2019-9848",
      "CVE-2019-9849"
    ]
  },
  "apkurl": "{{urlprefix}}/{{distroversion}}/{{reponame}}/{{arch}}/{{pkg.name}}-{{pkg.ver}}.apk",
  "archs": [
    "aarch64",
    "armv7",
    "mips64",
    "mips64el",
    "x86",
    "x86_64"
  ],
  "urlprefix": "https://dl-cdn.alpinelinux.org/alpine",
  "reponame": "community",
  "distroversion": "vedge"
}