{
  "name": "vim",
  "secfixes": {
    "8.2.4836-r0": [
      "CVE-2022-1381"
    ],
    "8.2.4708-r0": [
      "CVE-2022-1154",
      "CVE-2022-1160"
    ],
    "8.2.4619-r0": [
      "CVE-2022-0943",
      "CVE-2022-0572",
      "CVE-2022-0629",
      "CVE-2022-0685",
      "CVE-2022-0696",
      "CVE-2022-0714",
      "CVE-2022-0729",
      "CVE-2022-0359",
      "CVE-2022-0361",
      "CVE-2022-0368",
      "CVE-2022-0392",
      "CVE-2022-0393",
      "CVE-2022-0407",
      "CVE-2022-0408",
      "CVE-2022-0413",
      "CVE-2022-0417",
      "CVE-2022-0443"
    ],
    "8.2.4173-r0": [
      "CVE-2021-4069",
      "CVE-2021-4136",
      "CVE-2021-4166",
      "CVE-2021-4173",
      "CVE-2021-4187",
      "CVE-2021-4192",
      "CVE-2021-4193",
      "CVE-2021-46059",
      "CVE-2022-0128",
      "CVE-2022-0156",
      "CVE-2022-0158",
      "CVE-2022-0213"
    ],
    "8.2.3779-r0": [
      "CVE-2021-4019"
    ],
    "8.2.3650-r0": [
      "CVE-2021-3927",
      "CVE-2021-3928",
      "CVE-2021-3968",
      "CVE-2021-3973",
      "CVE-2021-3974",
      "CVE-2021-3984"
    ],
    "8.2.3567-r0": [
      "CVE-2021-3903"
    ],
    "8.2.3500-r0": [
      "CVE-2021-3875"
    ],
    "8.2.3437-r0": [
      "CVE-2021-3770",
      "CVE-2021-3778",
      "CVE-2021-3796"
    ],
    "8.1.1365-r0": [
      "CVE-2019-12735"
    ],
    "8.0.1521-r0": [
      "CVE-2017-6350",
      "CVE-2017-6349"
    ],
    "8.0.0329-r0": [
      "CVE-2017-5953"
    ],
    "8.0.0056-r0": [
      "CVE-2016-1248"
    ]
  },
  "apkurl": "{{urlprefix}}/{{distroversion}}/{{reponame}}/{{arch}}/{{pkg.name}}-{{pkg.ver}}.apk",
  "archs": [
    "aarch64",
    "armhf",
    "armv7",
    "mips64",
    "mips64el",
    "ppc64le",
    "s390x",
    "x86",
    "x86_64"
  ],
  "urlprefix": "https://dl-cdn.alpinelinux.org/alpine",
  "reponame": "main",
  "distroversion": "v3.14"
}