{
  "name": "exiv2",
  "secfixes": {
    "0.27.5-r0": [
      "CVE-2021-32815",
      "CVE-2021-34334",
      "CVE-2021-34335",
      "CVE-2021-37615",
      "CVE-2021-37616",
      "CVE-2021-37618",
      "CVE-2021-37619",
      "CVE-2021-37620",
      "CVE-2021-37621",
      "CVE-2021-37622",
      "CVE-2021-37623"
    ],
    "0.27.4-r0": [
      "CVE-2021-29464"
    ],
    "0.27.3-r2": [
      "CVE-2021-29463",
      "CVE-2021-29470",
      "CVE-2021-29473",
      "CVE-2021-29623",
      "CVE-2021-32617"
    ],
    "0.27.3-r1": [
      "CVE-2021-3482",
      "CVE-2021-29457",
      "CVE-2021-29458",
      "CVE-2021-31291"
    ],
    "0.27.2-r6": [
      "CVE-2019-20421"
    ],
    "0.27.2-r2": [
      "CVE-2019-17402"
    ],
    "0.27.2-r0": [
      "CVE-2019-13108",
      "CVE-2019-13109",
      "CVE-2019-13110",
      "CVE-2019-13111",
      "CVE-2019-13112",
      "CVE-2019-13113",
      "CVE-2019-13114"
    ]
  },
  "apkurl": "{{urlprefix}}/{{distroversion}}/{{reponame}}/{{arch}}/{{pkg.name}}-{{pkg.ver}}.apk",
  "archs": [
    "aarch64",
    "armhf",
    "armv7",
    "mips64",
    "mips64el",
    "ppc64le",
    "s390x",
    "x86",
    "x86_64"
  ],
  "urlprefix": "https://dl-cdn.alpinelinux.org/alpine",
  "reponame": "community",
  "distroversion": "v3.15"
}