{
  "name": "salt",
  "secfixes": {
    "3003-r0": [
      "CVE-2021-31607"
    ],
    "3002.5-r0": [
      "CVE-2021-25281",
      "CVE-2021-25282",
      "CVE-2021-25283",
      "CVE-2021-25284",
      "CVE-2021-3144",
      "CVE-2021-3148",
      "CVE-2021-3197"
    ],
    "": [

    ],
    "2019.2.3-r0": [
      "CVE-2019-17361"
    ],
    "3000.2-r0": [
      "CVE-2020-11651",
      "CVE-2020-11652"
    ],
    "3002-r1": [
      "CVE-2020-16846",
      "CVE-2020-17490",
      "CVE-2020-25592"
    ]
  },
  "apkurl": "{{urlprefix}}/{{distroversion}}/{{reponame}}/{{arch}}/{{pkg.name}}-{{pkg.ver}}.apk",
  "archs": [

  ],
  "urlprefix": "https://dl-cdn.alpinelinux.org/alpine",
  "reponame": "community",
  "distroversion": "v3.13"
}