{
  "name": "bridge",
  "secfixes": {
    "0": [
      "CVE-2021-42533",
      "CVE-2021-42719",
      "CVE-2021-42720",
      "CVE-2021-42722",
      "CVE-2021-42725"
    ]
  },
  "apkurl": "{{urlprefix}}/{{distroversion}}/{{reponame}}/{{arch}}/{{pkg.name}}-{{pkg.ver}}.apk",
  "archs": [

  ],
  "urlprefix": "https://dl-cdn.alpinelinux.org/alpine",
  "reponame": "main",
  "distroversion": "v3.17"
}