{
  "name": "postgresql12",
  "secfixes": {
    "12.20-r0": [
      "CVE-2024-7348"
    ],
    "12.18-r0": [
      "CVE-2024-0985"
    ],
    "12.17-r0": [
      "CVE-2023-5868",
      "CVE-2023-5869",
      "CVE-2023-5870"
    ],
    "12.16-r0": [
      "CVE-2023-39418",
      "CVE-2023-39417"
    ],
    "12.15-r0": [
      "CVE-2023-2454",
      "CVE-2023-2455"
    ],
    "12.14-r0": [
      "CVE-2022-41862"
    ],
    "12.12-r0": [
      "CVE-2022-2625"
    ],
    "12.11-r0": [
      "CVE-2022-1552"
    ],
    "12.9-r0": [
      "CVE-2021-23214",
      "CVE-2021-23222"
    ],
    "12.8-r0": [
      "CVE-2021-3677"
    ],
    "12.5-r0": [
      "CVE-2020-25694",
      "CVE-2020-25695",
      "CVE-2020-25696"
    ],
    "12.4-r0": [
      "CVE-2020-14349",
      "CVE-2020-14350"
    ],
    "12.2-r0": [
      "CVE-2020-1720"
    ]
  },
  "apkurl": "{{urlprefix}}/{{distroversion}}/{{reponame}}/{{arch}}/{{pkg.name}}-{{pkg.ver}}.apk",
  "archs": [
    "aarch64",
    "armhf",
    "armv7",
    "mips64",
    "mips64el",
    "ppc64le",
    "s390x",
    "x86",
    "x86_64"
  ],
  "urlprefix": "https://dl-cdn.alpinelinux.org/alpine",
  "reponame": "community",
  "distroversion": "v3.17"
}