{
  "name": "avahi",
  "secfixes": {
    "0.8-r5": [
      "CVE-2021-36217"
    ],
    "0.8-r4": [
      "CVE-2021-3468"
    ],
    "0.7-r2": [
      "CVE-2017-6519",
      "CVE-2018-1000845"
    ],
    "0": [
      "CVE-2021-26720"
    ]
  },
  "apkurl": "{{urlprefix}}/{{distroversion}}/{{reponame}}/{{arch}}/{{pkg.name}}-{{pkg.ver}}.apk",
  "archs": [
    "aarch64",
    "armhf",
    "armv7",
    "mips64",
    "mips64el",
    "ppc64le",
    "s390x",
    "x86",
    "x86_64"
  ],
  "urlprefix": "https://dl-cdn.alpinelinux.org/alpine",
  "reponame": "main",
  "distroversion": "v3.15"
}