{
  "name": "icingaweb2",
  "secfixes": {
    "2.9.0-r0": [
      "CVE-2021-32746",
      "CVE-2021-32747"
    ]
  },
  "apkurl": "{{urlprefix}}/{{distroversion}}/{{reponame}}/{{arch}}/{{pkg.name}}-{{pkg.ver}}.apk",
  "archs": [

  ],
  "urlprefix": "https://dl-cdn.alpinelinux.org/alpine",
  "reponame": "community",
  "distroversion": "v3.15"
}