{
  "name": "sdl2_image",
  "secfixes": {
    "2.0.5-r0": [
      "CVE-2019-5060",
      "CVE-2019-5059",
      "CVE-2019-5058",
      "CVE-2019-5057",
      "CVE-2019-5052",
      "CVE-2019-5051",
      "CVE-2019-12222",
      "CVE-2019-12221",
      "CVE-2019-12219",
      "CVE-2019-12218",
      "CVE-2019-12217"
    ],
    "2.0.3-r0": [
      "CVE-2017-12122",
      "CVE-2017-14440",
      "CVE-2017-14441",
      "CVE-2017-14442",
      "CVE-2017-14448",
      "CVE-2017-14449",
      "CVE-2017-14450"
    ]
  },
  "apkurl": "{{urlprefix}}/{{distroversion}}/{{reponame}}/{{arch}}/{{pkg.name}}-{{pkg.ver}}.apk",
  "archs": [
    "aarch64",
    "armhf",
    "armv7",
    "mips64",
    "mips64el",
    "ppc64le",
    "s390x",
    "x86",
    "x86_64"
  ],
  "urlprefix": "https://dl-cdn.alpinelinux.org/alpine",
  "reponame": "main",
  "distroversion": "v3.8"
}