{
  "name": "vault",
  "secfixes": {
    "1.5.9-r0": [
      "CVE-2021-32923"
    ],
    "1.5.8-r0": [
      "CVE-2021-27668"
    ],
    "1.5.7-r0": [
      "CVE-2020-25594",
      "CVE-2021-3024"
    ],
    "1.5.6-r0": [
      "CVE-2020-35177"
    ],
    "1.5.4-r0": [
      "CVE-2020-16250",
      "CVE-2020-16251",
      "CVE-2020-17455",
      "CVE-2020-25816"
    ],
    "1.4.3-r0": [
      "CVE-2020-13223"
    ]
  },
  "apkurl": "{{urlprefix}}/{{distroversion}}/{{reponame}}/{{arch}}/{{pkg.name}}-{{pkg.ver}}.apk",
  "archs": [
    "aarch64",
    "armhf",
    "armv7",
    "mips64el",
    "ppc64le",
    "x86",
    "x86_64"
  ],
  "urlprefix": "https://dl-cdn.alpinelinux.org/alpine",
  "reponame": "community",
  "distroversion": "v3.13"
}