{
  "name": "graphicsmagick",
  "secfixes": {
    "1.3.27-r0": [
      "CVE-2017-11102",
      "CVE-2017-14314",
      "CVE-2017-14504",
      "CVE-2017-14733",
      "CVE-2017-14994",
      "CVE-2017-14997",
      "CVE-2017-15930",
      "CVE-2017-14649"
    ],
    "1.3.26-r5": [
      "CVE-2017-13065",
      "CVE-2017-13648",
      "CVE-2017-14042",
      "CVE-2017-14103",
      "CVE-2017-14165"
    ],
    "1.3.26-r3": [
      "CVE-2017-13775",
      "CVE-2017-13776",
      "CVE-2017-13777"
    ],
    "1.3.26-r2": [
      "CVE-2017-11642",
      "CVE-2017-11722",
      "CVE-2017-12935",
      "CVE-2017-12936",
      "CVE-2017-12937",
      "CVE-2017-13063",
      "CVE-2017-13064"
    ],
    "1.3.25-r2": [
      "CVE-2017-11403"
    ]
  },
  "apkurl": "{{urlprefix}}/{{distroversion}}/{{reponame}}/{{arch}}/{{pkg.name}}-{{pkg.ver}}.apk",
  "archs": [
    "aarch64",
    "armhf",
    "armv7",
    "mips64",
    "mips64el",
    "ppc64le",
    "s390x",
    "x86",
    "x86_64"
  ],
  "urlprefix": "https://dl-cdn.alpinelinux.org/alpine",
  "reponame": "community",
  "distroversion": "v3.9"
}