{
  "name": "libraw",
  "secfixes": {
    "0.20.0-r0": [
      "CVE-2020-24899",
      "CVE-2020-24890"
    ],
    "0.19.5-r1": [
      "CVE-2020-15503"
    ],
    "0.19.2-r0": [
      "CVE-2018-20363",
      "CVE-2018-20364",
      "CVE-2018-20365",
      "CVE-2018-5817",
      "CVE-2018-5818",
      "CVE-2018-5819"
    ],
    "0.18.6-r0": [
      "CVE-2017-16910"
    ],
    "0.18.5-r0": [
      "CVE-2017-13735",
      "CVE-2017-14265"
    ]
  },
  "apkurl": "{{urlprefix}}/{{distroversion}}/{{reponame}}/{{arch}}/{{pkg.name}}-{{pkg.ver}}.apk",
  "archs": [
    "aarch64",
    "armhf",
    "armv7",
    "mips64",
    "mips64el",
    "ppc64le",
    "s390x",
    "x86",
    "x86_64"
  ],
  "urlprefix": "https://dl-cdn.alpinelinux.org/alpine",
  "reponame": "community",
  "distroversion": "v3.13"
}