{
  "name": "podofo",
  "secfixes": {
    "0.9.7-r0": [
      "CVE-2019-9199",
      "CVE-2019-9687",
      "CVE-2018-19532",
      "CVE-2018-20751",
      "CVE-2018-20797",
      "CVE-2019-10723",
      "CVE-2019-20093"
    ],
    "0.9.6-r0": [
      "CVE-2017-6848",
      "CVE-2017-7378",
      "CVE-2017-7379",
      "CVE-2017-7380",
      "CVE-2017-7381",
      "CVE-2017-7382",
      "CVE-2017-7383",
      "CVE-2017-7994",
      "CVE-2017-8053",
      "CVE-2017-8054",
      "CVE-2017-8378",
      "CVE-2017-8787",
      "CVE-2018-5295",
      "CVE-2018-5296",
      "CVE-2018-5308",
      "CVE-2018-5309",
      "CVE-2018-5783",
      "CVE-2018-6352",
      "CVE-2018-8000",
      "CVE-2018-8001",
      "CVE-2018-8002",
      "CVE-2018-11254",
      "CVE-2018-11255",
      "CVE-2018-11256",
      "CVE-2018-12982",
      "CVE-2018-12983"
    ],
    "0.9.5-r0": [
      "CVE-2017-6843",
      "CVE-2017-6844",
      "CVE-2017-6845",
      "CVE-2017-6846",
      "CVE-2017-6847",
      "CVE-2017-6849"
    ]
  },
  "apkurl": "{{urlprefix}}/{{distroversion}}/{{reponame}}/{{arch}}/{{pkg.name}}-{{pkg.ver}}.apk",
  "archs": [
    "aarch64",
    "armhf",
    "armv7",
    "mips64",
    "mips64el",
    "ppc64le",
    "x86",
    "x86_64"
  ],
  "urlprefix": "https://dl-cdn.alpinelinux.org/alpine",
  "reponame": "community",
  "distroversion": "v3.20"
}