{
  "name": "uriparser",
  "secfixes": {
    "0.9.8-r0": [
      "CVE-2024-34402",
      "CVE-2024-34403"
    ],
    "0.9.6-r0": [
      "CVE-2021-46141",
      "CVE-2021-46142"
    ]
  },
  "apkurl": "{{urlprefix}}/{{distroversion}}/{{reponame}}/{{arch}}/{{pkg.name}}-{{pkg.ver}}.apk",
  "archs": [
    "aarch64",
    "armhf",
    "armv7",
    "mips64",
    "mips64el",
    "ppc64le",
    "s390x",
    "x86",
    "x86_64"
  ],
  "urlprefix": "https://dl-cdn.alpinelinux.org/alpine",
  "reponame": "community",
  "distroversion": "v3.20"
}