{
  "name": "dhcp",
  "secfixes": {
    "4.4.3_p1-r0": [
      "CVE-2022-2928",
      "CVE-2022-2929"
    ],
    "4.4.2_p1-r0": [
      "CVE-2021-25217"
    ],
    "4.4.1-r0": [
      "CVE-2019-6470",
      "CVE-2018-5732",
      "CVE-2018-5733"
    ]
  },
  "apkurl": "{{urlprefix}}/{{distroversion}}/{{reponame}}/{{arch}}/{{pkg.name}}-{{pkg.ver}}.apk",
  "archs": [
    "aarch64",
    "armhf",
    "armv7",
    "mips64",
    "mips64el",
    "ppc64le",
    "s390x",
    "x86",
    "x86_64"
  ],
  "urlprefix": "https://dl-cdn.alpinelinux.org/alpine",
  "reponame": "main",
  "distroversion": "v3.18"
}