{
  "name": "ntfs-3g",
  "secfixes": {
    "2022.10.3-r0": [
      "CVE-2022-40284"
    ],
    "2022.5.17-r0": [
      "CVE-2021-46790",
      "CVE-2022-30783",
      "CVE-2022-30784",
      "CVE-2022-30785",
      "CVE-2022-30786",
      "CVE-2022-30787",
      "CVE-2022-30788",
      "CVE-2022-30789"
    ],
    "2017.3.23-r2": [
      "CVE-2019-9755"
    ]
  },
  "apkurl": "{{urlprefix}}/{{distroversion}}/{{reponame}}/{{arch}}/{{pkg.name}}-{{pkg.ver}}.apk",
  "archs": [
    "aarch64",
    "armhf",
    "armv7",
    "mips64",
    "mips64el",
    "ppc64le",
    "s390x",
    "x86",
    "x86_64"
  ],
  "urlprefix": "https://dl-cdn.alpinelinux.org/alpine",
  "reponame": "main",
  "distroversion": "v3.20"
}