{
  "name": "ghostscript",
  "secfixes": {
    "10.04.0-r0": [
      "CVE-2024-46951",
      "CVE-2024-46952",
      "CVE-2024-46953",
      "CVE-2024-46954",
      "CVE-2024-46955",
      "CVE-2024-46956"
    ],
    "10.03.1-r0": [
      "CVE-2023-52722",
      "CVE-2024-29510",
      "CVE-2024-33869",
      "CVE-2024-33870",
      "CVE-2024-33871"
    ],
    "10.02.0-r0": [
      "CVE-2023-43115"
    ],
    "9.54-r1": [
      "CVE-2021-3781"
    ],
    "9.51-r0": [
      "CVE-2020-16287",
      "CVE-2020-16288",
      "CVE-2020-16289",
      "CVE-2020-16290",
      "CVE-2020-16291",
      "CVE-2020-16292",
      "CVE-2020-16293",
      "CVE-2020-16294",
      "CVE-2020-16295",
      "CVE-2020-16296",
      "CVE-2020-16297",
      "CVE-2020-16298",
      "CVE-2020-16299",
      "CVE-2020-16300",
      "CVE-2020-16301",
      "CVE-2020-16302",
      "CVE-2020-16303",
      "CVE-2020-16304",
      "CVE-2020-16305",
      "CVE-2020-16306",
      "CVE-2020-16307",
      "CVE-2020-16308",
      "CVE-2020-16309",
      "CVE-2020-16310",
      "CVE-2020-17538"
    ],
    "9.50-r0": [
      "CVE-2019-14869"
    ],
    "9.27-r4": [
      "CVE-2019-14817"
    ],
    "9.27-r3": [
      "CVE-2019-14811",
      "CVE-2019-14812",
      "CVE-2019-14813"
    ],
    "9.27-r2": [
      "CVE-2019-10216"
    ],
    "9.26-r2": [
      "CVE-2019-3835",
      "CVE-2019-3838"
    ],
    "9.26-r1": [
      "CVE-2019-6116"
    ],
    "9.26-r0": [
      "CVE-2018-19409",
      "CVE-2018-19475",
      "CVE-2018-19476",
      "CVE-2018-19477"
    ],
    "9.25-r1": [
      "CVE-2018-17961",
      "CVE-2018-18073",
      "CVE-2018-18284"
    ],
    "9.25-r0": [
      "CVE-2018-16802"
    ],
    "9.24-r0": [
      "CVE-2018-15908",
      "CVE-2018-15909",
      "CVE-2018-15910",
      "CVE-2018-15911"
    ],
    "9.23-r0": [
      "CVE-2018-10194"
    ],
    "9.21-r2": [
      "CVE-2017-8291"
    ],
    "9.21-r3": [
      "CVE-2017-7207",
      "CVE-2017-5951"
    ]
  },
  "apkurl": "{{urlprefix}}/{{distroversion}}/{{reponame}}/{{arch}}/{{pkg.name}}-{{pkg.ver}}.apk",
  "archs": [
    "aarch64",
    "armhf",
    "armv7",
    "mips64",
    "mips64el",
    "ppc64le",
    "s390x",
    "x86",
    "x86_64"
  ],
  "urlprefix": "https://dl-cdn.alpinelinux.org/alpine",
  "reponame": "main",
  "distroversion": "v3.20"
}