{
  "name": "apr",
  "secfixes": {
    "1.7.1-r0": [
      "CVE-2022-24963",
      "CVE-2022-25147",
      "CVE-2022-28331"
    ],
    "1.7.0-r2": [
      "CVE-2021-35940"
    ]
  },
  "apkurl": "{{urlprefix}}/{{distroversion}}/{{reponame}}/{{arch}}/{{pkg.name}}-{{pkg.ver}}.apk",
  "archs": [
    "aarch64",
    "armhf",
    "armv7",
    "mips64",
    "mips64el",
    "ppc64le",
    "s390x",
    "x86",
    "x86_64"
  ],
  "urlprefix": "https://dl-cdn.alpinelinux.org/alpine",
  "reponame": "main",
  "distroversion": "v3.16"
}