{
  "name": "sane",
  "secfixes": {
    "1.0.30-r0": [
      "CVE-2020-12861",
      "CVE-2020-12862",
      "CVE-2020-12863",
      "CVE-2020-12864",
      "CVE-2020-12865",
      "CVE-2020-12866",
      "CVE-2020-12867"
    ]
  },
  "apkurl": "{{urlprefix}}/{{distroversion}}/{{reponame}}/{{arch}}/{{pkg.name}}-{{pkg.ver}}.apk",
  "archs": [
    "aarch64",
    "armhf",
    "armv7",
    "mips64",
    "mips64el",
    "ppc64le",
    "s390x",
    "x86",
    "x86_64"
  ],
  "urlprefix": "https://dl-cdn.alpinelinux.org/alpine",
  "reponame": "community",
  "distroversion": "v3.14"
}