{
  "name": "samba",
  "secfixes": {
    "4.4.16-r2": [
      "CVE-2018-1050",
      "CVE-2018-1057"
    ],
    "4.4.16-r1": [
      "CVE-2017-14746",
      "CVE-2017-15275"
    ],
    "4.4.16-r0": [
      "CVE-2017-12150",
      "CVE-2017-12151",
      "CVE-2017-12163"
    ],
    "4.4.14-r1": [
      "CVE-2017-11103"
    ],
    "4.4.14-r0": [
      "CVE-2017-7494"
    ],
    "4.4.5-r3": [
      "CVE-2017-2619"
    ],
    "4.4.5-r2": [
      "CVE-2016-2123",
      "CVE-2016-2125",
      "CVE-2016-2126"
    ]
  },
  "apkurl": "{{urlprefix}}/{{distroversion}}/{{reponame}}/{{arch}}/{{pkg.name}}-{{pkg.ver}}.apk",
  "archs": [
    "aarch64",
    "armhf",
    "armv7",
    "mips64",
    "mips64el",
    "ppc64le",
    "s390x",
    "x86",
    "x86_64"
  ],
  "urlprefix": "https://dl-cdn.alpinelinux.org/alpine",
  "reponame": "main",
  "distroversion": "v3.4"
}