{
  "name": "libreswan",
  "secfixes": {
    "3.32-r0": [
      "CVE-2020-1763"
    ],
    "3.29-r0": [
      "CVE-2019-10155"
    ],
    "3.28-r0": [
      "CVE-2019-12312"
    ]
  },
  "apkurl": "{{urlprefix}}/{{distroversion}}/{{reponame}}/{{arch}}/{{pkg.name}}-{{pkg.ver}}.apk",
  "archs": [
    "aarch64",
    "armhf",
    "armv7",
    "mips64",
    "mips64el",
    "ppc64le",
    "s390x",
    "x86",
    "x86_64"
  ],
  "urlprefix": "https://dl-cdn.alpinelinux.org/alpine",
  "reponame": "community",
  "distroversion": "v3.14"
}