{
  "name": "shadow",
  "secfixes": {
    "4.13-r4": [
      "CVE-2023-29383"
    ],
    "4.5-r0": [
      "CVE-2017-12424"
    ],
    "4.2.1-r11": [
      "CVE-2017-2616"
    ],
    "4.2.1-r7": [
      "CVE-2016-6252"
    ]
  },
  "apkurl": "{{urlprefix}}/{{distroversion}}/{{reponame}}/{{arch}}/{{pkg.name}}-{{pkg.ver}}.apk",
  "archs": [
    "aarch64",
    "armhf",
    "armv7",
    "mips64",
    "mips64el",
    "ppc64le",
    "s390x",
    "x86",
    "x86_64"
  ],
  "urlprefix": "https://dl-cdn.alpinelinux.org/alpine",
  "reponame": "community",
  "distroversion": "v3.21"
}