{
  "name": "chicken",
  "secfixes": {
    "4.12.0-r3": [
      "CVE-2017-6949"
    ],
    "4.12.0-r2": [
      "CVE-2017-9334"
    ],
    "4.11.1-r0": [
      "CVE-2016-6830",
      "CVE-2016-6831"
    ]
  },
  "apkurl": "{{urlprefix}}/{{distroversion}}/{{reponame}}/{{arch}}/{{pkg.name}}-{{pkg.ver}}.apk",
  "archs": [
    "aarch64",
    "armhf",
    "armv7",
    "mips64",
    "mips64el",
    "ppc64le",
    "s390x",
    "x86",
    "x86_64"
  ],
  "urlprefix": "https://dl-cdn.alpinelinux.org/alpine",
  "reponame": "community",
  "distroversion": "v3.11"
}