{
  "name": "jenkins",
  "secfixes": {
    "2.228-r0": [
      "CVE-2020-2160",
      "CVE-2020-2161",
      "CVE-2020-2162",
      "CVE-2020-2163"
    ]
  },
  "apkurl": "{{urlprefix}}/{{distroversion}}/{{reponame}}/{{arch}}/{{pkg.name}}-{{pkg.ver}}.apk",
  "archs": [

  ],
  "urlprefix": "https://dl-cdn.alpinelinux.org/alpine",
  "reponame": "community",
  "distroversion": "v3.11"
}