{
  "name": "libreoffice",
  "secfixes": {
    "6.3.1.2-r0": [
      "CVE-2019-9854",
      "CVE-2019-9855"
    ],
    "6.3.0.4-r0": [
      "CVE-2019-9850",
      "CVE-2019-9851",
      "CVE-2019-9852"
    ],
    "6.2.5.2-r0": [
      "CVE-2019-9848",
      "CVE-2019-9849"
    ]
  },
  "apkurl": "{{urlprefix}}/{{distroversion}}/{{reponame}}/{{arch}}/{{pkg.name}}-{{pkg.ver}}.apk",
  "archs": [
    "aarch64",
    "armhf",
    "armv7",
    "mips64",
    "mips64el",
    "ppc64le",
    "x86",
    "x86_64"
  ],
  "urlprefix": "https://dl-cdn.alpinelinux.org/alpine",
  "reponame": "community",
  "distroversion": "v3.11"
}