{
  "name": "irssi",
  "secfixes": {
    "1.2.2-r0": [
      "CVE-2019-15717"
    ],
    "1.2.1-r0": [
      "CVE-2019-13045"
    ],
    "1.1.2-r0": [
      "CVE-2019-5882"
    ],
    "1.0.3-r0": [
      "CVE-2017-9468",
      "CVE-2017-9469"
    ],
    "1.0.4-r0": [
      "CVE-2017-10965",
      "CVE-2017-10966"
    ],
    "1.0.5-r0": [
      "CVE-2017-15721",
      "CVE-2017-15722",
      "CVE-2017-15723",
      "CVE-2017-15227",
      "CVE-2017-15228"
    ],
    "1.0.6-r0": [
      "CVE-2018-5205",
      "CVE-2018-5206",
      "CVE-2018-5207",
      "CVE-2018-5208"
    ],
    "1.1.1-r0": [
      "CVE-2018-7050",
      "CVE-2018-7051",
      "CVE-2018-7052",
      "CVE-2018-7053",
      "CVE-2018-7054"
    ]
  },
  "apkurl": "{{urlprefix}}/{{distroversion}}/{{reponame}}/{{arch}}/{{pkg.name}}-{{pkg.ver}}.apk",
  "archs": [
    "aarch64",
    "armhf",
    "armv7",
    "mips64",
    "mips64el",
    "ppc64le",
    "s390x",
    "x86",
    "x86_64"
  ],
  "urlprefix": "https://dl-cdn.alpinelinux.org/alpine",
  "reponame": "main",
  "distroversion": "v3.13"
}