{
  "name": "libxpm",
  "secfixes": {
    "3.5.17-r0": [
      "CVE-2023-43788",
      "CVE-2023-43789"
    ],
    "3.5.15-r0": [
      "CVE-2022-46285",
      "CVE-2022-44617",
      "CVE-2022-4883"
    ]
  },
  "apkurl": "{{urlprefix}}/{{distroversion}}/{{reponame}}/{{arch}}/{{pkg.name}}-{{pkg.ver}}.apk",
  "archs": [
    "aarch64",
    "armhf",
    "armv7",
    "mips64",
    "mips64el",
    "ppc64le",
    "s390x",
    "x86",
    "x86_64"
  ],
  "urlprefix": "https://dl-cdn.alpinelinux.org/alpine",
  "reponame": "main",
  "distroversion": "vedge"
}