{
  "name": "xorg-server",
  "secfixes": {
    "21.1.7-r0": [
      "CVE-2023-0494"
    ],
    "21.1.5-r0": [
      "CVE-2022-4283",
      "CVE-2022-46340",
      "CVE-2022-46341",
      "CVE-2022-46342",
      "CVE-2022-46343",
      "CVE-2022-46344"
    ],
    "21.1.4-r0": [
      "CVE-2022-2319",
      "CVE-2022-2320"
    ],
    "21.1.2-r0": [
      "CVE-2021-4008",
      "CVE-2021-4009",
      "CVE-2021-4010",
      "CVE-2021-4011"
    ],
    "1.20.10-r5": [
      "CVE-2021-3472"
    ],
    "1.20.10-r0": [
      "CVE-2020-14360",
      "CVE-2020-25712"
    ],
    "1.20.9-r0": [
      "CVE-2020-14362",
      "CVE-2020-14361",
      "CVE-2020-14346",
      "CVE-2020-14345"
    ],
    "1.20.8-r4": [
      "CVE-2020-14347"
    ],
    "1.20.3-r0": [
      "CVE-2018-14665"
    ],
    "1.19.5-r0": [
      "CVE-2017-12176",
      "CVE-2017-12177",
      "CVE-2017-12178",
      "CVE-2017-12179",
      "CVE-2017-12180",
      "CVE-2017-12181",
      "CVE-2017-12182",
      "CVE-2017-12183",
      "CVE-2017-12184",
      "CVE-2017-12185",
      "CVE-2017-12186",
      "CVE-2017-12187",
      "CVE-2017-13721",
      "CVE-2017-13723"
    ]
  },
  "apkurl": "{{urlprefix}}/{{distroversion}}/{{reponame}}/{{arch}}/{{pkg.name}}-{{pkg.ver}}.apk",
  "archs": [
    "aarch64",
    "armhf",
    "armv7",
    "mips64",
    "mips64el",
    "ppc64le",
    "s390x",
    "x86",
    "x86_64"
  ],
  "urlprefix": "https://dl-cdn.alpinelinux.org/alpine",
  "reponame": "community",
  "distroversion": "v3.17"
}