{
  "name": "py3-saml2",
  "secfixes": {
    "6.5.0-r0": [
      "CVE-2021-21238",
      "CVE-2021-21239"
    ]
  },
  "apkurl": "{{urlprefix}}/{{distroversion}}/{{reponame}}/{{arch}}/{{pkg.name}}-{{pkg.ver}}.apk",
  "archs": [

  ],
  "urlprefix": "https://dl-cdn.alpinelinux.org/alpine",
  "reponame": "community",
  "distroversion": "v3.16"
}