{
  "name": "exiv2",
  "secfixes": {
    "0.27.2-r3": [
      "CVE-2019-20421"
    ],
    "0.27.2-r2": [
      "CVE-2019-17402"
    ],
    "0.27.2-r0": [
      "CVE-2019-13108",
      "CVE-2019-13109",
      "CVE-2019-13110",
      "CVE-2019-13111",
      "CVE-2019-13112",
      "CVE-2019-13113",
      "CVE-2019-13114"
    ]
  },
  "apkurl": "{{urlprefix}}/{{distroversion}}/{{reponame}}/{{arch}}/{{pkg.name}}-{{pkg.ver}}.apk",
  "archs": [
    "aarch64",
    "armhf",
    "armv7",
    "mips64",
    "mips64el",
    "ppc64le",
    "s390x",
    "x86",
    "x86_64"
  ],
  "urlprefix": "https://dl-cdn.alpinelinux.org/alpine",
  "reponame": "main",
  "distroversion": "v3.11"
}