{
  "name": "docker",
  "secfixes": {
    "19.03.1": [
      "CVE-2019-14271"
    ],
    "18.09.8": [
      "CVE-2019-13509"
    ],
    "18.09.7": [
      "CVE-2018-15664"
    ]
  },
  "apkurl": "{{urlprefix}}/{{distroversion}}/{{reponame}}/{{arch}}/{{pkg.name}}-{{pkg.ver}}.apk",
  "archs": [
    "aarch64",
    "armhf",
    "armv7",
    "mips64",
    "mips64el",
    "ppc64le",
    "s390x",
    "x86",
    "x86_64"
  ],
  "urlprefix": "https://dl-cdn.alpinelinux.org/alpine",
  "reponame": "community",
  "distroversion": "v3.11"
}