{
  "name": "ruby-activesupport",
  "secfixes": {
    "7.0.4.3-r0": [
      "CVE-2023-28120",
      "CVE-2023-22796"
    ]
  },
  "apkurl": "{{urlprefix}}/{{distroversion}}/{{reponame}}/{{arch}}/{{pkg.name}}-{{pkg.ver}}.apk",
  "archs": [

  ],
  "urlprefix": "https://dl-cdn.alpinelinux.org/alpine",
  "reponame": "community",
  "distroversion": "v3.17"
}