{
  "name": "ansible",
  "secfixes": {
    "2.10.7-r0": [
      "CVE-2021-20191"
    ],
    "2.10.1-r0": [
      "CVE-2020-25646"
    ]
  },
  "apkurl": "{{urlprefix}}/{{distroversion}}/{{reponame}}/{{arch}}/{{pkg.name}}-{{pkg.ver}}.apk",
  "archs": [

  ],
  "urlprefix": "https://dl-cdn.alpinelinux.org/alpine",
  "reponame": "community",
  "distroversion": "v3.19"
}