{
  "name": "php82",
  "secfixes": {
    "8.2.24-r0": [
      "CVE-2024-8925",
      "CVE-2024-8926",
      "CVE-2024-8927",
      "CVE-2024-9026"
    ],
    "8.2.18-r0": [
      "CVE-2024-1874",
      "CVE-2024-2756",
      "CVE-2024-3096"
    ],
    "8.2.3-r0": [
      "CVE-2023-0567",
      "CVE-2023-0568",
      "CVE-2023-0662"
    ],
    "8.2.1-r0": [
      "CVE-2022-31631"
    ],
    "8.2.0_rc5-r0": [
      "CVE-2022-31630",
      "CVE-2022-37454"
    ]
  },
  "apkurl": "{{urlprefix}}/{{distroversion}}/{{reponame}}/{{arch}}/{{pkg.name}}-{{pkg.ver}}.apk",
  "archs": [
    "aarch64",
    "armhf",
    "armv7",
    "mips64",
    "mips64el",
    "ppc64le",
    "s390x",
    "x86",
    "x86_64"
  ],
  "urlprefix": "https://dl-cdn.alpinelinux.org/alpine",
  "reponame": "community",
  "distroversion": "v3.20"
}