{
  "name": "mruby",
  "secfixes": {
    "3.1.0-r0": [
      "CVE-2021-4110",
      "CVE-2021-4188",
      "CVE-2022-0080",
      "CVE-2022-0240",
      "CVE-2022-0326",
      "CVE-2022-0481",
      "CVE-2022-0631",
      "CVE-2022-0632",
      "CVE-2022-0890",
      "CVE-2022-1071",
      "CVE-2022-1106",
      "CVE-2022-1201",
      "CVE-2022-1427"
    ],
    "2.1.2-r0": [
      "CVE-2020-15866"
    ]
  },
  "apkurl": "{{urlprefix}}/{{distroversion}}/{{reponame}}/{{arch}}/{{pkg.name}}-{{pkg.ver}}.apk",
  "archs": [
    "aarch64",
    "mips64",
    "mips64el",
    "ppc64le",
    "x86_64"
  ],
  "urlprefix": "https://dl-cdn.alpinelinux.org/alpine",
  "reponame": "community",
  "distroversion": "v3.19"
}