{
  "name": "py3-django",
  "secfixes": {
    "4.2.16-r0": [
      "CVE-2024-38875",
      "CVE-2024-39329",
      "CVE-2024-39330",
      "CVE-2024-39614",
      "CVE-2024-41989",
      "CVE-2024-41990",
      "CVE-2024-41991",
      "CVE-2024-42005",
      "CVE-2024-45230",
      "CVE-2024-45231"
    ],
    "4.2.11-r0": [
      "CVE-2024-27351"
    ],
    "4.2.6-r0": [
      "CVE-2023-43665"
    ],
    "4.2.5-r0": [
      "CVE-2023-41164"
    ],
    "3.2.18-r0": [
      "CVE-2023-24580"
    ],
    "3.2.17-r0": [
      "CVE-2023-23969"
    ],
    "3.2.16-r0": [
      "CVE-2022-41323"
    ],
    "3.2.15-r0": [
      "CVE-2022-36359"
    ],
    "3.2.14-r0": [
      "CVE-2022-34265"
    ],
    "3.2.13-r0": [
      "CVE-2022-28346",
      "CVE-2022-28347"
    ],
    "3.2.12-r0": [
      "CVE-2021-44420",
      "CVE-2021-45115",
      "CVE-2021-45116",
      "CVE-2021-45452",
      "CVE-2022-22818",
      "CVE-2022-23833"
    ],
    "3.1.13-r0": [
      "CVE-2021-33203",
      "CVE-2021-33571",
      "CVE-2021-35042"
    ],
    "3.1.8-r0": [
      "CVE-2021-28658"
    ],
    "3.1.7-r0": [
      "CVE-2021-23336"
    ],
    "3.1.6-r0": [
      "CVE-2021-3281"
    ],
    "3.1.1-r0": [
      "CVE-2020-24583",
      "CVE-2020-24584"
    ],
    "3.0.7-r0": [
      "CVE-2020-13254",
      "CVE-2020-13596"
    ],
    "1.11.29-r0": [
      "CVE-2020-9402"
    ],
    "1.11.28-r0": [
      "CVE-2020-7471"
    ],
    "1.11.27-r0": [
      "CVE-2019-19844"
    ],
    "1.11.23-r0": [
      "CVE-2019-14232",
      "CVE-2019-14233",
      "CVE-2019-14234",
      "CVE-2019-14235"
    ],
    "1.11.22-r0": [
      "CVE-2019-12781"
    ],
    "1.8.16-r0": [
      "CVE-2016-9013",
      "CVE-2016-9014"
    ],
    "1.10.7-r0": [
      "CVE-2017-7233",
      "CVE-2017-7234"
    ],
    "1.11.5-r0": [
      "CVE-2017-12794"
    ],
    "1.11.10-r0": [
      "CVE-2018-6188"
    ],
    "1.11.11-r0": [
      "CVE-2018-7536",
      "CVE-2018-7537"
    ],
    "1.11.15-r0": [
      "CVE-2018-14574"
    ],
    "1.11.18-r0": [
      "CVE-2019-3498"
    ],
    "1.11.19-r0": [
      "CVE-2019-6975"
    ],
    "1.11.21-r0": [
      "CVE-2019-12308"
    ]
  },
  "apkurl": "{{urlprefix}}/{{distroversion}}/{{reponame}}/{{arch}}/{{pkg.name}}-{{pkg.ver}}.apk",
  "archs": [

  ],
  "urlprefix": "https://dl-cdn.alpinelinux.org/alpine",
  "reponame": "community",
  "distroversion": "v3.20"
}