{
  "name": "pcre",
  "secfixes": {
    "8.44-r0": [
      "CVE-2020-14155"
    ],
    "8.40-r2": [
      "CVE-2017-7186"
    ],
    "7.8-r0": [
      "CVE-2017-11164",
      "CVE-2017-16231"
    ]
  },
  "apkurl": "{{urlprefix}}/{{distroversion}}/{{reponame}}/{{arch}}/{{pkg.name}}-{{pkg.ver}}.apk",
  "archs": [
    "aarch64",
    "armhf",
    "armv7",
    "mips64",
    "mips64el",
    "ppc64le",
    "s390x",
    "x86",
    "x86_64"
  ],
  "urlprefix": "https://dl-cdn.alpinelinux.org/alpine",
  "reponame": "main",
  "distroversion": "v3.14"
}