{
  "name": "nodejs",
  "secfixes": {
    "6.10.3-r1": [
      "CVE-2017-1000381"
    ],
    "6.10.0-r0": [
      "CVE-2016-5129"
    ],
    "6.8.0-r0": [
      "CVE-2016-5180"
    ],
    "": [

    ]
  },
  "apkurl": "{{urlprefix}}/{{distroversion}}/{{reponame}}/{{arch}}/{{pkg.name}}-{{pkg.ver}}.apk",
  "archs": [
    "aarch64",
    "armhf",
    "armv7",
    "mips64",
    "mips64el",
    "ppc64le",
    "s390x",
    "x86",
    "x86_64"
  ],
  "urlprefix": "https://dl-cdn.alpinelinux.org/alpine",
  "reponame": "main",
  "distroversion": "v3.6"
}