{
  "name": "blender",
  "secfixes": {
    "3.3.0-r0": [
      "CVE-2022-2831",
      "CVE-2022-2832",
      "CVE-2022-2833"
    ]
  },
  "apkurl": "{{urlprefix}}/{{distroversion}}/{{reponame}}/{{arch}}/{{pkg.name}}-{{pkg.ver}}.apk",
  "archs": [
    "aarch64",
    "x86_64"
  ],
  "urlprefix": "https://dl-cdn.alpinelinux.org/alpine",
  "reponame": "community",
  "distroversion": "v3.17"
}