{
  "name": "singularity",
  "secfixes": {
    "4.1.1-r0": [
      "CVE-2024-23650",
      "CVE-2024-23651",
      "CVE-2024-23652",
      "CVE-2024-23653"
    ],
    "3.8.5-r0": [
      "CVE-2021-41190"
    ],
    "- GHSA-77vh-xpmg-72qh": [

    ],
    "3.7.4-r0": [
      "CVE-2021-32635"
    ],
    "3.7.3-r0": [
      "CVE-2021-29136"
    ],
    "3.6.4-r0": [
      "CVE-2020-15229"
    ],
    "3.6.3-r0": [
      "CVE-2020-25039",
      "CVE-2020-25040"
    ],
    "3.6.0-r0": [
      "CVE-2020-13845",
      "CVE-2020-13846",
      "CVE-2020-13847"
    ],
    "3.5.2-r0": [
      "CVE-2019-19724"
    ]
  },
  "apkurl": "{{urlprefix}}/{{distroversion}}/{{reponame}}/{{arch}}/{{pkg.name}}-{{pkg.ver}}.apk",
  "archs": [
    "aarch64",
    "armhf",
    "armv7",
    "mips64",
    "mips64el",
    "s390x",
    "x86",
    "x86_64"
  ],
  "urlprefix": "https://dl-cdn.alpinelinux.org/alpine",
  "reponame": "community",
  "distroversion": "vedge"
}