{
  "name": "wavpack",
  "secfixes": {
    "5.1.0-r0": [
      "CVE-2016-10169",
      "CVE-2016-10170",
      "CVE-2016-10171",
      "CVE-2016-10172"
    ]
  },
  "apkurl": "{{urlprefix}}/{{distroversion}}/{{reponame}}/{{arch}}/{{pkg.name}}-{{pkg.ver}}.apk",
  "archs": [
    "aarch64",
    "armhf",
    "armv7",
    "mips64",
    "mips64el",
    "ppc64le",
    "s390x",
    "x86",
    "x86_64"
  ],
  "urlprefix": "https://dl-cdn.alpinelinux.org/alpine",
  "reponame": "main",
  "distroversion": "v3.2"
}