{
  "name": "py3-ujson",
  "secfixes": {
    "5.4.0-r0": [
      "CVE-2022-31116",
      "CVE-2022-31117"
    ],
    "5.2.0-r0": [
      "CVE-2021-45958"
    ]
  },
  "apkurl": "{{urlprefix}}/{{distroversion}}/{{reponame}}/{{arch}}/{{pkg.name}}-{{pkg.ver}}.apk",
  "archs": [
    "aarch64",
    "armhf",
    "armv7",
    "mips64",
    "mips64el",
    "ppc64le",
    "s390x",
    "x86",
    "x86_64"
  ],
  "urlprefix": "https://dl-cdn.alpinelinux.org/alpine",
  "reponame": "community",
  "distroversion": "v3.18"
}