{
  "name": "dotnet7-build",
  "secfixes": {
    "7.0.103-r0": [
      "CVE-2023-21808"
    ],
    "7.0.105-r0": [
      "CVE-2023-28260"
    ],
    "7.0.107-r0": [
      "CVE-2023-24895",
      "CVE-2023-24897",
      "CVE-2023-24936",
      "CVE-2023-29331",
      "CVE-2023-29337",
      "CVE-2023-32032",
      "CVE-2023-33126",
      "CVE-2023-33128",
      "CVE-2023-33135"
    ],
    "7.0.109-r0": [
      "CVE-2023-33127",
      "CVE-2023-33170"
    ],
    "7.0.110-r0": [
      "CVE-2023-38178",
      "CVE-2023-35390",
      "CVE-2023-38180",
      "CVE-2023-35391"
    ],
    "7.0.111-r0": [
      "CVE-2023-36792",
      "CVE-2023-36793",
      "CVE-2023-36794",
      "CVE-2023-36796",
      "CVE-2023-36799"
    ],
    "7.0.112-r0": [
      "CVE-2023-36435",
      "CVE-2023-38171",
      "CVE-2023-44487"
    ],
    "7.0.113-r0": [
      "CVE-2023-36792",
      "CVE-2023-36793",
      "CVE-2023-36794",
      "CVE-2023-36796",
      "CVE-2023-36799",
      "CVE-2023-44487",
      "CVE-2023-38171",
      "CVE-2023-36435"
    ],
    "7.0.114-r0": [
      "CVE-2023-36049",
      "CVE-2023-36558"
    ],
    "7.0.115-r0": [
      "CVE-2024-0056",
      "CVE-2024-0057",
      "CVE-2024-21319"
    ],
    "7.0.116-r0": [
      "CVE-2024-21386",
      "CVE-2024-21404"
    ]
  },
  "apkurl": "{{urlprefix}}/{{distroversion}}/{{reponame}}/{{arch}}/{{pkg.name}}-{{pkg.ver}}.apk",
  "archs": [
    "aarch64",
    "armv7",
    "x86_64"
  ],
  "urlprefix": "https://dl-cdn.alpinelinux.org/alpine",
  "reponame": "community",
  "distroversion": "vedge"
}