{
  "name": "grub",
  "secfixes": {
    "2.06-r13": [
      "CVE-2021-3697"
    ],
    "2.06-r0": [
      "CVE-2021-3418",
      "CVE-2020-10713",
      "CVE-2020-14308",
      "CVE-2020-14309",
      "CVE-2020-14310",
      "CVE-2020-14311",
      "CVE-2020-14372",
      "CVE-2020-15705",
      "CVE-2020-15706",
      "CVE-2020-15707",
      "CVE-2020-25632",
      "CVE-2020-25647",
      "CVE-2020-27749",
      "CVE-2020-27779",
      "CVE-2021-20225",
      "CVE-2021-20233"
    ]
  },
  "apkurl": "{{urlprefix}}/{{distroversion}}/{{reponame}}/{{arch}}/{{pkg.name}}-{{pkg.ver}}.apk",
  "archs": [
    "aarch64",
    "armhf",
    "armv7",
    "mips64",
    "mips64el",
    "ppc64le",
    "x86",
    "x86_64"
  ],
  "urlprefix": "https://dl-cdn.alpinelinux.org/alpine",
  "reponame": "main",
  "distroversion": "vedge"
}