{
  "name": "firefox",
  "secfixes": {
    "103.0-r0": [
      "CVE-2022-2505",
      "CVE-2022-36314",
      "CVE-2022-36315",
      "CVE-2022-36316",
      "CVE-2022-36317",
      "CVE-2022-36318",
      "CVE-2022-36319",
      "CVE-2022-36320"
    ],
    "102.0-r0": [
      "CVE-2022-2200",
      "CVE-2022-34468",
      "CVE-2022-34469",
      "CVE-2022-34470",
      "CVE-2022-34471",
      "CVE-2022-34472",
      "CVE-2022-34473",
      "CVE-2022-34474",
      "CVE-2022-34475",
      "CVE-2022-34476",
      "CVE-2022-34477",
      "CVE-2022-34478",
      "CVE-2022-34479",
      "CVE-2022-34480",
      "CVE-2022-34481",
      "CVE-2022-34482",
      "CVE-2022-34483",
      "CVE-2022-34484",
      "CVE-2022-34485"
    ],
    "101.0-r0": [
      "CVE-2022-1919",
      "CVE-2022-31736",
      "CVE-2022-31737",
      "CVE-2022-31738",
      "CVE-2022-31739",
      "CVE-2022-31740",
      "CVE-2022-31741",
      "CVE-2022-31742",
      "CVE-2022-31743",
      "CVE-2022-31744",
      "CVE-2022-31745",
      "CVE-2022-31747",
      "CVE-2022-31748"
    ],
    "100.0.2-r0": [
      "CVE-2022-1529",
      "CVE-2022-1802"
    ],
    "100.0-r0": [
      "CVE-2022-29909",
      "CVE-2022-29910",
      "CVE-2022-29911",
      "CVE-2022-29912",
      "CVE-2022-29914",
      "CVE-2022-29915",
      "CVE-2022-29916",
      "CVE-2022-29917",
      "CVE-2022-29918"
    ],
    "99.0-r0": [
      "CVE-2022-1097",
      "CVE-2022-24713",
      "CVE-2022-28281",
      "CVE-2022-28282",
      "CVE-2022-28283",
      "CVE-2022-28284",
      "CVE-2022-28285",
      "CVE-2022-28286",
      "CVE-2022-28287",
      "CVE-2022-28288",
      "CVE-2022-28289"
    ],
    "98.0-r0": [
      "CVE-2022-0843",
      "CVE-2022-26381",
      "CVE-2022-26382",
      "CVE-2022-26383",
      "CVE-2022-26384",
      "CVE-2022-26385",
      "CVE-2022-26387"
    ],
    "97.0.2-r0": [
      "CVE-2022-26485",
      "CVE-2022-26486"
    ],
    "97.0-r0": [
      "CVE-2021-4140",
      "CVE-2022-0511",
      "CVE-2022-22736",
      "CVE-2022-22737",
      "CVE-2022-22738",
      "CVE-2022-22739",
      "CVE-2022-22740",
      "CVE-2022-22741",
      "CVE-2022-22742",
      "CVE-2022-22743",
      "CVE-2022-22744",
      "CVE-2022-22745",
      "CVE-2022-22746",
      "CVE-2022-22747",
      "CVE-2022-22748",
      "CVE-2022-22749",
      "CVE-2022-22750",
      "CVE-2022-22751",
      "CVE-2022-22752",
      "CVE-2022-22753",
      "CVE-2022-22754",
      "CVE-2022-22755",
      "CVE-2022-22756",
      "CVE-2022-22757",
      "CVE-2022-22758",
      "CVE-2022-22759",
      "CVE-2022-22760",
      "CVE-2022-22761",
      "CVE-2022-22762",
      "CVE-2022-22764"
    ],
    "95.0-r0": [
      "CVE-2021-43536",
      "CVE-2021-43537",
      "CVE-2021-43538",
      "CVE-2021-43539",
      "CVE-2021-43540",
      "CVE-2021-43541",
      "CVE-2021-43542",
      "CVE-2021-43543",
      "CVE-2021-43544",
      "CVE-2021-43545",
      "CVE-2021-43546"
    ],
    "94.0-r0": [
      "CVE-2021-38503",
      "CVE-2021-38504",
      "CVE-2021-38505",
      "CVE-2021-38506",
      "CVE-2021-38507",
      "CVE-2021-38508",
      "CVE-2021-38509",
      "CVE-2021-38510"
    ],
    "93.0-r0": [
      "CVE-2021-32810",
      "CVE-2021-38496",
      "CVE-2021-38497",
      "CVE-2021-38498",
      "CVE-2021-38499",
      "CVE-2021-38500",
      "CVE-2021-38501"
    ],
    "92.0.1-r0": [
      "CVE-2021-29980",
      "CVE-2021-29981",
      "CVE-2021-29982",
      "CVE-2021-29983",
      "CVE-2021-29984",
      "CVE-2021-29985",
      "CVE-2021-29986",
      "CVE-2021-29987",
      "CVE-2021-29988",
      "CVE-2021-29989",
      "CVE-2021-29990",
      "CVE-2021-29991",
      "CVE-2021-29993",
      "CVE-2021-38491",
      "CVE-2021-38492",
      "CVE-2021-38493",
      "CVE-2021-38494"
    ],
    "90.0-r0": [
      "CVE-2021-29970",
      "CVE-2021-29972",
      "CVE-2021-29974",
      "CVE-2021-29975",
      "CVE-2021-29976",
      "CVE-2021-29977",
      "CVE-2021-30547"
    ],
    "89.0-r0": [
      "CVE-2021-29959",
      "CVE-2021-29960",
      "CVE-2021-29961",
      "CVE-2021-29962",
      "CVE-2021-29963",
      "CVE-2021-29965",
      "CVE-2021-29966",
      "CVE-2021-29967"
    ],
    "88.0.1-r0": [
      "CVE-2021-29952"
    ],
    "88.0-r0": [
      "CVE-2021-23994",
      "CVE-2021-23995",
      "CVE-2021-23996",
      "CVE-2021-23997",
      "CVE-2021-23998",
      "CVE-2021-23999",
      "CVE-2021-24000",
      "CVE-2021-24001",
      "CVE-2021-24002",
      "CVE-2021-29944",
      "CVE-2021-29945",
      "CVE-2021-29946",
      "CVE-2021-29947"
    ],
    "87.0-r0": [
      "CVE-2021-23968",
      "CVE-2021-23969",
      "CVE-2021-23970",
      "CVE-2021-23971",
      "CVE-2021-23972",
      "CVE-2021-23973",
      "CVE-2021-23974",
      "CVE-2021-23975",
      "CVE-2021-23976",
      "CVE-2021-23977",
      "CVE-2021-23978",
      "CVE-2021-23979",
      "CVE-2021-23981",
      "CVE-2021-23982",
      "CVE-2021-23983",
      "CVE-2021-23984",
      "CVE-2021-23985",
      "CVE-2021-23986",
      "CVE-2021-23987",
      "CVE-2021-23988"
    ],
    "85.0-r0": [
      "CVE-2021-23954",
      "CVE-2021-23955",
      "CVE-2021-23956",
      "CVE-2021-23957",
      "CVE-2021-23958",
      "CVE-2021-23959",
      "CVE-2021-23960",
      "CVE-2021-23961",
      "CVE-2021-23962",
      "CVE-2021-23963",
      "CVE-2021-23964",
      "CVE-2021-23965"
    ],
    "84.0.2-r0": [
      "CVE-2020-16044"
    ],
    "84.0.1-r0": [
      "CVE-2020-16042",
      "CVE-2020-26971",
      "CVE-2020-26972",
      "CVE-2020-26973",
      "CVE-2020-26974",
      "CVE-2020-26975",
      "CVE-2020-26976",
      "CVE-2020-26977",
      "CVE-2020-26978",
      "CVE-2020-26979",
      "CVE-2020-35111",
      "CVE-2020-35112",
      "CVE-2020-35113",
      "CVE-2020-35114"
    ],
    "83.0-r0": [
      "CVE-2020-15999",
      "CVE-2020-16012",
      "CVE-2020-26952",
      "CVE-2020-26953",
      "CVE-2020-26954",
      "CVE-2020-26955",
      "CVE-2020-26956",
      "CVE-2020-26957",
      "CVE-2020-26958",
      "CVE-2020-26959",
      "CVE-2020-26960",
      "CVE-2020-26961",
      "CVE-2020-26962",
      "CVE-2020-26963",
      "CVE-2020-26964",
      "CVE-2020-26965",
      "CVE-2020-26966",
      "CVE-2020-26967",
      "CVE-2020-26968",
      "CVE-2020-26969"
    ],
    "82.0.3-r0": [
      "CVE-2020-26950"
    ],
    "82.0-r0": [
      "CVE-2020-15254",
      "CVE-2020-15680",
      "CVE-2020-15681",
      "CVE-2020-15682",
      "CVE-2020-15683",
      "CVE-2020-15684",
      "CVE-2020-15969"
    ],
    "81.0-r0": [
      "CVE-2020-15673",
      "CVE-2020-15674",
      "CVE-2020-15675",
      "CVE-2020-15676",
      "CVE-2020-15677",
      "CVE-2020-15678"
    ],
    "80.0-r0": [
      "CVE-2020-6829",
      "CVE-2020-12400",
      "CVE-2020-12401",
      "CVE-2020-15663",
      "CVE-2020-15664",
      "CVE-2020-15665",
      "CVE-2020-15666",
      "CVE-2020-15667",
      "CVE-2020-15668",
      "CVE-2020-15670"
    ],
    "79.0-r0": [
      "CVE-2020-6463",
      "CVE-2020-6514",
      "CVE-2020-15652",
      "CVE-2020-15653",
      "CVE-2020-15654",
      "CVE-2020-15655",
      "CVE-2020-15656",
      "CVE-2020-15657",
      "CVE-2020-15658",
      "CVE-2020-15659"
    ],
    "78.0-r0": [
      "CVE-2020-12415",
      "CVE-2020-12416",
      "CVE-2020-12417",
      "CVE-2020-12418",
      "CVE-2020-12419",
      "CVE-2020-12420",
      "CVE-2020-12402",
      "CVE-2020-12421",
      "CVE-2020-12422",
      "CVE-2020-12423",
      "CVE-2020-12424",
      "CVE-2020-12425",
      "CVE-2020-12426"
    ],
    "77.0-r0": [
      "CVE-2020-12399",
      "CVE-2020-12405",
      "CVE-2020-12406",
      "CVE-2020-12407",
      "CVE-2020-12408",
      "CVE-2020-12409",
      "CVE-2020-12411"
    ],
    "76.0-r0": [
      "CVE-2020-6831",
      "CVE-2020-12387",
      "CVE-2020-12388",
      "CVE-2020-12389",
      "CVE-2020-12390",
      "CVE-2020-12391",
      "CVE-2020-12392",
      "CVE-2020-12393",
      "CVE-2020-12394",
      "CVE-2020-12395",
      "CVE-2020-12396"
    ],
    "75.0-r0": [
      "CVE-2020-6821",
      "CVE-2020-6822",
      "CVE-2020-6823",
      "CVE-2020-6824",
      "CVE-2020-6825",
      "CVE-2020-6826"
    ],
    "74.0.1-r0": [
      "CVE-2020-6819",
      "CVE-2020-6820"
    ],
    "74.0-r0": [
      "CVE-2020-6805",
      "CVE-2020-6806",
      "CVE-2020-6807",
      "CVE-2020-6808",
      "CVE-2020-6809",
      "CVE-2020-6810",
      "CVE-2020-6811",
      "CVE-2019-20503",
      "CVE-2020-6812",
      "CVE-2020-6813",
      "CVE-2020-6814",
      "CVE-2020-6815"
    ],
    "71.0.1-r0": [
      "CVE-2019-17016",
      "CVE-2019-17017",
      "CVE-2019-17020",
      "CVE-2019-17022",
      "CVE-2019-17023",
      "CVE-2019-17024",
      "CVE-2019-17025",
      "CVE-2019-17026"
    ],
    "70.0-r0": [
      "CVE-2018-6156",
      "CVE-2019-15903",
      "CVE-2019-11757",
      "CVE-2019-11759",
      "CVE-2019-11760",
      "CVE-2019-11761",
      "CVE-2019-11762",
      "CVE-2019-11763",
      "CVE-2019-11764",
      "CVE-2019-11765",
      "CVE-2019-17000",
      "CVE-2019-17001",
      "CVE-2019-17002"
    ],
    "68.0.2-r0": [
      "CVE-2019-11733"
    ]
  },
  "apkurl": "{{urlprefix}}/{{distroversion}}/{{reponame}}/{{arch}}/{{pkg.name}}-{{pkg.ver}}.apk",
  "archs": [
    "aarch64",
    "armv7",
    "x86",
    "x86_64"
  ],
  "urlprefix": "https://dl-cdn.alpinelinux.org/alpine",
  "reponame": "community",
  "distroversion": "v3.17"
}