{
  "name": "djvulibre",
  "secfixes": {
    "3.5.28-r1": [
      "CVE-2021-3500",
      "CVE-2021-3630",
      "CVE-2021-32490",
      "CVE-2021-32491",
      "CVE-2021-32492",
      "CVE-2021-32493"
    ]
  },
  "apkurl": "{{urlprefix}}/{{distroversion}}/{{reponame}}/{{arch}}/{{pkg.name}}-{{pkg.ver}}.apk",
  "archs": [
    "aarch64",
    "armhf",
    "armv7",
    "mips64",
    "mips64el",
    "ppc64le",
    "s390x",
    "x86",
    "x86_64"
  ],
  "urlprefix": "https://dl-cdn.alpinelinux.org/alpine",
  "reponame": "community",
  "distroversion": "vedge"
}