{
  "name": "python2",
  "secfixes": {
    "2.7.15-r0": [
      "CVE-2018-1060",
      "CVE-2018-1061"
    ],
    "2.7.14-r0": [
      "CVE-2017-1000158"
    ],
    "2.7.7-r0": [
      "CVE-2014-4616"
    ]
  },
  "apkurl": "{{urlprefix}}/{{distroversion}}/{{reponame}}/{{arch}}/{{pkg.name}}-{{pkg.ver}}.apk",
  "archs": [
    "aarch64",
    "armhf",
    "armv7",
    "mips64",
    "mips64el",
    "ppc64le",
    "s390x",
    "x86",
    "x86_64"
  ],
  "urlprefix": "https://dl-cdn.alpinelinux.org/alpine",
  "reponame": "main",
  "distroversion": "v3.5"
}