{
  "name": "rsync",
  "secfixes": {
    "3.4.0-r0": [
      "CVE-2024-12084",
      "CVE-2024-12085",
      "CVE-2024-12086",
      "CVE-2024-12087",
      "CVE-2024-12088",
      "CVE-2024-12747"
    ],
    "3.2.4-r2": [
      "CVE-2022-29154"
    ],
    "3.1.2-r7": [
      "CVE-2017-16548",
      "CVE-2017-17433",
      "CVE-2017-17434"
    ],
    "0": [
      "CVE-2020-14387"
    ]
  },
  "apkurl": "{{urlprefix}}/{{distroversion}}/{{reponame}}/{{arch}}/{{pkg.name}}-{{pkg.ver}}.apk",
  "archs": [
    "aarch64",
    "armhf",
    "armv7",
    "mips64",
    "mips64el",
    "ppc64le",
    "s390x",
    "x86",
    "x86_64"
  ],
  "urlprefix": "https://dl-cdn.alpinelinux.org/alpine",
  "reponame": "main",
  "distroversion": "v3.20"
}