{
  "name": "sqlite",
  "secfixes": {
    "3.28.0-r3": [
      "CVE-2020-11655"
    ],
    "3.28.0-r2": [
      "CVE-2019-19242",
      "CVE-2019-19244"
    ],
    "3.28.0-r1": [
      "CVE-2019-16168"
    ],
    "3.28.0-r0": [
      "CVE-2019-5018",
      "CVE-2019-8457"
    ]
  },
  "apkurl": "{{urlprefix}}/{{distroversion}}/{{reponame}}/{{arch}}/{{pkg.name}}-{{pkg.ver}}.apk",
  "archs": [
    "aarch64",
    "armhf",
    "armv7",
    "mips64",
    "mips64el",
    "ppc64le",
    "s390x",
    "x86",
    "x86_64"
  ],
  "urlprefix": "https://dl-cdn.alpinelinux.org/alpine",
  "reponame": "main",
  "distroversion": "v3.9"
}