{
  "name": "py3-cryptography",
  "secfixes": {
    "41.0.2-r0": [
      "CVE-2023-38325"
    ],
    "39.0.1-r0": [
      "CVE-2023-23931"
    ],
    "3.2.2-r0": [
      "CVE-2020-36242"
    ],
    "3.2.1-r0": [
      "CVE-2020-25659"
    ]
  },
  "apkurl": "{{urlprefix}}/{{distroversion}}/{{reponame}}/{{arch}}/{{pkg.name}}-{{pkg.ver}}.apk",
  "archs": [
    "aarch64",
    "armhf",
    "armv7",
    "mips64",
    "mips64el",
    "ppc64le",
    "s390x",
    "x86",
    "x86_64"
  ],
  "urlprefix": "https://dl-cdn.alpinelinux.org/alpine",
  "reponame": "community",
  "distroversion": "v3.19"
}