{
  "name": "elfutils",
  "secfixes": {
    "0.176-r0": [
      "CVE-2019-7146",
      "CVE-2019-7148",
      "CVE-2019-7149",
      "CVE-2019-7150",
      "CVE-2019-7664",
      "CVE-2019-7665"
    ],
    "0.175-r0": [
      "CVE-2019-18310",
      "CVE-2019-18520",
      "CVE-2019-18521"
    ],
    "0.174-r0": [
      "CVE-2019-16062",
      "CVE-2019-16402",
      "CVE-2019-16403"
    ],
    "0.168-r1": [
      "CVE-2017-7607",
      "CVE-2017-7608"
    ]
  },
  "apkurl": "{{urlprefix}}/{{distroversion}}/{{reponame}}/{{arch}}/{{pkg.name}}-{{pkg.ver}}.apk",
  "archs": [
    "aarch64",
    "armhf",
    "armv7",
    "mips64",
    "mips64el",
    "ppc64le",
    "s390x",
    "x86",
    "x86_64"
  ],
  "urlprefix": "https://dl-cdn.alpinelinux.org/alpine",
  "reponame": "main",
  "distroversion": "v3.13"
}