{
  "name": "dropbear",
  "secfixes": {
    "2022.83-r4": [
      "CVE-2023-48795"
    ],
    "2020.79-r0": [
      "CVE-2018-20685"
    ],
    "2018.76-r2": [
      "CVE-2018-15599"
    ]
  },
  "apkurl": "{{urlprefix}}/{{distroversion}}/{{reponame}}/{{arch}}/{{pkg.name}}-{{pkg.ver}}.apk",
  "archs": [
    "aarch64",
    "armhf",
    "armv7",
    "mips64",
    "mips64el",
    "ppc64le",
    "s390x",
    "x86",
    "x86_64"
  ],
  "urlprefix": "https://dl-cdn.alpinelinux.org/alpine",
  "reponame": "main",
  "distroversion": "v3.20"
}