{
  "name": "py3-jinja2",
  "secfixes": {
    "3.1.5-r0": [
      "CVE-2024-56326",
      "CVE-2024-56201"
    ],
    "3.1.4-r0": [
      "CVE-2024-22195",
      "CVE-2024-34064"
    ],
    "1.11.3-r0": [
      "CVE-2020-28493"
    ]
  },
  "apkurl": "{{urlprefix}}/{{distroversion}}/{{reponame}}/{{arch}}/{{pkg.name}}-{{pkg.ver}}.apk",
  "archs": [

  ],
  "urlprefix": "https://dl-cdn.alpinelinux.org/alpine",
  "reponame": "main",
  "distroversion": "v3.19"
}