{
  "name": "busybox",
  "secfixes": {
    "1.31.1-r22": [

    ],
    "- ALPINE-13661": [
      "CVE-2022-28391"
    ],
    "1.31.1-r21": [
      "CVE-2021-42374",
      "CVE-2021-42378",
      "CVE-2021-42379",
      "CVE-2021-42380",
      "CVE-2021-42381",
      "CVE-2021-42382",
      "CVE-2021-42383",
      "CVE-2021-42384",
      "CVE-2021-42385",
      "CVE-2021-42386"
    ],
    "1.31.1-r20": [
      "CVE-2021-28831"
    ],
    "1.30.1-r2": [
      "CVE-2019-5747"
    ],
    "1.29.3-r10": [
      "CVE-2018-20679"
    ],
    "1.28.3-r2": [
      "CVE-2018-1000500"
    ],
    "1.27.2-r4": [
      "CVE-2017-16544",
      "CVE-2017-15873",
      "CVE-2017-15874"
    ],
    "0": [
      "CVE-2021-42373",
      "CVE-2021-42375",
      "CVE-2021-42376",
      "CVE-2021-42377"
    ]
  },
  "apkurl": "{{urlprefix}}/{{distroversion}}/{{reponame}}/{{arch}}/{{pkg.name}}-{{pkg.ver}}.apk",
  "archs": [
    "aarch64",
    "armhf",
    "armv7",
    "mips64",
    "mips64el",
    "ppc64le",
    "s390x",
    "x86",
    "x86_64"
  ],
  "urlprefix": "https://dl-cdn.alpinelinux.org/alpine",
  "reponame": "main",
  "distroversion": "v3.12"
}