{
  "name": "jenkins",
  "secfixes": {
    "2.199-r0": [
      "CVE-2019-10401",
      "CVE-2019-10402",
      "CVE-2019-10403",
      "CVE-2019-10404",
      "CVE-2019-10405",
      "CVE-2019-10406"
    ]
  },
  "apkurl": "{{urlprefix}}/{{distroversion}}/{{reponame}}/{{arch}}/{{pkg.name}}-{{pkg.ver}}.apk",
  "archs": [

  ],
  "urlprefix": "https://dl-cdn.alpinelinux.org/alpine",
  "reponame": "community",
  "distroversion": "v3.10"
}