{
  "name": "cairo",
  "secfixes": {
    "1.17.4-r1": [
      "CVE-2019-6462"
    ],
    "1.16.0-r2": [
      "CVE-2020-35492"
    ],
    "1.16.0-r1": [
      "CVE-2018-19876"
    ]
  },
  "apkurl": "{{urlprefix}}/{{distroversion}}/{{reponame}}/{{arch}}/{{pkg.name}}-{{pkg.ver}}.apk",
  "archs": [
    "aarch64",
    "armhf",
    "armv7",
    "mips64",
    "mips64el",
    "ppc64le",
    "s390x",
    "x86",
    "x86_64"
  ],
  "urlprefix": "https://dl-cdn.alpinelinux.org/alpine",
  "reponame": "main",
  "distroversion": "v3.21"
}