{
  "name": "gst-plugins-base1",
  "secfixes": {
    "1.8.3-r0": [
      "CVE-2016-9811",
      "CVE-2017-5837",
      "CVE-2017-5839",
      "CVE-2017-5842",
      "CVE-2017-5844"
    ]
  },
  "apkurl": "{{urlprefix}}/{{distroversion}}/{{reponame}}/{{arch}}/{{pkg.name}}-{{pkg.ver}}.apk",
  "archs": [
    "aarch64",
    "armhf",
    "armv7",
    "mips64",
    "mips64el",
    "ppc64le",
    "s390x",
    "x86",
    "x86_64"
  ],
  "urlprefix": "https://dl-cdn.alpinelinux.org/alpine",
  "reponame": "main",
  "distroversion": "v3.4"
}