{
  "name": "py3-twisted",
  "secfixes": {
    "22.4.0-r0": [
      "CVE-2022-24801"
    ],
    "22.2.0-r0": [
      "CVE-2022-21716"
    ],
    "22.1.0-r0": [
      "CVE-2022-21712"
    ],
    "20.3.0-r0": [
      "CVE-2020-10108",
      "CVE-2020-10109"
    ],
    "19.10.0-r0": [
      "CVE-2019-9512",
      "CVE-2019-9514",
      "CVE-2019-9515"
    ],
    "19.7.0-r0": [
      "CVE-2019-12387",
      "CVE-2019-12855"
    ],
    "16.4.0-r0": [
      "CVE-2016-1000111"
    ]
  },
  "apkurl": "{{urlprefix}}/{{distroversion}}/{{reponame}}/{{arch}}/{{pkg.name}}-{{pkg.ver}}.apk",
  "archs": [
    "aarch64",
    "armhf",
    "armv7",
    "mips64",
    "mips64el",
    "ppc64le",
    "s390x",
    "x86",
    "x86_64"
  ],
  "urlprefix": "https://dl-cdn.alpinelinux.org/alpine",
  "reponame": "community",
  "distroversion": "v3.18"
}