{
  "name": "cpio",
  "secfixes": {
    "2.13-r2": [
      "CVE-2021-38185"
    ],
    "2.13-r0": [
      "CVE-2015-1197",
      "CVE-2019-14866"
    ],
    "2.12-r3": [
      "CVE-2016-2037"
    ]
  },
  "apkurl": "{{urlprefix}}/{{distroversion}}/{{reponame}}/{{arch}}/{{pkg.name}}-{{pkg.ver}}.apk",
  "archs": [
    "aarch64",
    "armhf",
    "armv7",
    "mips64",
    "mips64el",
    "ppc64le",
    "s390x",
    "x86",
    "x86_64"
  ],
  "urlprefix": "https://dl-cdn.alpinelinux.org/alpine",
  "reponame": "community",
  "distroversion": "v3.14"
}