{
  "name": "libjpeg-turbo",
  "secfixes": {
    "1.5.3-r3": [
      "CVE-2018-14498"
    ],
    "1.5.3-r2": [
      "CVE-2018-11813"
    ],
    "1.5.3-r1": [
      "CVE-2018-1152"
    ],
    "1.5.3-r0": [
      "CVE-2017-15232"
    ]
  },
  "apkurl": "{{urlprefix}}/{{distroversion}}/{{reponame}}/{{arch}}/{{pkg.name}}-{{pkg.ver}}.apk",
  "archs": [
    "aarch64",
    "armhf",
    "armv7",
    "mips64",
    "mips64el",
    "ppc64le",
    "s390x",
    "x86",
    "x86_64"
  ],
  "urlprefix": "https://dl-cdn.alpinelinux.org/alpine",
  "reponame": "main",
  "distroversion": "v3.7"
}