{
  "name": "freetype",
  "secfixes": {
    "2.10.4-r3": [
      "CVE-2022-27405",
      "CVE-2022-27406"
    ],
    "2.10.4-r2": [
      "CVE-2022-27404"
    ],
    "2.10.4-r0": [
      "CVE-2020-15999"
    ],
    "2.9-r1": [
      "CVE-2018-6942"
    ],
    "2.7.1-r1": [
      "CVE-2017-8105",
      "CVE-2017-8287"
    ]
  },
  "apkurl": "{{urlprefix}}/{{distroversion}}/{{reponame}}/{{arch}}/{{pkg.name}}-{{pkg.ver}}.apk",
  "archs": [
    "aarch64",
    "armhf",
    "armv7",
    "mips64",
    "mips64el",
    "ppc64le",
    "s390x",
    "x86",
    "x86_64"
  ],
  "urlprefix": "https://dl-cdn.alpinelinux.org/alpine",
  "reponame": "main",
  "distroversion": "v3.13"
}