{
  "name": "docker",
  "secfixes": {
    "27.1.1-r0": [
      "CVE-2024-41110"
    ],
    "26.0.2-r0": [
      "CVE-2024-32473"
    ],
    "26.0.0-r0": [
      "CVE-2024-29018"
    ],
    "25.0.2-r0": [
      "CVE-2024-23651",
      "CVE-2024-23652",
      "CVE-2024-23653",
      "CVE-2024-23650",
      "CVE-2024-24557"
    ],
    "23.0.3-r0": [
      "CVE-2023-28840",
      "CVE-2023-28841",
      "CVE-2023-28842"
    ],
    "23.0.2-r0": [
      "CVE-2023-26054"
    ],
    "20.10.20-r0": [
      "CVE-2022-39253"
    ],
    "20.10.18-r0": [
      "CVE-2022-36109"
    ],
    "20.10.16-r0": [
      "CVE-2022-29526"
    ],
    "20.10.14-r0": [
      "CVE-2022-24769"
    ],
    "20.10.11-r0": [
      "CVE-2021-41190"
    ],
    "20.10.9-r0": [
      "CVE-2021-41089",
      "CVE-2021-41091",
      "CVE-2021-41092"
    ],
    "20.10.3-r0": [
      "CVE-2021-21285",
      "CVE-2021-21284"
    ],
    "19.03.14-r0": [
      "CVE-2020-15257"
    ],
    "19.03.11-r0": [
      "CVE-2020-13401"
    ],
    "19.03.1-r0": [
      "CVE-2019-14271"
    ],
    "18.09.8-r0": [
      "CVE-2019-13509"
    ],
    "18.09.7-r0": [
      "CVE-2018-15664"
    ]
  },
  "apkurl": "{{urlprefix}}/{{distroversion}}/{{reponame}}/{{arch}}/{{pkg.name}}-{{pkg.ver}}.apk",
  "archs": [
    "aarch64",
    "armhf",
    "armv7",
    "mips64",
    "mips64el",
    "ppc64le",
    "s390x",
    "x86",
    "x86_64"
  ],
  "urlprefix": "https://dl-cdn.alpinelinux.org/alpine",
  "reponame": "community",
  "distroversion": "vedge"
}