{
  "name": "hdf5",
  "secfixes": {
    "1.12.2-r0": [
      "CVE-2018-17432"
    ],
    "1.12.1-r0": [
      "CVE-2018-11206",
      "CVE-2018-13869",
      "CVE-2018-13870",
      "CVE-2018-14033",
      "CVE-2018-14460",
      "CVE-2018-17435",
      "CVE-2019-9151",
      "CVE-2020-10811"
    ]
  },
  "apkurl": "{{urlprefix}}/{{distroversion}}/{{reponame}}/{{arch}}/{{pkg.name}}-{{pkg.ver}}.apk",
  "archs": [
    "aarch64",
    "armhf",
    "armv7",
    "mips64",
    "mips64el",
    "ppc64le",
    "s390x",
    "x86",
    "x86_64"
  ],
  "urlprefix": "https://dl-cdn.alpinelinux.org/alpine",
  "reponame": "community",
  "distroversion": "vedge"
}