{
  "name": "ofono",
  "secfixes": {
    "2.11-r0": [
      "CVE-2024-7543",
      "CVE-2024-7544",
      "CVE-2024-7545",
      "CVE-2024-7546",
      "CVE-2024-7547"
    ]
  },
  "apkurl": "{{urlprefix}}/{{distroversion}}/{{reponame}}/{{arch}}/{{pkg.name}}-{{pkg.ver}}.apk",
  "archs": [
    "aarch64",
    "armhf",
    "armv7",
    "mips64",
    "mips64el",
    "ppc64le",
    "s390x",
    "x86",
    "x86_64"
  ],
  "urlprefix": "https://dl-cdn.alpinelinux.org/alpine",
  "reponame": "community",
  "distroversion": "vedge"
}