{
  "name": "jupyter-notebook",
  "secfixes": {
    "6.4.12-r0": [
      "CVE-2022-29238"
    ],
    "6.4.10-r0": [
      "CVE-2022-24758"
    ]
  },
  "apkurl": "{{urlprefix}}/{{distroversion}}/{{reponame}}/{{arch}}/{{pkg.name}}-{{pkg.ver}}.apk",
  "archs": [

  ],
  "urlprefix": "https://dl-cdn.alpinelinux.org/alpine",
  "reponame": "community",
  "distroversion": "v3.19"
}