{
  "name": "binutils",
  "secfixes": {
    "2.40-r10": [
      "CVE-2023-1972"
    ],
    "2.40-r0": [
      "CVE-2023-1579"
    ],
    "2.39-r2": [
      "CVE-2022-38533"
    ],
    "2.39-r0": [
      "CVE-2022-38126"
    ],
    "2.35.2-r1": [
      "CVE-2021-3487"
    ],
    "2.32-r0": [
      "CVE-2018-19931",
      "CVE-2018-19932",
      "CVE-2018-20002",
      "CVE-2018-20712"
    ],
    "2.28-r1": [
      "CVE-2017-7614"
    ]
  },
  "apkurl": "{{urlprefix}}/{{distroversion}}/{{reponame}}/{{arch}}/{{pkg.name}}-{{pkg.ver}}.apk",
  "archs": [
    "aarch64",
    "armhf",
    "armv7",
    "mips64",
    "mips64el",
    "ppc64le",
    "s390x",
    "x86",
    "x86_64"
  ],
  "urlprefix": "https://dl-cdn.alpinelinux.org/alpine",
  "reponame": "main",
  "distroversion": "v3.19"
}