{
  "name": "chromium",
  "secfixes": {
    "116.0.5845.187-r0": [
      "CVE-2023-4863"
    ],
    "103.0.5060.134-r0": [
      "CVE-2022-2163",
      "CVE-2022-2477",
      "CVE-2022-2478",
      "CVE-2022-2479",
      "CVE-2022-2480",
      "CVE-2022-2481"
    ],
    "103.0.5060.114-r0": [
      "CVE-2022-2294",
      "CVE-2022-2295",
      "CVE-2022-2296"
    ],
    "103.0.5060.53-r0": [
      "CVE-2022-2156",
      "CVE-2022-2157",
      "CVE-2022-2158",
      "CVE-2022-2160",
      "CVE-2022-2161",
      "CVE-2022-2162",
      "CVE-2022-2163",
      "CVE-2022-2164",
      "CVE-2022-2165"
    ],
    "102.0.5005.61-r0": [
      "CVE-2022-1853",
      "CVE-2022-1854",
      "CVE-2022-1855",
      "CVE-2022-1856",
      "CVE-2022-1857",
      "CVE-2022-1858",
      "CVE-2022-1859",
      "CVE-2022-1860",
      "CVE-2022-1861",
      "CVE-2022-1862",
      "CVE-2022-1863",
      "CVE-2022-1864",
      "CVE-2022-1865",
      "CVE-2022-1866",
      "CVE-2022-1867",
      "CVE-2022-1868",
      "CVE-2022-1869",
      "CVE-2022-1870",
      "CVE-2022-1871",
      "CVE-2022-1872",
      "CVE-2022-1873",
      "CVE-2022-1874",
      "CVE-2022-1875",
      "CVE-2022-1876"
    ],
    "101.0.4951.64-r0": [
      "CVE-2022-1633",
      "CVE-2022-1634",
      "CVE-2022-1635",
      "CVE-2022-1636",
      "CVE-2022-1637",
      "CVE-2022-1638",
      "CVE-2022-1639",
      "CVE-2022-1640",
      "CVE-2022-1641"
    ],
    "101.0.4951.54-r0": [
      "CVE-2022-1477",
      "CVE-2022-1478",
      "CVE-2022-1479",
      "CVE-2022-1481",
      "CVE-2022-1482",
      "CVE-2022-1483",
      "CVE-2022-1484",
      "CVE-2022-1485",
      "CVE-2022-1486",
      "CVE-2022-1487",
      "CVE-2022-1488",
      "CVE-2022-1489",
      "CVE-2022-1490",
      "CVE-2022-1491",
      "CVE-2022-1492",
      "CVE-2022-1493",
      "CVE-2022-1494",
      "CVE-2022-1495",
      "CVE-2022-1496",
      "CVE-2022-1497",
      "CVE-2022-1498",
      "CVE-2022-1499",
      "CVE-2022-1500",
      "CVE-2022-1501"
    ],
    "100.0.4896.127-r0": [
      "CVE-2022-1364"
    ],
    "99.0.4844.84-r0": [
      "CVE-2022-1096"
    ],
    "98.0.4758.102-r0": [
      "CVE-2022-0452",
      "CVE-2022-0453",
      "CVE-2022-0454",
      "CVE-2022-0455",
      "CVE-2022-0456",
      "CVE-2022-0457",
      "CVE-2022-0458",
      "CVE-2022-0459",
      "CVE-2022-0460",
      "CVE-2022-0461",
      "CVE-2022-0462",
      "CVE-2022-0463",
      "CVE-2022-0464",
      "CVE-2022-0465",
      "CVE-2022-0466",
      "CVE-2022-0467",
      "CVE-2022-0468",
      "CVE-2022-0469",
      "CVE-2022-0470",
      "CVE-2022-0603",
      "CVE-2022-0604",
      "CVE-2022-0605",
      "CVE-2022-0606",
      "CVE-2022-0607",
      "CVE-2022-0608",
      "CVE-2022-0609",
      "CVE-2022-0610"
    ],
    "93.0.4577.82-r0": [
      "CVE-2021-30625",
      "CVE-2021-30626",
      "CVE-2021-30627",
      "CVE-2021-30628",
      "CVE-2021-30629",
      "CVE-2021-30630",
      "CVE-2021-30631",
      "CVE-2021-30632",
      "CVE-2021-30633"
    ],
    "93.0.4577.63-r0": [
      "CVE-2021-30606",
      "CVE-2021-30607",
      "CVE-2021-30608",
      "CVE-2021-30609",
      "CVE-2021-30610",
      "CVE-2021-30611",
      "CVE-2021-30612",
      "CVE-2021-30613",
      "CVE-2021-30614",
      "CVE-2021-30615",
      "CVE-2021-30616",
      "CVE-2021-30617",
      "CVE-2021-30618",
      "CVE-2021-30619",
      "CVE-2021-30620",
      "CVE-2021-30621",
      "CVE-2021-30622",
      "CVE-2021-30623",
      "CVE-2021-30624"
    ],
    "92.0.4515.159-r0": [
      "CVE-2021-30598",
      "CVE-2021-30599",
      "CVE-2021-30600",
      "CVE-2021-30601",
      "CVE-2021-30602",
      "CVE-2021-30603",
      "CVE-2021-30604",
      "CVE-2021-30590",
      "CVE-2021-30591",
      "CVE-2021-30592",
      "CVE-2021-30593",
      "CVE-2021-30594",
      "CVE-2021-30596",
      "CVE-2021-30597"
    ],
    "92.0.4515.107-r0": [
      "CVE-2021-30565",
      "CVE-2021-30566",
      "CVE-2021-30567",
      "CVE-2021-30568",
      "CVE-2021-30569",
      "CVE-2021-30571",
      "CVE-2021-30572",
      "CVE-2021-30573",
      "CVE-2021-30574",
      "CVE-2021-30575",
      "CVE-2021-30576",
      "CVE-2021-30577",
      "CVE-2021-30578",
      "CVE-2021-30579",
      "CVE-2021-30580",
      "CVE-2021-30581",
      "CVE-2021-30582",
      "CVE-2021-30583",
      "CVE-2021-30584",
      "CVE-2021-30585",
      "CVE-2021-30586",
      "CVE-2021-30587",
      "CVE-2021-30588",
      "CVE-2021-30589"
    ],
    "91.0.4472.164-r0": [
      "CVE-2021-30559",
      "CVE-2021-30541",
      "CVE-2021-30560",
      "CVE-2021-30561",
      "CVE-2021-30562",
      "CVE-2021-30563",
      "CVE-2021-30564"
    ],
    "91.0.4472.114-r0": [
      "CVE-2021-30554",
      "CVE-2021-30555",
      "CVE-2021-30556",
      "CVE-2021-30557"
    ],
    "91.0.4472.101-r0": [
      "CVE-2021-30544",
      "CVE-2021-30545",
      "CVE-2021-30546",
      "CVE-2021-30547",
      "CVE-2021-30548",
      "CVE-2021-30549",
      "CVE-2021-30550",
      "CVE-2021-30551",
      "CVE-2021-30552",
      "CVE-2021-30553"
    ],
    "91.0.4472.77-r0": [
      "CVE-2021-30521",
      "CVE-2021-30522",
      "CVE-2021-30523",
      "CVE-2021-30524",
      "CVE-2021-30525",
      "CVE-2021-30526",
      "CVE-2021-30527",
      "CVE-2021-30528",
      "CVE-2021-30529",
      "CVE-2021-30530",
      "CVE-2021-30531",
      "CVE-2021-30532",
      "CVE-2021-30533",
      "CVE-2021-30534",
      "CVE-2021-30535",
      "CVE-2021-30536",
      "CVE-2021-30537",
      "CVE-2021-30538",
      "CVE-2021-30539",
      "CVE-2021-30540"
    ],
    "90.0.4430.72-r0": [
      "CVE-2021-21201",
      "CVE-2021-21202",
      "CVE-2021-21203",
      "CVE-2021-21204",
      "CVE-2021-21205",
      "CVE-2021-21221",
      "CVE-2021-21207",
      "CVE-2021-21208",
      "CVE-2021-21209",
      "CVE-2021-21210",
      "CVE-2021-21211",
      "CVE-2021-21212",
      "CVE-2021-21213",
      "CVE-2021-21214",
      "CVE-2021-21215",
      "CVE-2021-21216",
      "CVE-2021-21217",
      "CVE-2021-21218",
      "CVE-2021-21219"
    ],
    "89.0.4389.128-r0": [
      "CVE-2021-21206",
      "CVE-2021-21220"
    ],
    "89.0.4389.114-r0": [
      "CVE-2021-21194",
      "CVE-2021-21195",
      "CVE-2021-21196",
      "CVE-2021-21197",
      "CVE-2021-21198",
      "CVE-2021-21199"
    ],
    "89.0.4389.90-r0": [
      "CVE-2021-21191",
      "CVE-2021-21192",
      "CVE-2021-21193"
    ],
    "89.0.4389.72-r0": [
      "CVE-2021-21158",
      "CVE-2021-21159",
      "CVE-2021-21160",
      "CVE-2021-21161",
      "CVE-2021-21162",
      "CVE-2021-21163",
      "CVE-2021-21164",
      "CVE-2021-21165",
      "CVE-2021-21166",
      "CVE-2021-21167",
      "CVE-2021-21168",
      "CVE-2021-21169",
      "CVE-2021-21170",
      "CVE-2021-21171",
      "CVE-2021-21172",
      "CVE-2021-21173",
      "CVE-2021-21174",
      "CVE-2021-21175",
      "CVE-2021-21176",
      "CVE-2021-21177",
      "CVE-2021-21178",
      "CVE-2021-21179",
      "CVE-2021-21180",
      "CVE-2020-27844",
      "CVE-2021-21181",
      "CVE-2021-21182",
      "CVE-2021-21183",
      "CVE-2021-21184",
      "CVE-2021-21185",
      "CVE-2021-21186",
      "CVE-2021-21187",
      "CVE-2021-21188",
      "CVE-2021-21189",
      "CVE-2021-21190"
    ],
    "83.0.4103.116-r0": [
      "CVE-2020-6505",
      "CVE-2020-6506",
      "CVE-2020-6507",
      "CVE-2020-6509"
    ],
    "72.0.3626.121-r0": [
      "CVE-2019-5786"
    ]
  },
  "apkurl": "{{urlprefix}}/{{distroversion}}/{{reponame}}/{{arch}}/{{pkg.name}}-{{pkg.ver}}.apk",
  "archs": [
    "aarch64",
    "armv7",
    "x86_64"
  ],
  "urlprefix": "https://dl-cdn.alpinelinux.org/alpine",
  "reponame": "community",
  "distroversion": "v3.21"
}