{
  "name": "h2o",
  "secfixes": {
    "2.2.6-r10": [
      "CVE-2023-44487"
    ],
    "2.2.6-r0": [
      "CVE-2019-9512",
      "CVE-2019-9514",
      "CVE-2019-9515"
    ]
  },
  "apkurl": "{{urlprefix}}/{{distroversion}}/{{reponame}}/{{arch}}/{{pkg.name}}-{{pkg.ver}}.apk",
  "archs": [
    "aarch64",
    "armhf",
    "armv7",
    "mips64",
    "mips64el",
    "ppc64le",
    "x86",
    "x86_64"
  ],
  "urlprefix": "https://dl-cdn.alpinelinux.org/alpine",
  "reponame": "community",
  "distroversion": "vedge"
}