{
  "name": "cacti",
  "secfixes": {
    "1.2.8-r0": [
      "CVE-2019-17358",
      "CVE-2020-8813",
      "CVE-2020-7237",
      "CVE-2020-7106"
    ]
  },
  "apkurl": "{{urlprefix}}/{{distroversion}}/{{reponame}}/{{arch}}/{{pkg.name}}-{{pkg.ver}}.apk",
  "archs": [

  ],
  "urlprefix": "https://dl-cdn.alpinelinux.org/alpine",
  "reponame": "community",
  "distroversion": "v3.11"
}