{
  "name": "py3-waitress",
  "secfixes": {
    "2.1.2-r0": [
      "CVE-2022-31015"
    ],
    "1.4.1-r0": [
      "CVE-2019-16789"
    ],
    "1.4.0-r0": [
      "CVE-2019-16785",
      "CVE-2019-16786"
    ]
  },
  "apkurl": "{{urlprefix}}/{{distroversion}}/{{reponame}}/{{arch}}/{{pkg.name}}-{{pkg.ver}}.apk",
  "archs": [

  ],
  "urlprefix": "https://dl-cdn.alpinelinux.org/alpine",
  "reponame": "community",
  "distroversion": "v3.21"
}