{
  "name": "k3s",
  "secfixes": {
    "1.21.3.1-r0": [
      "CVE-2021-32001"
    ],
    "1.21.1.1-r0": [
      "CVE-2021-30465"
    ],
    "1.20.6.1-r0": [
      "CVE-2021-25735"
    ],
    "1.20.5.1-r0": [
      "CVE-2021-21334"
    ],
    "1.19.4.2-r0": [
      "CVE-2020-15257"
    ],
    "1.18.6.1-r0": [
      "CVE-2020-8557",
      "CVE-2020-8559"
    ],
    "1.18.3.1-r0": [
      "CVE-2020-10749",
      "CVE-2020-8555"
    ],
    "0.8.1-r0": [
      "CVE-2019-9512",
      "CVE-2019-9514"
    ],
    "0.8.0-r0": [
      "CVE-2019-11247",
      "CVE-2019-11249"
    ]
  },
  "apkurl": "{{urlprefix}}/{{distroversion}}/{{reponame}}/{{arch}}/{{pkg.name}}-{{pkg.ver}}.apk",
  "archs": [
    "aarch64",
    "armhf",
    "armv7",
    "mips64",
    "mips64el",
    "ppc64le",
    "s390x",
    "x86",
    "x86_64"
  ],
  "urlprefix": "https://dl-cdn.alpinelinux.org/alpine",
  "reponame": "community",
  "distroversion": "v3.16"
}