{
  "name": "libidn",
  "secfixes": {
    "1.33-r0": [

    ],
    "-  CVE-2015-8948": [

    ],
    "-  CVE-2016-6261": [

    ],
    "-  CVE-2016-6262": [

    ],
    "-  CVE-2016-6263": [

    ]
  },
  "apkurl": "{{urlprefix}}/{{distroversion}}/{{reponame}}/{{arch}}/{{pkg.name}}-{{pkg.ver}}.apk",
  "archs": [
    "aarch64",
    "armhf",
    "armv7",
    "mips64",
    "mips64el",
    "ppc64le",
    "s390x",
    "x86",
    "x86_64"
  ],
  "urlprefix": "https://dl-cdn.alpinelinux.org/alpine",
  "reponame": "main",
  "distroversion": "v3.4"
}