{
  "name": "ffmpeg",
  "secfixes": {
    "3.4.6-r0": [
      "CVE-2018-15822",
      "CVE-2019-9718",
      "CVE-2019-9721",
      "CVE-2019-11338"
    ],
    "3.4.4-r0": [
      "CVE-2018-14395"
    ],
    "3.4.3-r0": [
      "CVE-2018-7557",
      "CVE-2018-7751",
      "CVE-2018-10001",
      "CVE-2018-12458",
      "CVE-2018-13300",
      "CVE-2018-13302",
      "CVE-2018-14394"
    ],
    "3.3.4-r0": [
      "CVE-2017-14054",
      "CVE-2017-14055",
      "CVE-2017-14056",
      "CVE-2017-14057",
      "CVE-2017-14058",
      "CVE-2017-14059",
      "CVE-2017-14169",
      "CVE-2017-14170",
      "CVE-2017-14171",
      "CVE-2017-14222",
      "CVE-2017-14223",
      "CVE-2017-14225"
    ]
  },
  "apkurl": "{{urlprefix}}/{{distroversion}}/{{reponame}}/{{arch}}/{{pkg.name}}-{{pkg.ver}}.apk",
  "archs": [
    "aarch64",
    "armhf",
    "armv7",
    "mips64",
    "mips64el",
    "ppc64le",
    "s390x",
    "x86",
    "x86_64"
  ],
  "urlprefix": "https://dl-cdn.alpinelinux.org/alpine",
  "reponame": "community",
  "distroversion": "v3.8"
}