{
  "name": "wavpack",
  "secfixes": {
    "5.4.0-r0": [
      "CVE-2020-35738"
    ],
    "5.1.0-r8": [
      "CVE-2019-1010319",
      "CVE-2019-1010317",
      "CVE-2019-1010315",
      "CVE-2019-11498"
    ],
    "5.1.0-r7": [
      "CVE-2018-19840",
      "CVE-2018-19841"
    ],
    "5.1.0-r6": [
      "CVE-2018-10536",
      "CVE-2018-10537",
      "CVE-2018-10538",
      "CVE-2018-10539",
      "CVE-2018-10340"
    ],
    "5.1.0-r3": [
      "CVE-2018-6767",
      "CVE-2018-7253",
      "CVE-2018-7254"
    ],
    "5.1.0-r0": [
      "CVE-2016-10169",
      "CVE-2016-10170",
      "CVE-2016-10171",
      "CVE-2016-10172"
    ]
  },
  "apkurl": "{{urlprefix}}/{{distroversion}}/{{reponame}}/{{arch}}/{{pkg.name}}-{{pkg.ver}}.apk",
  "archs": [
    "aarch64",
    "armhf",
    "armv7",
    "mips64",
    "mips64el",
    "ppc64le",
    "s390x",
    "x86",
    "x86_64"
  ],
  "urlprefix": "https://dl-cdn.alpinelinux.org/alpine",
  "reponame": "community",
  "distroversion": "v3.14"
}