{
  "name": "intel-ucode",
  "secfixes": {
    "20220809-r0": [
      "CVE-2022-21233"
    ],
    "20220510-r0": [
      "CVE-2022-21151"
    ],
    "20220207-r0": [
      "CVE-2021-0127",
      "CVE-2021-0146"
    ],
    "20210608-r0": [
      "CVE-2020-24489",
      "CVE-2020-24511",
      "CVE-2020-24513"
    ],
    "20210216-r0": [
      "CVE-2020-8698"
    ],
    "20201112-r0": [
      "CVE-2020-8694",
      "CVE-2020-8698"
    ],
    "20201110-r0": [
      "CVE-2020-8694",
      "CVE-2020-8698"
    ],
    "20200609-r0": [
      "CVE-2020-0548"
    ],
    "20191113-r0": [
      "CVE-2019-11135"
    ],
    "20191112-r0": [
      "CVE-2018-12126",
      "CVE-2019-11135"
    ],
    "20190918-r0": [
      "CVE-2019-11135"
    ],
    "20190618-r0": [
      "CVE-2018-12126"
    ],
    "20190514a-r0": [
      "CVE-2018-12126",
      "CVE-2017-5754",
      "CVE-2017-5753"
    ]
  },
  "apkurl": "{{urlprefix}}/{{distroversion}}/{{reponame}}/{{arch}}/{{pkg.name}}-{{pkg.ver}}.apk",
  "archs": [
    "x86",
    "x86_64"
  ],
  "urlprefix": "https://dl-cdn.alpinelinux.org/alpine",
  "reponame": "main",
  "distroversion": "v3.13"
}