{
  "name": "emacs",
  "secfixes": {
    "28.2-r3": [
      "CVE-2023-27986"
    ],
    "28.2-r2": [
      "CVE-2023-27985"
    ],
    "28.2-r1": [
      "CVE-2022-45939"
    ]
  },
  "apkurl": "{{urlprefix}}/{{distroversion}}/{{reponame}}/{{arch}}/{{pkg.name}}-{{pkg.ver}}.apk",
  "archs": [
    "aarch64",
    "armhf",
    "armv7",
    "mips64",
    "mips64el",
    "ppc64le",
    "s390x",
    "x86",
    "x86_64"
  ],
  "urlprefix": "https://dl-cdn.alpinelinux.org/alpine",
  "reponame": "community",
  "distroversion": "v3.17"
}