{
  "name": "synapse",
  "secfixes": {
    "1.47.1-r0": [
      "CVE-2021-41281"
    ],
    "1.41.1-r0": [
      "CVE-2021-39164",
      "CVE-2021-39163"
    ],
    "1.33.2-r0": [
      "CVE-2021-29471"
    ],
    "1.30.1-r0": [
      "CVE-2021-3449"
    ],
    "1.24.0-r0": [
      "CVE-2020-26257"
    ],
    "1.21.1-r0": [
      "CVE-2020-26891"
    ],
    "1.20.0-r0": [
      "CVE-2020-26890"
    ]
  },
  "apkurl": "{{urlprefix}}/{{distroversion}}/{{reponame}}/{{arch}}/{{pkg.name}}-{{pkg.ver}}.apk",
  "archs": [

  ],
  "urlprefix": "https://dl-cdn.alpinelinux.org/alpine",
  "reponame": "community",
  "distroversion": "v3.15"
}