{
  "name": "unzip",
  "secfixes": {
    "6.0-r9": [
      "CVE-2018-18384"
    ],
    "6.0-r7": [
      "CVE-2019-13232"
    ],
    "6.0-r3": [
      "CVE-2014-8139",
      "CVE-2014-8140",
      "CVE-2014-8141",
      "CVE-2014-9636",
      "CVE-2014-9913",
      "CVE-2016-9844",
      "CVE-2018-1000035"
    ],
    "6.0-r1": [
      "CVE-2015-7696",
      "CVE-2015-7697"
    ]
  },
  "apkurl": "{{urlprefix}}/{{distroversion}}/{{reponame}}/{{arch}}/{{pkg.name}}-{{pkg.ver}}.apk",
  "archs": [
    "aarch64",
    "armhf",
    "armv7",
    "mips64",
    "mips64el",
    "ppc64le",
    "s390x",
    "x86",
    "x86_64"
  ],
  "urlprefix": "https://dl-cdn.alpinelinux.org/alpine",
  "reponame": "main",
  "distroversion": "v3.12"
}