{
  "name": "pjproject",
  "secfixes": {
    "2.14-r0": [
      "CVE-2023-38703"
    ],
    "2.13.1-r0": [
      "CVE-2023-27585"
    ],
    "2.13-r0": [
      "CVE-2022-31031",
      "CVE-2022-39244",
      "CVE-2022-39269"
    ],
    "2.12.1-r0": [
      "CVE-2022-24754",
      "CVE-2022-24763",
      "CVE-2022-24764",
      "CVE-2022-24786",
      "CVE-2022-24792",
      "CVE-2022-24793"
    ],
    "2.12-r0": [
      "CVE-2021-37706",
      "CVE-2021-41141",
      "CVE-2021-43299",
      "CVE-2021-43300",
      "CVE-2021-43301",
      "CVE-2021-43302",
      "CVE-2021-43303",
      "CVE-2021-43804",
      "CVE-2021-43845",
      "CVE-2022-21722",
      "CVE-2022-21723",
      "CVE-2022-23608"
    ],
    "2.11.1-r0": [
      "CVE-2021-32686"
    ],
    "2.11-r0": [
      "CVE-2020-15260",
      "CVE-2021-21375"
    ]
  },
  "apkurl": "{{urlprefix}}/{{distroversion}}/{{reponame}}/{{arch}}/{{pkg.name}}-{{pkg.ver}}.apk",
  "archs": [
    "aarch64",
    "armhf",
    "armv7",
    "mips64",
    "mips64el",
    "ppc64le",
    "s390x",
    "x86",
    "x86_64"
  ],
  "urlprefix": "https://dl-cdn.alpinelinux.org/alpine",
  "reponame": "main",
  "distroversion": "vedge"
}