{
  "name": "firefox-esr",
  "secfixes": {
    "52.8.1-r0": [
      "CVE-2018-6126"
    ],
    "52.6.0-r0": [
      "CVE-2018-5089",
      "CVE-2018-5091",
      "CVE-2018-5095",
      "CVE-2018-5096",
      "CVE-2018-5097",
      "CVE-2018-5098",
      "CVE-2018-5099",
      "CVE-2018-5102",
      "CVE-2018-5103",
      "CVE-2018-5104",
      "CVE-2018-5117"
    ],
    "52.5.2-r0": [
      "CVE-2017-7843"
    ]
  },
  "apkurl": "{{urlprefix}}/{{distroversion}}/{{reponame}}/{{arch}}/{{pkg.name}}-{{pkg.ver}}.apk",
  "archs": [
    "aarch64",
    "armhf",
    "armv7",
    "mips64",
    "mips64el",
    "ppc64le",
    "s390x",
    "x86",
    "x86_64"
  ],
  "urlprefix": "https://dl-cdn.alpinelinux.org/alpine",
  "reponame": "community",
  "distroversion": "v3.7"
}