{
  "name": "libx11",
  "secfixes": {
    "1.6.12-r0": [
      "CVE-2020-14363"
    ],
    "1.6.10-r0": [
      "CVE-2020-14344"
    ],
    "1.6.6-r0": [
      "CVE-2018-14598",
      "CVE-2018-14599",
      "CVE-2018-14600"
    ]
  },
  "apkurl": "{{urlprefix}}/{{distroversion}}/{{reponame}}/{{arch}}/{{pkg.name}}-{{pkg.ver}}.apk",
  "archs": [
    "aarch64",
    "armhf",
    "armv7",
    "mips64",
    "mips64el",
    "ppc64le",
    "s390x",
    "x86",
    "x86_64"
  ],
  "urlprefix": "https://dl-cdn.alpinelinux.org/alpine",
  "reponame": "main",
  "distroversion": "v3.9"
}