{
  "name": "file",
  "secfixes": {
    "5.37-r1": [
      "CVE-2019-18218"
    ],
    "5.36-r0": [
      "CVE-2019-1543",
      "CVE-2019-8904",
      "CVE-2019-8905",
      "CVE-2019-8906",
      "CVE-2019-8907"
    ]
  },
  "apkurl": "{{urlprefix}}/{{distroversion}}/{{reponame}}/{{arch}}/{{pkg.name}}-{{pkg.ver}}.apk",
  "archs": [
    "aarch64",
    "armhf",
    "armv7",
    "mips64",
    "mips64el",
    "ppc64le",
    "s390x",
    "x86",
    "x86_64"
  ],
  "urlprefix": "https://dl-cdn.alpinelinux.org/alpine",
  "reponame": "main",
  "distroversion": "v3.14"
}