{
  "name": "qemu",
  "secfixes": {
    "2.8.1-r1": [
      "CVE-2016-7994",
      "CVE-2016-7995",
      "CVE-2016-8576",
      "CVE-2016-8577",
      "CVE-2016-8578",
      "CVE-2016-8668",
      "CVE-2016-8909",
      "CVE-2016-8910",
      "CVE-2016-9101",
      "CVE-2016-9102",
      "CVE-2016-9103",
      "CVE-2016-9104",
      "CVE-2016-9105",
      "CVE-2016-9106",
      "CVE-2017-2615",
      "CVE-2017-2620",
      "CVE-2017-5525",
      "CVE-2017-5552",
      "CVE-2017-5578",
      "CVE-2017-5579",
      "CVE-2017-5667",
      "CVE-2017-5856",
      "CVE-2017-5857",
      "CVE-2017-5898",
      "CVE-2017-5931"
    ]
  },
  "apkurl": "{{urlprefix}}/{{distroversion}}/{{reponame}}/{{arch}}/{{pkg.name}}-{{pkg.ver}}.apk",
  "archs": [
    "aarch64",
    "armhf",
    "armv7",
    "mips64",
    "mips64el",
    "ppc64le",
    "s390x",
    "x86",
    "x86_64"
  ],
  "urlprefix": "https://dl-cdn.alpinelinux.org/alpine",
  "reponame": "main",
  "distroversion": "v3.7"
}