{
  "name": "hostapd",
  "secfixes": {
    "2.10-r0": [
      "CVE-2022-23303",
      "CVE-2022-23304"
    ],
    "2.9-r3": [
      "CVE-2021-30004"
    ],
    "2.9-r2": [
      "CVE-2020-12695"
    ],
    "2.9-r1": [
      "CVE-2019-16275"
    ],
    "2.8-r0": [
      "CVE-2019-11555",
      "CVE-2019-9496"
    ],
    "2.6-r2": [
      "CVE-2017-13077",
      "CVE-2017-13078",
      "CVE-2017-13079",
      "CVE-2017-13080",
      "CVE-2017-13081",
      "CVE-2017-13082",
      "CVE-2017-13086",
      "CVE-2017-13087",
      "CVE-2017-13088"
    ]
  },
  "apkurl": "{{urlprefix}}/{{distroversion}}/{{reponame}}/{{arch}}/{{pkg.name}}-{{pkg.ver}}.apk",
  "archs": [
    "aarch64",
    "armhf",
    "armv7",
    "mips64",
    "mips64el",
    "ppc64le",
    "s390x",
    "x86",
    "x86_64"
  ],
  "urlprefix": "https://dl-cdn.alpinelinux.org/alpine",
  "reponame": "main",
  "distroversion": "v3.17"
}