{
  "name": "nodejs-current",
  "secfixes": {
    "15.10.0-r0": [
      "CVE-2021-22883",
      "CVE-2021-22884"
    ],
    "15.5.1-r0": [
      "CVE-2020-8265",
      "CVE-2020-8287"
    ],
    "15.3.0-r0": [
      "CVE-2020-8277"
    ],
    "14.11.0-r0": [
      "CVE-2020-8201",
      "CVE-2020-8251"
    ],
    "14.4.0-r0": [
      "CVE-2020-8172",
      "CVE-2020-11080",
      "CVE-2020-8174"
    ],
    "13.11.0-r0": [
      "CVE-2019-15604",
      "CVE-2019-15605",
      "CVE-2019-15606"
    ],
    "11.10.1-r0": [
      "CVE-2019-5737"
    ],
    "11.3.0-r0": [
      "CVE-2018-12121",
      "CVE-2018-12122",
      "CVE-2018-12123",
      "CVE-2018-0735",
      "CVE-2018-0734"
    ],
    "9.10.0-r0": [
      "CVE-2018-7158",
      "CVE-2018-7159",
      "CVE-2018-7160"
    ],
    "9.2.1-r0": [
      "CVE-2017-15896",
      "CVE-2017-15897"
    ],
    "": [

    ]
  },
  "apkurl": "{{urlprefix}}/{{distroversion}}/{{reponame}}/{{arch}}/{{pkg.name}}-{{pkg.ver}}.apk",
  "archs": [
    "aarch64",
    "armhf",
    "armv7",
    "ppc64le",
    "s390x",
    "x86",
    "x86_64"
  ],
  "urlprefix": "https://dl-cdn.alpinelinux.org/alpine",
  "reponame": "community",
  "distroversion": "v3.13"
}