{
  "name": "cri-o",
  "secfixes": {
    "1.23.2-r0": [
      "CVE-2022-0811"
    ],
    "1.24.1-r0": [
      "CVE-2022-1708"
    ],
    "1.26.2-r0": [
      "CVE-2022-4318"
    ]
  },
  "apkurl": "{{urlprefix}}/{{distroversion}}/{{reponame}}/{{arch}}/{{pkg.name}}-{{pkg.ver}}.apk",
  "archs": [
    "aarch64",
    "armhf",
    "armv7",
    "mips64",
    "mips64el",
    "ppc64le",
    "s390x",
    "x86",
    "x86_64"
  ],
  "urlprefix": "https://dl-cdn.alpinelinux.org/alpine",
  "reponame": "community",
  "distroversion": "v3.21"
}