{
  "name": "mutt",
  "secfixes": {
    "2.0.4-r1": [
      "CVE-2021-3181"
    ],
    "2.0.2-r0": [
      "CVE-2020-28896"
    ],
    "1.14.4-r0": [
      "CVE-2020-14093"
    ]
  },
  "apkurl": "{{urlprefix}}/{{distroversion}}/{{reponame}}/{{arch}}/{{pkg.name}}-{{pkg.ver}}.apk",
  "archs": [
    "aarch64",
    "armhf",
    "armv7",
    "mips64",
    "mips64el",
    "ppc64le",
    "s390x",
    "x86",
    "x86_64"
  ],
  "urlprefix": "https://dl-cdn.alpinelinux.org/alpine",
  "reponame": "community",
  "distroversion": "v3.14"
}