{
  "name": "tiff",
  "secfixes": {
    "4.0.9-r4": [
      "CVE-2018-8905"
    ],
    "4.0.9-r3": [
      "CVE-2018-7456"
    ],
    "4.0.9-r2": [
      "CVE-2018-5784"
    ],
    "4.0.9-r1": [
      "CVE-2017-18013"
    ],
    "4.0.9-r0": [
      "CVE-2017-16231",
      "CVE-2017-16232"
    ],
    "4.0.8-r0": [
      "CVE-2017-9936",
      "CVE-2017-10688"
    ],
    "4.0.7-r2": [
      "CVE-2017-7592",
      "CVE-2017-7593",
      "CVE-2017-7594",
      "CVE-2017-7595",
      "CVE-2017-7596",
      "CVE-2017-7598",
      "CVE-2017-7601",
      "CVE-2017-7602"
    ],
    "4.0.7-r1": [
      "CVE-2017-5225"
    ],
    "4.0.7-r0": [
      "CVE-2016-9273",
      "CVE-2016-9297",
      "CVE-2016-9448",
      "CVE-2016-9453",
      "CVE-2016-3186",
      "CVE-2016-3621",
      "CVE-2016-3622",
      "CVE-2016-3623",
      "CVE-2016-3624",
      "CVE-2016-3625",
      "CVE-2016-3658",
      "CVE-2014-8127",
      "CVE-2016-5314",
      "CVE-2016-5315",
      "CVE-2016-5316",
      "CVE-2016-5317",
      "CVE-2016-5320",
      "CVE-2016-5875",
      "CVE-2016-5321",
      "CVE-2016-5323",
      "CVE-2016-5652"
    ]
  },
  "apkurl": "{{urlprefix}}/{{distroversion}}/{{reponame}}/{{arch}}/{{pkg.name}}-{{pkg.ver}}.apk",
  "archs": [
    "aarch64",
    "armhf",
    "armv7",
    "mips64",
    "mips64el",
    "ppc64le",
    "s390x",
    "x86",
    "x86_64"
  ],
  "urlprefix": "https://dl-cdn.alpinelinux.org/alpine",
  "reponame": "main",
  "distroversion": "v3.4"
}