{
  "name": "nextcloud-client",
  "secfixes": {
    "3.8.1-r0": [
      "CVE-2023-28999"
    ],
    "3.6.6-r0": [
      "CVE-2023-23942",
      "CVE-2023-28997",
      "CVE-2023-28998"
    ],
    "3.6.2-r0": [
      "CVE-2022-41882",
      "CVE-2023-22472"
    ]
  },
  "apkurl": "{{urlprefix}}/{{distroversion}}/{{reponame}}/{{arch}}/{{pkg.name}}-{{pkg.ver}}.apk",
  "archs": [
    "aarch64",
    "armv7",
    "mips64",
    "mips64el",
    "x86",
    "x86_64"
  ],
  "urlprefix": "https://dl-cdn.alpinelinux.org/alpine",
  "reponame": "community",
  "distroversion": "v3.20"
}