{
  "name": "strongswan",
  "secfixes": {
    "5.9.12-r0": [
      "CVE-2023-41913"
    ],
    "5.9.10-r0": [
      "CVE-2023-26463"
    ],
    "5.9.8-r0": [
      "CVE-2022-40617"
    ],
    "5.9.1-r4": [
      "CVE-2021-45079"
    ],
    "5.9.1-r3": [
      "CVE-2021-41990",
      "CVE-2021-41991"
    ],
    "5.7.1-r0": [
      "CVE-2018-17540"
    ],
    "5.7.0-r0": [
      "CVE-2018-16151",
      "CVE-2018-16152"
    ],
    "5.6.3-r0": [
      "CVE-2018-5388",
      "CVE-2018-10811"
    ],
    "5.5.3-r0": [
      "CVE-2017-9022",
      "CVE-2017-9023"
    ]
  },
  "apkurl": "{{urlprefix}}/{{distroversion}}/{{reponame}}/{{arch}}/{{pkg.name}}-{{pkg.ver}}.apk",
  "archs": [
    "aarch64",
    "armhf",
    "armv7",
    "mips64",
    "mips64el",
    "ppc64le",
    "s390x",
    "x86",
    "x86_64"
  ],
  "urlprefix": "https://dl-cdn.alpinelinux.org/alpine",
  "reponame": "main",
  "distroversion": "v3.17"
}