{
  "name": "docker-cli-compose",
  "secfixes": {
    "2.15.1-r0": [
      "CVE-2022-27664",
      "CVE-2022-32149"
    ],
    "2.12.1-r0": [
      "CVE-2022-39253"
    ]
  },
  "apkurl": "{{urlprefix}}/{{distroversion}}/{{reponame}}/{{arch}}/{{pkg.name}}-{{pkg.ver}}.apk",
  "archs": [
    "aarch64",
    "armhf",
    "armv7",
    "mips64",
    "mips64el",
    "ppc64le",
    "s390x",
    "x86",
    "x86_64"
  ],
  "urlprefix": "https://dl-cdn.alpinelinux.org/alpine",
  "reponame": "community",
  "distroversion": "v3.21"
}