{
  "name": "grafana",
  "secfixes": {
    "11.0.7-r0": [
      "CVE-2024-8118",
      "CVE-2024-9264"
    ],
    "11.0.6-r0": [
      "CVE-2024-8118"
    ],
    "11.0.3-r0": [
      "CVE-2024-6837"
    ],
    "9.1.2-r0": [
      "CVE-2022-31176"
    ],
    "9.0.3-r0": [
      "CVE-2022-31097",
      "CVE-2022-31107"
    ],
    "8.5.3-r0": [
      "CVE-2022-29170"
    ],
    "8.3.6-r0": [
      "CVE-2022-21702",
      "CVE-2022-21703",
      "CVE-2022-21713"
    ],
    "8.3.4-r0": [
      "CVE-2022-21673"
    ],
    "8.3.2-r0": [
      "CVE-2021-43813",
      "CVE-2021-43815"
    ],
    "8.3.1-r0": [
      "CVE-2021-43798"
    ],
    "8.2.4-r0": [
      "CVE-2021-41244"
    ],
    "7.4.5-r0": [
      "CVE-2021-28146",
      "CVE-2021-28147",
      "CVE-2021-28148",
      "CVE-2021-27962"
    ],
    "7.0.2-r0": [
      "CVE-2020-13379"
    ],
    "6.3.4-r0": [
      "CVE-2019-15043"
    ]
  },
  "apkurl": "{{urlprefix}}/{{distroversion}}/{{reponame}}/{{arch}}/{{pkg.name}}-{{pkg.ver}}.apk",
  "archs": [
    "aarch64",
    "mips64",
    "mips64el",
    "ppc64le",
    "s390x",
    "x86_64"
  ],
  "urlprefix": "https://dl-cdn.alpinelinux.org/alpine",
  "reponame": "community",
  "distroversion": "v3.20"
}