{
  "name": "openssl",
  "secfixes": {
    "1.0.2t-r0": [
      "CVE-2019-1547",
      "CVE-2019-1563"
    ],
    "1.0.2h-r0": [
      "CVE-2016-2107",
      "CVE-2016-2105",
      "CVE-2016-2106",
      "CVE-2016-2109",
      "CVE-2016-2176"
    ],
    "1.0.2h-r1": [
      "CVE-2016-2177",
      "CVE-2016-2178"
    ],
    "1.0.2h-r2": [
      "CVE-2016-2180"
    ],
    "1.0.2h-r3": [
      "CVE-2016-2179",
      "CVE-2016-2182",
      "CVE-2016-6302",
      "CVE-2016-6303"
    ],
    "1.0.2h-r4": [
      "CVE-2016-2181"
    ],
    "1.0.2i-r0": [
      "CVE-2016-2183",
      "CVE-2016-6304",
      "CVE-2016-6306"
    ],
    "1.0.2m-r0": [
      "CVE-2017-3735",
      "CVE-2017-3736"
    ],
    "1.0.2n-r0": [
      "CVE-2017-3737",
      "CVE-2017-3738"
    ],
    "1.0.2o-r0": [
      "CVE-2018-0733",
      "CVE-2018-0739"
    ],
    "1.0.2o-r1": [
      "CVE-2018-0732",
      "CVE-2018-0737"
    ],
    "1.0.2q-r0": [
      "CVE-2018-0734",
      "CVE-2018-5407"
    ],
    "1.0.2r-r0": [
      "CVE-2019-1559"
    ]
  },
  "apkurl": "{{urlprefix}}/{{distroversion}}/{{reponame}}/{{arch}}/{{pkg.name}}-{{pkg.ver}}.apk",
  "archs": [
    "aarch64",
    "armhf",
    "armv7",
    "mips64",
    "mips64el",
    "ppc64le",
    "s390x",
    "x86",
    "x86_64"
  ],
  "urlprefix": "https://dl-cdn.alpinelinux.org/alpine",
  "reponame": "main",
  "distroversion": "v3.7"
}