{
  "name": "openldap",
  "secfixes": {
    "2.6.2-r0": [
      "CVE-2022-29155"
    ],
    "2.4.57-r1": [
      "CVE-2021-27212"
    ],
    "2.4.57-r0": [
      "CVE-2020-36221",
      "CVE-2020-36222",
      "CVE-2020-36223",
      "CVE-2020-36224",
      "CVE-2020-36225",
      "CVE-2020-36226",
      "CVE-2020-36227",
      "CVE-2020-36228",
      "CVE-2020-36229",
      "CVE-2020-36230"
    ],
    "2.4.56-r0": [
      "CVE-2020-25709",
      "CVE-2020-25710"
    ],
    "2.4.50-r0": [
      "CVE-2020-12243"
    ],
    "2.4.48-r0": [
      "CVE-2019-13565",
      "CVE-2019-13057"
    ],
    "2.4.46-r0": [
      "CVE-2017-14159",
      "CVE-2017-17740"
    ],
    "2.4.44-r5": [
      "CVE-2017-9287"
    ],
    "": [

    ]
  },
  "apkurl": "{{urlprefix}}/{{distroversion}}/{{reponame}}/{{arch}}/{{pkg.name}}-{{pkg.ver}}.apk",
  "archs": [
    "aarch64",
    "armhf",
    "armv7",
    "mips64",
    "mips64el",
    "ppc64le",
    "s390x",
    "x86",
    "x86_64"
  ],
  "urlprefix": "https://dl-cdn.alpinelinux.org/alpine",
  "reponame": "main",
  "distroversion": "v3.20"
}