{
  "name": "gnutls",
  "secfixes": {
    "3.6.15-r1": [
      "CVE-2021-20231",
      "CVE-2021-20232"
    ],
    "3.6.15-r0": [
      "CVE-2020-24659"
    ],
    "3.6.14-r0": [
      "CVE-2020-13777"
    ],
    "3.6.8-r1": [
      "CVE-2020-11501"
    ],
    "3.6.7-r0": [
      "CVE-2019-3836",
      "CVE-2019-3829"
    ],
    "3.5.13-r0": [
      "CVE-2017-7507"
    ]
  },
  "apkurl": "{{urlprefix}}/{{distroversion}}/{{reponame}}/{{arch}}/{{pkg.name}}-{{pkg.ver}}.apk",
  "archs": [
    "aarch64",
    "armhf",
    "armv7",
    "mips64",
    "mips64el",
    "ppc64le",
    "s390x",
    "x86",
    "x86_64"
  ],
  "urlprefix": "https://dl-cdn.alpinelinux.org/alpine",
  "reponame": "main",
  "distroversion": "v3.10"
}