{
  "name": "zlib",
  "secfixes": {
    "1.2.12-r2": [
      "CVE-2022-37434"
    ],
    "1.2.11-r4": [
      "CVE-2018-25032"
    ],
    "0": [
      "CVE-2023-45853"
    ]
  },
  "apkurl": "{{urlprefix}}/{{distroversion}}/{{reponame}}/{{arch}}/{{pkg.name}}-{{pkg.ver}}.apk",
  "archs": [
    "aarch64",
    "armhf",
    "armv7",
    "mips64",
    "mips64el",
    "ppc64le",
    "s390x",
    "x86",
    "x86_64"
  ],
  "urlprefix": "https://dl-cdn.alpinelinux.org/alpine",
  "reponame": "main",
  "distroversion": "v3.17"
}