{
  "name": "python3",
  "secfixes": {
    "3.8.8-r0": [
      "CVE-2021-23336"
    ],
    "3.8.7-r1": [
      "CVE-2021-3177"
    ],
    "3.8.5-r0": [
      "CVE-2019-20907"
    ],
    "3.8.4-r0": [
      "CVE-2020-14422"
    ],
    "3.8.2-r0": [
      "CVE-2020-8315",
      "CVE-2020-8492"
    ],
    "3.7.5-r0": [
      "CVE-2019-16056",
      "CVE-2019-16935"
    ],
    "3.6.8-r1": [
      "CVE-2019-5010"
    ]
  },
  "apkurl": "{{urlprefix}}/{{distroversion}}/{{reponame}}/{{arch}}/{{pkg.name}}-{{pkg.ver}}.apk",
  "archs": [
    "aarch64",
    "armhf",
    "armv7",
    "mips64",
    "mips64el",
    "ppc64le",
    "s390x",
    "x86",
    "x86_64"
  ],
  "urlprefix": "https://dl-cdn.alpinelinux.org/alpine",
  "reponame": "main",
  "distroversion": "v3.13"
}