{
  "name": "fribidi",
  "secfixes": {
    "1.0.12-r0": [
      "CVE-2022-25308",
      "CVE-2022-25309",
      "CVE-2022-25310"
    ],
    "1.0.7-r1": [
      "CVE-2019-18397"
    ]
  },
  "apkurl": "{{urlprefix}}/{{distroversion}}/{{reponame}}/{{arch}}/{{pkg.name}}-{{pkg.ver}}.apk",
  "archs": [
    "aarch64",
    "armhf",
    "armv7",
    "mips64",
    "mips64el",
    "ppc64le",
    "s390x",
    "x86",
    "x86_64"
  ],
  "urlprefix": "https://dl-cdn.alpinelinux.org/alpine",
  "reponame": "main",
  "distroversion": "v3.18"
}