{
  "name": "ncurses",
  "secfixes": {
    "6.4_p20230424-r0": [
      "CVE-2023-29491"
    ],
    "6.3_p20220416-r0": [
      "CVE-2022-29458"
    ],
    "6.2_p20200530-r0": [
      "CVE-2021-39537"
    ],
    "6.1_p20180414-r0": [
      "CVE-2018-10754"
    ],
    "6.0_p20171125-r0": [
      "CVE-2017-16879"
    ],
    "6.0_p20170701-r0": [
      "CVE-2017-10684"
    ]
  },
  "apkurl": "{{urlprefix}}/{{distroversion}}/{{reponame}}/{{arch}}/{{pkg.name}}-{{pkg.ver}}.apk",
  "archs": [
    "aarch64",
    "armhf",
    "armv7",
    "mips64",
    "mips64el",
    "ppc64le",
    "s390x",
    "x86",
    "x86_64"
  ],
  "urlprefix": "https://dl-cdn.alpinelinux.org/alpine",
  "reponame": "main",
  "distroversion": "v3.19"
}