{
  "name": "py3-urllib3",
  "secfixes": {
    "1.26.18-r0": [
      "CVE-2023-45803"
    ],
    "1.26.17-r0": [
      "CVE-2023-43804"
    ],
    "1.25.9-r0": [
      "CVE-2020-26137"
    ],
    "1.26.4-r0": [
      "CVE-2021-28363"
    ]
  },
  "apkurl": "{{urlprefix}}/{{distroversion}}/{{reponame}}/{{arch}}/{{pkg.name}}-{{pkg.ver}}.apk",
  "archs": [

  ],
  "urlprefix": "https://dl-cdn.alpinelinux.org/alpine",
  "reponame": "main",
  "distroversion": "v3.16"
}