{
  "name": "subversion",
  "secfixes": {
    "1.14.4-r0": [
      "CVE-2024-45720"
    ],
    "1.14.2-r0": [
      "CVE-2021-28544",
      "CVE-2022-24070"
    ],
    "1.14.1-r0": [
      "CVE-2020-17525"
    ],
    "1.12.2-r0": [
      "CVE-2019-0203",
      "CVE-2018-11782"
    ],
    "1.11.1-r0": [
      "CVE-2018-11803"
    ],
    "1.9.7-r0": [
      "CVE-2017-9800"
    ]
  },
  "apkurl": "{{urlprefix}}/{{distroversion}}/{{reponame}}/{{arch}}/{{pkg.name}}-{{pkg.ver}}.apk",
  "archs": [
    "aarch64",
    "armhf",
    "armv7",
    "mips64",
    "mips64el",
    "ppc64le",
    "s390x",
    "x86",
    "x86_64"
  ],
  "urlprefix": "https://dl-cdn.alpinelinux.org/alpine",
  "reponame": "main",
  "distroversion": "vedge"
}