{
  "name": "nginx",
  "secfixes": {
    "1.26.3-r0": [
      "CVE-2025-23419"
    ],
    "1.26.2-r0": [
      "CVE-2024-7347"
    ],
    "1.24.0-r12": [
      "CVE-2023-44487"
    ],
    "1.22.1-r0": [
      "CVE-2022-41741",
      "CVE-2022-41742"
    ],
    "1.20.2-r2": [
      "CVE-2021-46461",
      "CVE-2021-46462",
      "CVE-2021-46463",
      "CVE-2022-25139"
    ],
    "1.20.1-r1": [
      "CVE-2021-3618"
    ],
    "1.20.1-r0": [
      "CVE-2021-23017"
    ],
    "1.16.1-r6": [
      "CVE-2019-20372"
    ],
    "1.16.1-r0": [
      "CVE-2019-9511",
      "CVE-2019-9513",
      "CVE-2019-9516"
    ],
    "1.14.1-r0": [
      "CVE-2018-16843",
      "CVE-2018-16844",
      "CVE-2018-16845"
    ],
    "1.12.1-r0": [
      "CVE-2017-7529"
    ],
    "0": [
      "CVE-2022-3638",
      "CVE-2024-32760",
      "CVE-2024-31079",
      "CVE-2024-35200",
      "CVE-2024-34161"
    ],
    "": [

    ]
  },
  "apkurl": "{{urlprefix}}/{{distroversion}}/{{reponame}}/{{arch}}/{{pkg.name}}-{{pkg.ver}}.apk",
  "archs": [
    "aarch64",
    "armhf",
    "armv7",
    "mips64",
    "mips64el",
    "ppc64le",
    "s390x",
    "x86",
    "x86_64"
  ],
  "urlprefix": "https://dl-cdn.alpinelinux.org/alpine",
  "reponame": "main",
  "distroversion": "vedge"
}