{
  "name": "weechat",
  "secfixes": {
    "1.7.1-r0": [
      "CVE-2017-8073"
    ],
    "1.9.1-r0": [
      "CVE-2017-14727"
    ],
    "2.7.1-r0": [
      "CVE-2020-8955"
    ]
  },
  "apkurl": "{{urlprefix}}/{{distroversion}}/{{reponame}}/{{arch}}/{{pkg.name}}-{{pkg.ver}}.apk",
  "archs": [
    "aarch64",
    "armhf",
    "armv7",
    "mips64",
    "mips64el",
    "ppc64le",
    "s390x",
    "x86",
    "x86_64"
  ],
  "urlprefix": "https://dl-cdn.alpinelinux.org/alpine",
  "reponame": "community",
  "distroversion": "vedge"
}