{
  "name": "php",
  "secfixes": {
    "5.6.27-r0": [
      "CVE-2016-7411",
      "CVE-2016-7412",
      "CVE-2016-7413",
      "CVE-2016-7414",
      "CVE-2016-7416",
      "CVE-2016-7417",
      "CVE-2016-7418"
    ]
  },
  "apkurl": "{{urlprefix}}/{{distroversion}}/{{reponame}}/{{arch}}/{{pkg.name}}-{{pkg.ver}}.apk",
  "archs": [
    "aarch64",
    "armhf",
    "armv7",
    "mips64",
    "mips64el",
    "ppc64le",
    "s390x",
    "x86",
    "x86_64"
  ],
  "urlprefix": "https://dl-cdn.alpinelinux.org/alpine",
  "reponame": "main",
  "distroversion": "v3.3"
}