{
  "name": "py3-bleach",
  "secfixes": {
    "3.2.3-r1": [

    ],
    "- GHSA-vv2x-vrpj-qqpq": [

    ],
    "3.1.2-r0": [
      "CVE-2020-6816"
    ],
    "3.1.1-r0": [
      "CVE-2020-6802"
    ]
  },
  "apkurl": "{{urlprefix}}/{{distroversion}}/{{reponame}}/{{arch}}/{{pkg.name}}-{{pkg.ver}}.apk",
  "archs": [

  ],
  "urlprefix": "https://dl-cdn.alpinelinux.org/alpine",
  "reponame": "community",
  "distroversion": "v3.13"
}