{
  "name": "ansible",
  "secfixes": {
    "2.4.6.0-r1": [
      "CVE-2019-10206"
    ],
    "2.4.6.0-r0": [
      "CVE-2018-10855"
    ]
  },
  "apkurl": "{{urlprefix}}/{{distroversion}}/{{reponame}}/{{arch}}/{{pkg.name}}-{{pkg.ver}}.apk",
  "archs": [

  ],
  "urlprefix": "https://dl-cdn.alpinelinux.org/alpine",
  "reponame": "main",
  "distroversion": "v3.7"
}