{
  "name": "qt5-qtwebengine",
  "secfixes": {
    "5.15.16-r6": [
      "CVE-2024-3157",
      "CVE-2024-3516"
    ],
    "5.15.16-r5": [
      "CVE-2023-7104"
    ],
    "5.15.16-r4": [
      "CVE-2024-0807",
      "CVE-2024-0808",
      "CVE-2024-1059",
      "CVE-2024-1060",
      "CVE-2024-1077",
      "CVE-2024-1283"
    ],
    "5.15.16-r3": [
      "CVE-2023-7024",
      "CVE-2024-0222",
      "CVE-2024-0224",
      "CVE-2024-0333",
      "CVE-2024-0518",
      "CVE-2024-0519"
    ],
    "5.15.16-r2": [
      "CVE-2023-6345",
      "CVE-2023-6510",
      "CVE-2023-6702"
    ],
    "5.15.16-r1": [
      "CVE-2023-6347"
    ],
    "5.15.16-r0": [
      "CVE-2023-5997",
      "CVE-2023-6112"
    ],
    "5.15.15-r7": [
      "CVE-2023-5996"
    ],
    "5.15.15-r5": [
      "CVE-2023-5482",
      "CVE-2023-5849"
    ],
    "5.15.15-r4": [
      "CVE-2023-5218",
      "CVE-2023-45853"
    ],
    "5.15.15-r3": [
      "CVE-2023-5217"
    ],
    "5.15.15-r2": [
      "CVE-2023-4351",
      "CVE-2023-4354",
      "CVE-2023-4362",
      "CVE-2023-4762"
    ],
    "5.15.15-r1": [
      "CVE-2023-4863"
    ],
    "5.15.14-r7": [
      "CVE-2023-4071",
      "CVE-2023-4074",
      "CVE-2023-4076"
    ],
    "5.15.14-r5": [
      "CVE-2023-2935"
    ],
    "5.15.14-r4": [
      "CVE-2023-2930",
      "CVE-2023-3079",
      "CVE-2023-3216"
    ],
    "5.15.14-r2": [
      "CVE-2023-2721",
      "CVE-2023-2931",
      "CVE-2023-2932",
      "CVE-2023-2933",
      "CVE-2023-2935"
    ],
    "5.15.13-r1": [
      "CVE-2023-1810",
      "CVE-2023-1811",
      "CVE-2023-2033",
      "CVE-2023-2137",
      "CVE-2023-29469"
    ],
    "5.15.13-r0": [
      "CVE-2023-1530"
    ],
    "5.15.12-r9": [
      "CVE-2023-1215",
      "CVE-2023-1217",
      "CVE-2023-1219",
      "CVE-2023-1220",
      "CVE-2023-1222",
      "CVE-2023-1529",
      "CVE-2023-1531",
      "CVE-2023-1534"
    ],
    "5.15.12-r8": [
      "CVE-2023-0931",
      "CVE-2023-0933"
    ],
    "5.15.12-r6": [
      "CVE-2023-0472",
      "CVE-2023-0698"
    ],
    "5.15.12-r0": [
      "CVE-2023-0129"
    ],
    "5.15.11-r13": [
      "CVE-2022-23308"
    ],
    "5.15.11-r12": [
      "CVE-2022-4437"
    ],
    "5.15.11-r11": [
      "CVE-2022-4438"
    ],
    "5.15.11-r10": [
      "CVE-2022-4179"
    ],
    "5.15.11-r9": [
      "CVE-2022-4262"
    ],
    "5.15.11-r8": [
      "CVE-2022-4174",
      "CVE-2022-4180",
      "CVE-2022-4181"
    ],
    "5.15.11-r7": [
      "CVE-2022-3201"
    ],
    "5.15.11-r5": [
      "CVE-2022-3200"
    ],
    "5.15.11-r4": [
      "CVE-2022-3373",
      "CVE-2022-3445",
      "CVE-2022-3885",
      "CVE-2022-3887",
      "CVE-2022-3889",
      "CVE-2022-3890"
    ],
    "5.15.11-r3": [
      "CVE-2022-3038",
      "CVE-2022-3040",
      "CVE-2022-3041",
      "CVE-2022-3075",
      "CVE-2022-3196",
      "CVE-2022-3197",
      "CVE-2022-3198",
      "CVE-2022-3199",
      "CVE-2022-3201",
      "CVE-2022-3304",
      "CVE-2022-3370",
      "CVE-2022-3446",
      "CVE-2022-35737"
    ],
    "5.15.11-r0": [
      "CVE-2022-2610"
    ],
    "5.15.3_git20220601-r2": [
      "CVE-2022-2477",
      "CVE-2022-27404",
      "CVE-2022-27405",
      "CVE-2022-27406"
    ],
    "5.15.3_git20220601-r1": [
      "CVE-2022-1854",
      "CVE-2022-1855",
      "CVE-2022-1857",
      "CVE-2022-2008",
      "CVE-2022-2010",
      "CVE-2022-2158",
      "CVE-2022-2160",
      "CVE-2022-2162",
      "CVE-2022-2294",
      "CVE-2022-2295"
    ],
    "5.15.3_git20220601-r0": [
      "CVE-2022-0796"
    ],
    "5.15.3_git20220505-r0": [
      "CVE-2022-1493",
      "CVE-2022-1314",
      "CVE-2022-1310",
      "CVE-2022-1305",
      "CVE-2022-1138",
      "CVE-2022-1125",
      "CVE-2022-0978",
      "CVE-2022-0797"
    ],
    "5.15.3_git20220407-r0": [
      "CVE-2022-1096",
      "CVE-2022-0971"
    ],
    "5.15.3_git20220121-r4": [
      "CVE-2022-23852",
      "CVE-2022-0610",
      "CVE-2022-0609",
      "CVE-2022-0608",
      "CVE-2022-0607",
      "CVE-2022-0606",
      "CVE-2022-0461",
      "CVE-2022-0460",
      "CVE-2022-0459",
      "CVE-2022-0456",
      "CVE-2022-0310",
      "CVE-2022-0306",
      "CVE-2022-0305",
      "CVE-2022-0298",
      "CVE-2022-0293",
      "CVE-2022-0291",
      "CVE-2022-0289",
      "CVE-2022-0117",
      "CVE-2022-0116",
      "CVE-2022-0113",
      "CVE-2022-0111",
      "CVE-2022-0109",
      "CVE-2022-0108",
      "CVE-2022-0104",
      "CVE-2022-0103",
      "CVE-2022-0102",
      "CVE-2022-0100"
    ],
    "5.15.3_git20211127-r3": [
      "CVE-2021-4101",
      "CVE-2021-4099",
      "CVE-2021-4098"
    ],
    "5.15.3_git20211127-r1": [
      "CVE-2021-4079",
      "CVE-2021-4078",
      "CVE-2021-4062",
      "CVE-2021-4059",
      "CVE-2021-4058",
      "CVE-2021-4057",
      "CVE-2021-38022",
      "CVE-2021-38021",
      "CVE-2021-38019",
      "CVE-2021-38018",
      "CVE-2021-38017",
      "CVE-2021-38015",
      "CVE-2021-38012",
      "CVE-2021-38010",
      "CVE-2021-38009",
      "CVE-2021-38007",
      "CVE-2021-38005",
      "CVE-2021-38001",
      "CVE-2021-37996",
      "CVE-2021-37989"
    ],
    "5.15.3_git20211127-r0": [
      "CVE-2021-38003",
      "CVE-2021-37993",
      "CVE-2021-37992",
      "CVE-2021-37987",
      "CVE-2021-37984"
    ],
    "5.15.3_git20211112-r0": [
      "CVE-2021-3541",
      "CVE-2021-3517"
    ],
    "5.15.3_git20211006-r3": [
      "CVE-2021-37980",
      "CVE-2021-37979",
      "CVE-2021-37978",
      "CVE-2021-37975",
      "CVE-2021-37973",
      "CVE-2021-37972",
      "CVE-2021-37971",
      "CVE-2021-37968",
      "CVE-2021-37967",
      "CVE-2021-37962",
      "CVE-2021-30616"
    ],
    "5.15.3_git20211006-r0": [
      "CVE-2021-30633",
      "CVE-2021-30629",
      "CVE-2021-30628",
      "CVE-2021-30627",
      "CVE-2021-30626",
      "CVE-2021-30625",
      "CVE-2021-30618",
      "CVE-2021-30613"
    ],
    "5.15.3_git20210510-r6": [
      "CVE-2021-30604",
      "CVE-2021-30603",
      "CVE-2021-30602",
      "CVE-2021-30599",
      "CVE-2021-30598",
      "CVE-2021-30585",
      "CVE-2021-30566",
      "CVE-2021-30560"
    ],
    "5.15.3_git20210510-r5": [
      "CVE-2021-30588",
      "CVE-2021-30587",
      "CVE-2021-30573",
      "CVE-2021-30569",
      "CVE-2021-30568"
    ],
    "5.15.3_git20210510-r4": [
      "CVE-2021-30563",
      "CVE-2021-30559",
      "CVE-2021-30556",
      "CVE-2021-30553",
      "CVE-2021-30548",
      "CVE-2021-30547",
      "CVE-2021-30541",
      "CVE-2021-30536",
      "CVE-2021-30533"
    ],
    "5.15.3_git20210510-r3": [
      "CVE-2021-30522"
    ],
    "5.15.3_git20210510-r2": [
      "CVE-2021-30554",
      "CVE-2021-30551",
      "CVE-2021-30544",
      "CVE-2021-30535",
      "CVE-2021-30534",
      "CVE-2021-30530",
      "CVE-2021-30523"
    ],
    "5.15.3_git20210510-r1": [
      "CVE-2021-30518",
      "CVE-2021-30516",
      "CVE-2021-30515",
      "CVE-2021-30513",
      "CVE-2021-30512",
      "CVE-2021-30510",
      "CVE-2021-30508"
    ],
    "5.15.3_git20210510-r0": [
      "CVE-2021-21201",
      "CVE-2021-21202",
      "CVE-2021-21203",
      "CVE-2021-21204",
      "CVE-2021-21206",
      "CVE-2021-21207",
      "CVE-2021-21209",
      "CVE-2021-21213",
      "CVE-2021-21214",
      "CVE-2021-21217",
      "CVE-2021-21219",
      "CVE-2021-21220",
      "CVE-2021-21221",
      "CVE-2021-21222",
      "CVE-2021-21223",
      "CVE-2021-21224",
      "CVE-2021-21225",
      "CVE-2021-21227",
      "CVE-2021-21230",
      "CVE-2021-21231",
      "CVE-2021-21233"
    ],
    "5.15.3_git20200401-r0": [
      "CVE-2020-16044",
      "CVE-2020-27844",
      "CVE-2021-21118",
      "CVE-2021-21119",
      "CVE-2021-21120",
      "CVE-2021-21121",
      "CVE-2021-21122",
      "CVE-2021-21123",
      "CVE-2021-21126",
      "CVE-2021-21127",
      "CVE-2021-21128",
      "CVE-2021-21132",
      "CVE-2021-21135",
      "CVE-2021-21137",
      "CVE-2021-21138",
      "CVE-2021-21140",
      "CVE-2021-21145",
      "CVE-2021-21146",
      "CVE-2021-21147",
      "CVE-2021-21148",
      "CVE-2021-21149",
      "CVE-2021-21150",
      "CVE-2021-21152",
      "CVE-2021-21153",
      "CVE-2021-21156",
      "CVE-2021-21157",
      "CVE-2021-21160",
      "CVE-2021-21162",
      "CVE-2021-21165",
      "CVE-2021-21166",
      "CVE-2021-21168",
      "CVE-2021-21169",
      "CVE-2021-21171",
      "CVE-2021-21172",
      "CVE-2021-21173",
      "CVE-2021-21174",
      "CVE-2021-21175",
      "CVE-2021-21178",
      "CVE-2021-21179",
      "CVE-2021-21183",
      "CVE-2021-21187",
      "CVE-2021-21188",
      "CVE-2021-21190",
      "CVE-2021-21191",
      "CVE-2021-21193",
      "CVE-2021-21195",
      "CVE-2021-21198"
    ]
  },
  "apkurl": "{{urlprefix}}/{{distroversion}}/{{reponame}}/{{arch}}/{{pkg.name}}-{{pkg.ver}}.apk",
  "archs": [
    "aarch64",
    "armhf",
    "armv7",
    "mips64",
    "mips64el",
    "x86",
    "x86_64"
  ],
  "urlprefix": "https://dl-cdn.alpinelinux.org/alpine",
  "reponame": "community",
  "distroversion": "v3.19"
}