{
  "name": "openjdk7",
  "secfixes": {
    "7.321.2.6.28-r0": [
      "CVE-2021-35550",
      "CVE-2021-35556",
      "CVE-2021-35559",
      "CVE-2021-35561",
      "CVE-2021-35564",
      "CVE-2021-35565",
      "CVE-2021-35586",
      "CVE-2021-35588",
      "CVE-2021-35603"
    ],
    "7.311.2.6.27-r0": [
      "CVE-2021-2341",
      "CVE-2021-2369",
      "CVE-2021-2432"
    ],
    "7.301.2.6.26-r0": [
      "CVE-2021-2161",
      "CVE-2021-2163"
    ],
    "7.281.2.6.24-r0": [
      "CVE-2020-14803"
    ],
    "7.271.2.6.23-r0": [
      "CVE-2019-2745",
      "CVE-2020-14779",
      "CVE-2020-14781",
      "CVE-2020-14782",
      "CVE-2020-14792",
      "CVE-2020-14796",
      "CVE-2020-14797",
      "CVE-2020-14798"
    ],
    "7.261.2.6.23-r0": [
      "CVE-2020-14577",
      "CVE-2020-14578",
      "CVE-2020-14579",
      "CVE-2020-14581",
      "CVE-2020-14583",
      "CVE-2020-14593",
      "CVE-2020-14621"
    ],
    "7.261.2.6.22-r0": [
      "CVE-2020-2756",
      "CVE-2020-2757",
      "CVE-2020-2773",
      "CVE-2020-2781",
      "CVE-2020-2800",
      "CVE-2020-2803",
      "CVE-2020-2805",
      "CVE-2020-2830"
    ],
    "7.251.2.6.21-r0": [
      "CVE-2020-2583",
      "CVE-2020-2590",
      "CVE-2020-2593",
      "CVE-2020-2601",
      "CVE-2020-2604",
      "CVE-2020-2654",
      "CVE-2020-2659"
    ],
    "7.241.2.6.20-r0": [
      "CVE-2019-2894",
      "CVE-2019-2933",
      "CVE-2019-2945",
      "CVE-2019-2949",
      "CVE-2019-2958",
      "CVE-2019-2962",
      "CVE-2019-2964",
      "CVE-2019-2973",
      "CVE-2019-2978",
      "CVE-2019-2981",
      "CVE-2019-2983",
      "CVE-2019-2987",
      "CVE-2019-2988",
      "CVE-2019-2989",
      "CVE-2019-2992",
      "CVE-2019-2999"
    ],
    "7.231.2.6.19-r0": [
      "CVE-2019-2766",
      "CVE-2019-2769",
      "CVE-2019-2786",
      "CVE-2019-2816",
      "CVE-2019-2842"
    ],
    "7.221.2.6.18-r0": [
      "CVE-2019-2602",
      "CVE-2019-2684",
      "CVE-2019-2698"
    ],
    "7.211.2.6.17-r0": [
      "CVE-2018-11212",
      "CVE-2019-2422",
      "CVE-2019-2426"
    ],
    "7.201.2.6.16-r0": [
      "CVE-2018-3136",
      "CVE-2018-3139",
      "CVE-2018-3149",
      "CVE-2018-3169",
      "CVE-2018-3180",
      "CVE-2018-3214",
      "CVE-2018-13785"
    ]
  },
  "apkurl": "{{urlprefix}}/{{distroversion}}/{{reponame}}/{{arch}}/{{pkg.name}}-{{pkg.ver}}.apk",
  "archs": [
    "aarch64",
    "armhf",
    "armv7",
    "mips64",
    "mips64el",
    "ppc64le",
    "s390x",
    "x86",
    "x86_64"
  ],
  "urlprefix": "https://dl-cdn.alpinelinux.org/alpine",
  "reponame": "community",
  "distroversion": "vedge"
}