{
  "name": "nghttp2",
  "secfixes": {
    "1.57.0-r0": [
      "CVE-2023-44487"
    ],
    "1.41.0-r0": [
      "CVE-2020-11080"
    ],
    "1.39.2-r0": [
      "CVE-2019-9511",
      "CVE-2019-9513"
    ]
  },
  "apkurl": "{{urlprefix}}/{{distroversion}}/{{reponame}}/{{arch}}/{{pkg.name}}-{{pkg.ver}}.apk",
  "archs": [
    "aarch64",
    "armhf",
    "armv7",
    "mips64",
    "mips64el",
    "ppc64le",
    "s390x",
    "x86",
    "x86_64"
  ],
  "urlprefix": "https://dl-cdn.alpinelinux.org/alpine",
  "reponame": "main",
  "distroversion": "v3.21"
}