{
  "name": "libssh2",
  "secfixes": {
    "1.9.0-r1": [
      "CVE-2019-17498"
    ],
    "1.9.0-r0": [
      "CVE-2019-13115"
    ],
    "1.8.1-r0": [

    ],
    "-  CVE-2019-3855": [

    ],
    "-  CVE-2019-3856": [

    ],
    "-  CVE-2019-3857": [

    ],
    "-  CVE-2019-3858": [

    ],
    "-  CVE-2019-3859": [

    ],
    "-  CVE-2019-3860": [

    ],
    "-  CVE-2019-3861": [

    ],
    "-  CVE-2019-3862": [

    ],
    "-  CVE-2019-3863": [

    ]
  },
  "apkurl": "{{urlprefix}}/{{distroversion}}/{{reponame}}/{{arch}}/{{pkg.name}}-{{pkg.ver}}.apk",
  "archs": [
    "aarch64",
    "armhf",
    "armv7",
    "mips64",
    "mips64el",
    "ppc64le",
    "s390x",
    "x86",
    "x86_64"
  ],
  "urlprefix": "https://dl-cdn.alpinelinux.org/alpine",
  "reponame": "main",
  "distroversion": "v3.12"
}