{
  "name": "libspf2",
  "secfixes": {
    "1.2.11-r0": [
      "CVE-2021-33912",
      "CVE-2021-33913",
      "CVE-2021-33914"
    ],
    "1.2.10-r5": [
      "CVE-2021-20314"
    ]
  },
  "apkurl": "{{urlprefix}}/{{distroversion}}/{{reponame}}/{{arch}}/{{pkg.name}}-{{pkg.ver}}.apk",
  "archs": [
    "aarch64",
    "armhf",
    "armv7",
    "mips64",
    "mips64el",
    "ppc64le",
    "s390x",
    "x86",
    "x86_64"
  ],
  "urlprefix": "https://dl-cdn.alpinelinux.org/alpine",
  "reponame": "main",
  "distroversion": "v3.16"
}