{
  "name": "libvncserver",
  "secfixes": {
    "0.9.11-r3": [
      "CVE-2019-15681"
    ],
    "0.9.11-r2": [
      "CVE-2018-7225"
    ],
    "0.9.11-r0": [
      "CVE-2016-9941",
      "CVE-2016-9942"
    ]
  },
  "apkurl": "{{urlprefix}}/{{distroversion}}/{{reponame}}/{{arch}}/{{pkg.name}}-{{pkg.ver}}.apk",
  "archs": [
    "aarch64",
    "armhf",
    "armv7",
    "mips64",
    "mips64el",
    "ppc64le",
    "s390x",
    "x86",
    "x86_64"
  ],
  "urlprefix": "https://dl-cdn.alpinelinux.org/alpine",
  "reponame": "main",
  "distroversion": "v3.8"
}