{
  "name": "ceph",
  "secfixes": {
    "14.2.9-r0": [
      "CVE-2020-1759",
      "CVE-2020-1760"
    ],
    "14.2.7-r0": [
      "CVE-2020-1699",
      "CVE-2020-1700"
    ],
    "14.2.3-r0": [
      "CVE-2019-10222"
    ]
  },
  "apkurl": "{{urlprefix}}/{{distroversion}}/{{reponame}}/{{arch}}/{{pkg.name}}-{{pkg.ver}}.apk",
  "archs": [
    "x86_64"
  ],
  "urlprefix": "https://dl-cdn.alpinelinux.org/alpine",
  "reponame": "community",
  "distroversion": "v3.10"
}