{
  "name": "postgresql15",
  "secfixes": {
    "15.11-r0": [
      "CVE-2025-1094"
    ],
    "15.9-r0": [
      "CVE-2024-10976",
      "CVE-2024-10977",
      "CVE-2024-10978",
      "CVE-2024-10979"
    ],
    "15.8-r0": [
      "CVE-2024-7348"
    ],
    "15.6-r0": [
      "CVE-2024-0985"
    ],
    "15.5-r0": [
      "CVE-2023-5868",
      "CVE-2023-5869",
      "CVE-2023-5870"
    ],
    "15.4-r0": [
      "CVE-2023-39418",
      "CVE-2023-39417"
    ],
    "15.3-r0": [
      "CVE-2023-2454",
      "CVE-2023-2455"
    ],
    "15.2-r0": [
      "CVE-2022-41862"
    ]
  },
  "apkurl": "{{urlprefix}}/{{distroversion}}/{{reponame}}/{{arch}}/{{pkg.name}}-{{pkg.ver}}.apk",
  "archs": [
    "aarch64",
    "armhf",
    "armv7",
    "mips64",
    "mips64el",
    "ppc64le",
    "s390x",
    "x86",
    "x86_64"
  ],
  "urlprefix": "https://dl-cdn.alpinelinux.org/alpine",
  "reponame": "community",
  "distroversion": "v3.21"
}