{
  "name": "mosquitto",
  "secfixes": {
    "1.6.9-r1": [
      "CVE-2021-34432"
    ],
    "1.6.7-r0": [
      "CVE-2019-11779"
    ],
    "1.5.6-r0": [
      "CVE-2018-12546",
      "CVE-2018-12550",
      "CVE-2018-12551"
    ],
    "1.5.3-r0": [
      "CVE-2018-12543"
    ],
    "1.4.15-r0": [
      "CVE-2017-7652",
      "CVE-2017-7651"
    ],
    "1.4.13-r0": [
      "CVE-2017-9868"
    ],
    "1.4.12-r0": [
      "CVE-2017-7650"
    ]
  },
  "apkurl": "{{urlprefix}}/{{distroversion}}/{{reponame}}/{{arch}}/{{pkg.name}}-{{pkg.ver}}.apk",
  "archs": [
    "aarch64",
    "armhf",
    "armv7",
    "mips64",
    "mips64el",
    "ppc64le",
    "s390x",
    "x86",
    "x86_64"
  ],
  "urlprefix": "https://dl-cdn.alpinelinux.org/alpine",
  "reponame": "main",
  "distroversion": "v3.12"
}