{
  "name": "php7",
  "secfixes": {
    "7.1.17-r0": [
      "CVE-2018-5712",
      "CVE-2018-10547"
    ],
    "7.1.15-r0": [
      "CVE-2018-7584"
    ],
    "7.1.13-r0": [
      "CVE-2018-5711"
    ],
    "7.1.9-r0": [
      "CVE-2017-9224",
      "CVE-2017-9226",
      "CVE-2017-9227",
      "CVE-2017-9228",
      "CVE-2017-9229"
    ]
  },
  "apkurl": "{{urlprefix}}/{{distroversion}}/{{reponame}}/{{arch}}/{{pkg.name}}-{{pkg.ver}}.apk",
  "archs": [
    "aarch64",
    "armhf",
    "armv7",
    "mips64",
    "mips64el",
    "ppc64le",
    "s390x",
    "x86",
    "x86_64"
  ],
  "urlprefix": "https://dl-cdn.alpinelinux.org/alpine",
  "reponame": "community",
  "distroversion": "v3.6"
}