{
  "name": "qemu",
  "secfixes": {
    "8.0.2-r1": [
      "CVE-2023-2861"
    ],
    "8.0.0-r6": [
      "CVE-2023-0330"
    ],
    "7.1.0-r4": [
      "CVE-2022-2962",
      "CVE-2022-3165"
    ],
    "7.0.0-r0": [
      "CVE-2021-4158"
    ],
    "6.1.0-r0": [
      "CVE-2020-35503",
      "CVE-2021-3507",
      "CVE-2021-3544",
      "CVE-2021-3545",
      "CVE-2021-3546",
      "CVE-2021-3682"
    ],
    "6.0.0-r2": [
      "CVE-2020-35504",
      "CVE-2020-35505",
      "CVE-2020-35506",
      "CVE-2021-3527"
    ],
    "6.0.0-r1": [
      "CVE-2021-20181",
      "CVE-2021-20255",
      "CVE-2021-3392",
      "CVE-2021-3409",
      "CVE-2021-3416"
    ],
    "5.2.0-r0": [
      "CVE-2020-24352",
      "CVE-2020-25723",
      "CVE-2020-25742",
      "CVE-2020-25743",
      "CVE-2020-27661",
      "CVE-2020-27821",
      "CVE-2020-29443",
      "CVE-2020-35517",
      "CVE-2021-20203"
    ],
    "5.1.0-r1": [
      "CVE-2020-13361",
      "CVE-2020-13362",
      "CVE-2020-14364",
      "CVE-2020-15863",
      "CVE-2020-16092",
      "CVE-2020-17380",
      "CVE-2020-25084",
      "CVE-2020-25085",
      "CVE-2020-25624",
      "CVE-2020-25625",
      "CVE-2020-25741",
      "CVE-2020-28916"
    ],
    "5.0.0-r0": [
      "CVE-2020-13659",
      "CVE-2020-13754",
      "CVE-2020-13791",
      "CVE-2020-13800",
      "CVE-2020-14415",
      "CVE-2020-15469",
      "CVE-2020-15859",
      "CVE-2020-27616",
      "CVE-2020-27617",
      "CVE-2021-20221"
    ],
    "4.2.0-r0": [
      "CVE-2020-13765"
    ],
    "2.8.1-r1": [
      "CVE-2016-7994",
      "CVE-2016-7995",
      "CVE-2016-8576",
      "CVE-2016-8577",
      "CVE-2016-8578",
      "CVE-2016-8668",
      "CVE-2016-8909",
      "CVE-2016-8910",
      "CVE-2016-9101",
      "CVE-2016-9102",
      "CVE-2016-9103",
      "CVE-2016-9104",
      "CVE-2016-9105",
      "CVE-2016-9106",
      "CVE-2017-2615",
      "CVE-2017-2620",
      "CVE-2017-5525",
      "CVE-2017-5552",
      "CVE-2017-5578",
      "CVE-2017-5579",
      "CVE-2017-5667",
      "CVE-2017-5856",
      "CVE-2017-5857",
      "CVE-2017-5898",
      "CVE-2017-5931"
    ]
  },
  "apkurl": "{{urlprefix}}/{{distroversion}}/{{reponame}}/{{arch}}/{{pkg.name}}-{{pkg.ver}}.apk",
  "archs": [
    "aarch64",
    "armhf",
    "armv7",
    "mips64",
    "mips64el",
    "ppc64le",
    "s390x",
    "x86",
    "x86_64"
  ],
  "urlprefix": "https://dl-cdn.alpinelinux.org/alpine",
  "reponame": "community",
  "distroversion": "v3.21"
}