{
  "name": "libarchive",
  "secfixes": {
    "3.3.3-r2": [
      "CVE-2020-19221"
    ],
    "3.3.3-r1": [
      "CVE-2019-18408"
    ],
    "3.3.3-r0": [
      "CVE-2017-14501",
      "CVE-2017-14502",
      "CVE-2017-14503"
    ],
    "3.3.2-r1": [
      "CVE-2017-14166"
    ]
  },
  "apkurl": "{{urlprefix}}/{{distroversion}}/{{reponame}}/{{arch}}/{{pkg.name}}-{{pkg.ver}}.apk",
  "archs": [
    "aarch64",
    "armhf",
    "armv7",
    "mips64",
    "mips64el",
    "ppc64le",
    "s390x",
    "x86",
    "x86_64"
  ],
  "urlprefix": "https://dl-cdn.alpinelinux.org/alpine",
  "reponame": "main",
  "distroversion": "v3.8"
}