{
  "name": "intel-ucode",
  "secfixes": {
    "20241112-r0": [
      "CVE-2024-21853",
      "CVE-2024-23918",
      "CVE-2024-24968",
      "CVE-2024-23984"
    ],
    "20240910-r0": [
      "CVE-2024-23984",
      "CVE-2024-24968"
    ],
    "20240813-r0": [
      "CVE-2024-24853",
      "CVE-2024-25939",
      "CVE-2024-24980",
      "CVE-2023-42667",
      "CVE-2023-49141",
      "CVE-2023-45733",
      "CVE-2023-46103",
      "CVE-2023-45745",
      "CVE-2023-39368",
      "CVE-2023-38575",
      "CVE-2023-28746",
      "CVE-2023-22655",
      "CVE-2023-43490"
    ],
    "20231114-r0": [
      "CVE-2023-23583"
    ],
    "20230808-r0": [
      "CVE-2022-40982",
      "CVE-2022-41804",
      "CVE-2023-23908"
    ],
    "20230214-r0": [
      "CVE-2022-21216",
      "CVE-2022-33196",
      "CVE-2022-38090"
    ],
    "20220809-r0": [
      "CVE-2022-21233"
    ],
    "20220510-r0": [
      "CVE-2022-21151"
    ],
    "20220207-r0": [
      "CVE-2021-0127",
      "CVE-2021-0146"
    ],
    "20210608-r0": [
      "CVE-2020-24489",
      "CVE-2020-24511",
      "CVE-2020-24513"
    ],
    "20210216-r0": [
      "CVE-2020-8698"
    ],
    "20201112-r0": [
      "CVE-2020-8694",
      "CVE-2020-8698"
    ],
    "20201110-r0": [
      "CVE-2020-8694",
      "CVE-2020-8698"
    ],
    "20200609-r0": [
      "CVE-2020-0548"
    ],
    "20191113-r0": [
      "CVE-2019-11135"
    ],
    "20191112-r0": [
      "CVE-2018-12126",
      "CVE-2019-11135"
    ],
    "20190918-r0": [
      "CVE-2019-11135"
    ],
    "20190618-r0": [
      "CVE-2018-12126"
    ],
    "20190514a-r0": [
      "CVE-2018-12126",
      "CVE-2017-5754",
      "CVE-2017-5753"
    ]
  },
  "apkurl": "{{urlprefix}}/{{distroversion}}/{{reponame}}/{{arch}}/{{pkg.name}}-{{pkg.ver}}.apk",
  "archs": [
    "x86",
    "x86_64"
  ],
  "urlprefix": "https://dl-cdn.alpinelinux.org/alpine",
  "reponame": "main",
  "distroversion": "v3.17"
}