{
  "name": "krb5",
  "secfixes": {
    "1.14-r1": [
      "CVE-2015-8629",
      "CVE-2015-8630",
      "CVE-2015-8631"
    ],
    "1.14-r2": [
      "CVE-2016-3119"
    ],
    "1.14.3-r0": [
      "CVE-2016-3120"
    ]
  },
  "apkurl": "{{urlprefix}}/{{distroversion}}/{{reponame}}/{{arch}}/{{pkg.name}}-{{pkg.ver}}.apk",
  "archs": [
    "aarch64",
    "armhf",
    "armv7",
    "mips64",
    "mips64el",
    "ppc64le",
    "s390x",
    "x86",
    "x86_64"
  ],
  "urlprefix": "https://dl-cdn.alpinelinux.org/alpine",
  "reponame": "main",
  "distroversion": "v3.4"
}