{
  "name": "ansible",
  "secfixes": {
    "2.6.20-r0": [
      "CVE-2019-14846",
      "CVE-2019-14856",
      "CVE-2019-14858"
    ],
    "2.6.19-r0": [
      "CVE-2019-10206"
    ],
    "2.6.18-r0": [
      "CVE-2019-10156"
    ],
    "2.5.15-r0": [
      "CVE-2019-3828"
    ],
    "2.5.14-r0": [
      "CVE-2018-16876"
    ],
    "2.5.11-r0": [
      "CVE-2018-16837"
    ]
  },
  "apkurl": "{{urlprefix}}/{{distroversion}}/{{reponame}}/{{arch}}/{{pkg.name}}-{{pkg.ver}}.apk",
  "archs": [

  ],
  "urlprefix": "https://dl-cdn.alpinelinux.org/alpine",
  "reponame": "main",
  "distroversion": "v3.8"
}