{
  "name": "mozjs115",
  "secfixes": {
    "115.15.0-r0": [
      "CVE-2024-8384"
    ],
    "115.14.0-r0": [
      "CVE-2024-7527"
    ],
    "115.9.1-r0": [
      "CVE-2024-29944"
    ],
    "115.8.0-r0": [
      "CVE-2024-1553"
    ],
    "115.6.0-r0": [
      "CVE-2023-6864"
    ],
    "115.4.0-r0": [
      "CVE-2023-5728"
    ]
  },
  "apkurl": "{{urlprefix}}/{{distroversion}}/{{reponame}}/{{arch}}/{{pkg.name}}-{{pkg.ver}}.apk",
  "archs": [
    "aarch64",
    "armv7",
    "mips64",
    "mips64el",
    "ppc64le",
    "x86",
    "x86_64"
  ],
  "urlprefix": "https://dl-cdn.alpinelinux.org/alpine",
  "reponame": "community",
  "distroversion": "v3.19"
}