{
  "name": "git",
  "secfixes": {
    "2.18.4-r0": [
      "CVE-2020-11008"
    ],
    "2.18.3-r0": [
      "CVE-2020-5260"
    ],
    "2.18.2-r0": [
      "CVE-2019-1348",
      "CVE-2019-1349",
      "CVE-2019-1350",
      "CVE-2019-1351",
      "CVE-2019-1352",
      "CVE-2019-1353",
      "CVE-2019-1354",
      "CVE-2019-1387"
    ],
    "2.18.1-r1": [
      "CVE-2018-19486"
    ],
    "2.18.1-r0": [
      "CVE-2018-17456"
    ],
    "2.17.1-r0": [
      "CVE-2018-11233",
      "CVE-2018-11235"
    ],
    "2.14.1-r0": [
      "CVE-2017-1000117"
    ]
  },
  "apkurl": "{{urlprefix}}/{{distroversion}}/{{reponame}}/{{arch}}/{{pkg.name}}-{{pkg.ver}}.apk",
  "archs": [
    "aarch64",
    "armhf",
    "armv7",
    "mips64",
    "mips64el",
    "ppc64le",
    "s390x",
    "x86",
    "x86_64"
  ],
  "urlprefix": "https://dl-cdn.alpinelinux.org/alpine",
  "reponame": "main",
  "distroversion": "v3.8"
}