{
  "name": "ruby-rexml",
  "secfixes": {
    "3.3.9-r0": [
      "CVE-2024-39908",
      "CVE-2024-41123",
      "CVE-2024-41946",
      "CVE-2024-43398",
      "CVE-2024-49761"
    ]
  },
  "apkurl": "{{urlprefix}}/{{distroversion}}/{{reponame}}/{{arch}}/{{pkg.name}}-{{pkg.ver}}.apk",
  "archs": [

  ],
  "urlprefix": "https://dl-cdn.alpinelinux.org/alpine",
  "reponame": "main",
  "distroversion": "v3.20"
}