{
  "name": "librsvg",
  "secfixes": {
    "2.56.3-r0": [
      "CVE-2023-38633"
    ],
    "2.50.4-r0": [

    ],
    "- RUSTSEC-2020-0146": [

    ],
    "2.46.2-r0": [
      "CVE-2019-20446"
    ]
  },
  "apkurl": "{{urlprefix}}/{{distroversion}}/{{reponame}}/{{arch}}/{{pkg.name}}-{{pkg.ver}}.apk",
  "archs": [
    "aarch64",
    "armhf",
    "armv7",
    "mips64",
    "mips64el",
    "ppc64le",
    "s390x",
    "x86",
    "x86_64"
  ],
  "urlprefix": "https://dl-cdn.alpinelinux.org/alpine",
  "reponame": "community",
  "distroversion": "v3.19"
}