{
  "name": "libde265",
  "secfixes": {
    "1.0.15-r0": [
      "CVE-2023-49465",
      "CVE-2023-49467",
      "CVE-2023-49468"
    ],
    "1.0.11-r1": [
      "CVE-2023-27102",
      "CVE-2023-27103"
    ],
    "1.0.11-r0": [
      "CVE-2020-21594",
      "CVE-2020-21595",
      "CVE-2020-21596",
      "CVE-2020-21597",
      "CVE-2020-21598",
      "CVE-2020-21599",
      "CVE-2020-21600",
      "CVE-2020-21601",
      "CVE-2020-21602",
      "CVE-2020-21603",
      "CVE-2020-21604",
      "CVE-2020-21605",
      "CVE-2020-21606",
      "CVE-2022-43236",
      "CVE-2022-43237",
      "CVE-2022-43238",
      "CVE-2022-43239",
      "CVE-2022-43240",
      "CVE-2022-43241",
      "CVE-2022-43242",
      "CVE-2022-43243",
      "CVE-2022-43244",
      "CVE-2022-43245",
      "CVE-2022-43248",
      "CVE-2022-43249",
      "CVE-2022-43250",
      "CVE-2022-43252",
      "CVE-2022-43253",
      "CVE-2022-47655"
    ],
    "1.0.8-r2": [
      "CVE-2021-35452",
      "CVE-2021-36408",
      "CVE-2021-36410",
      "CVE-2021-36411",
      "CVE-2022-1253"
    ]
  },
  "apkurl": "{{urlprefix}}/{{distroversion}}/{{reponame}}/{{arch}}/{{pkg.name}}-{{pkg.ver}}.apk",
  "archs": [
    "aarch64",
    "armhf",
    "armv7",
    "mips64",
    "mips64el",
    "ppc64le",
    "s390x",
    "x86",
    "x86_64"
  ],
  "urlprefix": "https://dl-cdn.alpinelinux.org/alpine",
  "reponame": "main",
  "distroversion": "v3.16"
}