{
  "name": "py3-paramiko",
  "secfixes": {
    "3.4.0-r0": [
      "CVE-2023-48795"
    ],
    "2.4.2-r0": [
      "CVE-2018-1000805"
    ],
    "2.4.1-r0": [
      "CVE-2018-7750"
    ]
  },
  "apkurl": "{{urlprefix}}/{{distroversion}}/{{reponame}}/{{arch}}/{{pkg.name}}-{{pkg.ver}}.apk",
  "archs": [

  ],
  "urlprefix": "https://dl-cdn.alpinelinux.org/alpine",
  "reponame": "community",
  "distroversion": "v3.21"
}