{
  "name": "imagemagick",
  "secfixes": {
    "6.9.5.3": [
      "CVE-2016-5010",
      "CVE-2016-5687",
      "CVE-2016-5688",
      "CVE-2016-5689",
      "CVE-2016-5690",
      "CVE-2016-5691",
      "CVE-2016-5841",
      "CVE-2016-5842",
      "CVE-2016-6491"
    ],
    "6.9.5.9-r1": [
      "CVE-2016-7799",
      "CVE-2016-7906"
    ]
  },
  "apkurl": "{{urlprefix}}/{{distroversion}}/{{reponame}}/{{arch}}/{{pkg.name}}-{{pkg.ver}}.apk",
  "archs": [
    "aarch64",
    "armhf",
    "armv7",
    "mips64",
    "mips64el",
    "ppc64le",
    "s390x",
    "x86",
    "x86_64"
  ],
  "urlprefix": "https://dl-cdn.alpinelinux.org/alpine",
  "reponame": "main",
  "distroversion": "v3.4"
}