{
  "name": "memcached",
  "secfixes": {
    "1.4.33-r2": [
      "CVE-2018-1000115"
    ],
    "1.4.33-r1": [
      "CVE-2017-9951"
    ],
    "1.4.33-r0": [
      "CVE-2016-8704",
      "CVE-2016-8705",
      "CVE-2016-8706"
    ]
  },
  "apkurl": "{{urlprefix}}/{{distroversion}}/{{reponame}}/{{arch}}/{{pkg.name}}-{{pkg.ver}}.apk",
  "archs": [
    "aarch64",
    "armhf",
    "armv7",
    "mips64",
    "mips64el",
    "ppc64le",
    "s390x",
    "x86",
    "x86_64"
  ],
  "urlprefix": "https://dl-cdn.alpinelinux.org/alpine",
  "reponame": "main",
  "distroversion": "v3.5"
}