{
  "name": "libgcrypt",
  "secfixes": {
    "1.9.4-r0": [
      "CVE-2021-33560"
    ],
    "1.8.5-r0": [
      "CVE-2019-13627"
    ],
    "1.8.4-r2": [
      "CVE-2019-12904"
    ],
    "1.8.3-r0": [
      "CVE-2018-0495"
    ]
  },
  "apkurl": "{{urlprefix}}/{{distroversion}}/{{reponame}}/{{arch}}/{{pkg.name}}-{{pkg.ver}}.apk",
  "archs": [
    "aarch64",
    "armhf",
    "armv7",
    "mips64",
    "mips64el",
    "ppc64le",
    "s390x",
    "x86",
    "x86_64"
  ],
  "urlprefix": "https://dl-cdn.alpinelinux.org/alpine",
  "reponame": "main",
  "distroversion": "v3.19"
}