{
  "name": "php81",
  "secfixes": {
    "8.1.31-r0": [
      "CVE-2024-8929",
      "CVE-2024-8932",
      "CVE-2024-11233",
      "CVE-2024-11234",
      "CVE-2024-11236"
    ],
    "8.1.30-r0": [
      "CVE-2024-8925",
      "CVE-2024-8926",
      "CVE-2024-8927",
      "CVE-2024-9026"
    ],
    "8.1.29-r0": [
      "CVE-2024-4577",
      "CVE-2024-5458",
      "CVE-2024-5585"
    ],
    "8.1.28-r0": [
      "CVE-2024-1874",
      "CVE-2024-2756",
      "CVE-2024-3096"
    ],
    "8.1.16-r0": [
      "CVE-2023-0567",
      "CVE-2023-0568",
      "CVE-2023-0662"
    ],
    "8.1.14-r0": [
      "CVE-2022-31631"
    ],
    "8.1.12-r0": [
      "CVE-2022-31630",
      "CVE-2022-37454"
    ],
    "8.1.11-r0": [
      "CVE-2022-31628",
      "CVE-2022-31629"
    ],
    "8.1.6-r2": [
      "CVE-2022-31625",
      "CVE-2022-31626"
    ],
    "8.1.0-r0": [
      "CVE-2021-21707"
    ],
    "8.1.0_rc5-r0": [
      "CVE-2021-21703"
    ],
    "8.1.0_rc3-r0": [
      "CVE-2021-21706"
    ]
  },
  "apkurl": "{{urlprefix}}/{{distroversion}}/{{reponame}}/{{arch}}/{{pkg.name}}-{{pkg.ver}}.apk",
  "archs": [
    "aarch64",
    "armhf",
    "armv7",
    "mips64",
    "mips64el",
    "ppc64le",
    "s390x",
    "x86",
    "x86_64"
  ],
  "urlprefix": "https://dl-cdn.alpinelinux.org/alpine",
  "reponame": "community",
  "distroversion": "v3.19"
}