{
  "name": "firefox-esr",
  "secfixes": {
    "115.17.0-r0": [
      "CVE-2024-10458",
      "CVE-2024-10459",
      "CVE-2024-10463"
    ],
    "115.9.1-r0": [
      "CVE-2024-29944"
    ],
    "115.9.0-r0": [
      "CVE-2023-5388",
      "CVE-2024-0743",
      "CVE-2024-2605",
      "CVE-2024-2607",
      "CVE-2024-2608",
      "CVE-2024-2610",
      "CVE-2024-2611",
      "CVE-2024-2612",
      "CVE-2024-2614",
      "CVE-2024-2616"
    ],
    "115.8.0-r0": [
      "CVE-2024-1546",
      "CVE-2024-1547",
      "CVE-2024-1548",
      "CVE-2024-1549",
      "CVE-2024-1550",
      "CVE-2024-1551",
      "CVE-2024-1552",
      "CVE-2024-1553"
    ],
    "115.7.0-r0": [
      "CVE-2024-0741",
      "CVE-2024-0742",
      "CVE-2024-0746",
      "CVE-2024-0747",
      "CVE-2024-0750",
      "CVE-2024-0751",
      "CVE-2024-0753",
      "CVE-2024-0755"
    ],
    "115.6.0-r0": [
      "CVE-2023-6856",
      "CVE-2023-6865",
      "CVE-2023-6857",
      "CVE-2023-6858",
      "CVE-2023-6859",
      "CVE-2023-6860",
      "CVE-2023-6867",
      "CVE-2023-6861",
      "CVE-2023-6862",
      "CVE-2023-6863",
      "CVE-2023-6864"
    ],
    "115.5.0-r0": [
      "CVE-2023-6204",
      "CVE-2023-6205",
      "CVE-2023-6206",
      "CVE-2023-6207",
      "CVE-2023-6208",
      "CVE-2023-6209",
      "CVE-2023-6212"
    ],
    "115.4.0-r0": [
      "CVE-2023-5721",
      "CVE-2023-5732",
      "CVE-2023-5724",
      "CVE-2023-5725",
      "CVE-2023-5726",
      "CVE-2023-5727",
      "CVE-2023-5728",
      "CVE-2023-5730"
    ],
    "115.3.1-r0": [
      "CVE-2023-5217"
    ],
    "115.3.0-r0": [
      "CVE-2023-5168",
      "CVE-2023-5169",
      "CVE-2023-5171",
      "CVE-2023-5174",
      "CVE-2023-5176"
    ],
    "115.2.1-r0": [
      "CVE-2023-4863"
    ],
    "115.2.0-r0": [
      "CVE-2023-4573",
      "CVE-2023-4574",
      "CVE-2023-4575",
      "CVE-2023-4576",
      "CVE-2023-4577",
      "CVE-2023-4051",
      "CVE-2023-4578",
      "CVE-2023-4053",
      "CVE-2023-4580",
      "CVE-2023-4581",
      "CVE-2023-4582",
      "CVE-2023-4583",
      "CVE-2023-4584",
      "CVE-2023-4585"
    ],
    "115.1.0-r0": [
      "CVE-2023-4045",
      "CVE-2023-4046",
      "CVE-2023-4047",
      "CVE-2023-4048",
      "CVE-2023-4049",
      "CVE-2023-4050",
      "CVE-2023-4052",
      "CVE-2023-4054",
      "CVE-2023-4055",
      "CVE-2023-4056",
      "CVE-2023-4057"
    ],
    "115.0.2-r0": [
      "CVE-2023-3600"
    ],
    "115.0-r0": [
      "CVE-2023-3482",
      "CVE-2023-37201",
      "CVE-2023-37202",
      "CVE-2023-37203",
      "CVE-2023-37204",
      "CVE-2023-37205",
      "CVE-2023-37206",
      "CVE-2023-37207",
      "CVE-2023-37208",
      "CVE-2023-37209",
      "CVE-2023-37210",
      "CVE-2023-37211",
      "CVE-2023-37212"
    ],
    "102.12.0-r0": [
      "CVE-2023-34414",
      "CVE-2023-34416"
    ],
    "102.11.0-r0": [
      "CVE-2023-32205",
      "CVE-2023-32206",
      "CVE-2023-32207",
      "CVE-2023-32211",
      "CVE-2023-32212",
      "CVE-2023-32213",
      "CVE-2023-32214",
      "CVE-2023-32215"
    ],
    "102.10.0-r0": [
      "CVE-2023-29531",
      "CVE-2023-29532",
      "CVE-2023-29533",
      "CVE-2023-1999",
      "CVE-2023-29535",
      "CVE-2023-29536",
      "CVE-2023-29539",
      "CVE-2023-29541",
      "CVE-2023-29542",
      "CVE-2023-29545",
      "CVE-2023-1945",
      "CVE-2023-29548",
      "CVE-2023-29550"
    ],
    "102.9.0-r0": [
      "CVE-2023-25751",
      "CVE-2023-28164",
      "CVE-2023-28162",
      "CVE-2023-25752",
      "CVE-2023-28163",
      "CVE-2023-28176"
    ],
    "102.8.0-r0": [
      "CVE-2023-25728",
      "CVE-2023-25730",
      "CVE-2023-0767",
      "CVE-2023-25735",
      "CVE-2023-25737",
      "CVE-2023-25738",
      "CVE-2023-25739",
      "CVE-2023-25729",
      "CVE-2023-25732",
      "CVE-2023-25734",
      "CVE-2023-25742",
      "CVE-2023-25744",
      "CVE-2023-25746"
    ],
    "102.7.0-r0": [
      "CVE-2022-46871",
      "CVE-2023-23598",
      "CVE-2023-23599",
      "CVE-2023-23601",
      "CVE-2023-23602",
      "CVE-2022-46877",
      "CVE-2023-23603",
      "CVE-2023-23605"
    ],
    "102.6.0-r0": [
      "CVE-2022-46880",
      "CVE-2022-46872",
      "CVE-2022-46881",
      "CVE-2022-46874",
      "CVE-2022-46875",
      "CVE-2022-46882",
      "CVE-2022-46878"
    ],
    "102.5.0-r0": [
      "CVE-2022-45403",
      "CVE-2022-45404",
      "CVE-2022-45405",
      "CVE-2022-45406",
      "CVE-2022-45408",
      "CVE-2022-45409",
      "CVE-2022-45410",
      "CVE-2022-45411",
      "CVE-2022-45412",
      "CVE-2022-45416",
      "CVE-2022-45418",
      "CVE-2022-45420",
      "CVE-2022-45421"
    ],
    "102.4.0-r0": [
      "CVE-2022-42927",
      "CVE-2022-42928",
      "CVE-2022-42929",
      "CVE-2022-42932"
    ],
    "102.3.0-r0": [
      "CVE-2022-3266",
      "CVE-2022-40959",
      "CVE-2022-40960",
      "CVE-2022-40958",
      "CVE-2022-40956",
      "CVE-2022-40957",
      "CVE-2022-40962"
    ],
    "102.2.0-r0": [
      "CVE-2022-38472",
      "CVE-2022-38473",
      "CVE-2022-38476",
      "CVE-2022-38477",
      "CVE-2022-38478"
    ],
    "102.1.0-r0": [
      "CVE-2022-2505",
      "CVE-2022-36314",
      "CVE-2022-36318",
      "CVE-2022-36319"
    ],
    "91.11.0-r0": [
      "CVE-2022-2200",
      "CVE-2022-31744",
      "CVE-2022-34468",
      "CVE-2022-34470",
      "CVE-2022-34472",
      "CVE-2022-34478",
      "CVE-2022-34479",
      "CVE-2022-34481",
      "CVE-2022-34484"
    ],
    "91.10.0-r0": [
      "CVE-2022-31736",
      "CVE-2022-31737",
      "CVE-2022-31738",
      "CVE-2022-31739",
      "CVE-2022-31740",
      "CVE-2022-31741",
      "CVE-2022-31742",
      "CVE-2022-31747"
    ],
    "91.9.1-r0": [
      "CVE-2022-1529",
      "CVE-2022-1802"
    ],
    "91.9.0-r0": [
      "CVE-2022-29909",
      "CVE-2022-29911",
      "CVE-2022-29912",
      "CVE-2022-29914",
      "CVE-2022-29916",
      "CVE-2022-29917"
    ],
    "91.8.0-r0": [
      "CVE-2022-1097",
      "CVE-2022-1196",
      "CVE-2022-24713",
      "CVE-2022-28281",
      "CVE-2022-28282",
      "CVE-2022-28285",
      "CVE-2022-28286",
      "CVE-2022-28289"
    ],
    "91.7.0-r0": [
      "CVE-2022-26381",
      "CVE-2022-26383",
      "CVE-2022-26384",
      "CVE-2022-26386",
      "CVE-2022-26387"
    ],
    "91.6.1-r0": [
      "CVE-2022-26485",
      "CVE-2022-26486"
    ],
    "91.6.0-r0": [
      "CVE-2022-22754",
      "CVE-2022-22756",
      "CVE-2022-22759",
      "CVE-2022-22760",
      "CVE-2022-22761",
      "CVE-2022-22763",
      "CVE-2022-22764"
    ],
    "91.5.0-r0": [
      "CVE-2021-4140",
      "CVE-2022-22737",
      "CVE-2022-22738",
      "CVE-2022-22739",
      "CVE-2022-22740",
      "CVE-2022-22741",
      "CVE-2022-22742",
      "CVE-2022-22743",
      "CVE-2022-22744",
      "CVE-2022-22745",
      "CVE-2022-22746",
      "CVE-2022-22747",
      "CVE-2022-22748",
      "CVE-2022-22751"
    ],
    "91.4.0-r0": [
      "CVE-2021-43536",
      "CVE-2021-43537",
      "CVE-2021-43538",
      "CVE-2021-43539",
      "CVE-2021-43541",
      "CVE-2021-43542",
      "CVE-2021-43543",
      "CVE-2021-43545",
      "CVE-2021-43546"
    ],
    "91.3.0-r0": [
      "CVE-2021-38503",
      "CVE-2021-38504",
      "CVE-2021-38505",
      "CVE-2021-38506",
      "CVE-2021-38507",
      "CVE-2021-38508",
      "CVE-2021-38509",
      "CVE-2021-38510"
    ],
    "91.2.0-r0": [
      "CVE-2021-32810",
      "CVE-2021-38492",
      "CVE-2021-38493",
      "CVE-2021-38495",
      "CVE-2021-38496",
      "CVE-2021-38497",
      "CVE-2021-38498",
      "CVE-2021-38500",
      "CVE-2021-38501"
    ],
    "78.13.0-r0": [
      "CVE-2021-29980",
      "CVE-2021-29984",
      "CVE-2021-29985",
      "CVE-2021-29986",
      "CVE-2021-29988",
      "CVE-2021-29989"
    ],
    "78.12.0-r0": [
      "CVE-2021-29970",
      "CVE-2021-29976",
      "CVE-2021-30547"
    ],
    "78.11.0-r0": [
      "CVE-2021-29967"
    ],
    "78.10.0-r0": [
      "CVE-2021-23961",
      "CVE-2021-23994",
      "CVE-2021-23995",
      "CVE-2021-23998",
      "CVE-2021-23999",
      "CVE-2021-24002",
      "CVE-2021-29945",
      "CVE-2021-29946"
    ],
    "78.9.0-r0": [
      "CVE-2021-23981",
      "CVE-2021-23982",
      "CVE-2021-23984",
      "CVE-2021-23987"
    ],
    "78.8.0-r0": [
      "CVE-2021-23968",
      "CVE-2021-23969",
      "CVE-2021-23973",
      "CVE-2021-23978"
    ],
    "78.7.0-r0": [
      "CVE-2020-26976",
      "CVE-2021-23953",
      "CVE-2021-23954",
      "CVE-2021-23960",
      "CVE-2021-23964"
    ],
    "78.6.1-r0": [
      "CVE-2020-16044"
    ],
    "78.6.0-r0": [
      "CVE-2020-16042",
      "CVE-2020-26971",
      "CVE-2020-26973",
      "CVE-2020-26974",
      "CVE-2020-26978",
      "CVE-2020-35111",
      "CVE-2020-35112",
      "CVE-2020-35113"
    ],
    "78.5.0-r0": [
      "CVE-2020-15683",
      "CVE-2020-15969",
      "CVE-2020-15999",
      "CVE-2020-16012",
      "CVE-2020-26950",
      "CVE-2020-26951",
      "CVE-2020-26953",
      "CVE-2020-26956",
      "CVE-2020-26958",
      "CVE-2020-26959",
      "CVE-2020-26960",
      "CVE-2020-26961",
      "CVE-2020-26965",
      "CVE-2020-26966",
      "CVE-2020-26968"
    ],
    "78.3.0-r0": [
      "CVE-2020-15673",
      "CVE-2020-15676",
      "CVE-2020-15677",
      "CVE-2020-15678"
    ],
    "78.2.0-r0": [
      "CVE-2020-15663",
      "CVE-2020-15664",
      "CVE-2020-15670"
    ],
    "78.1.0-r0": [
      "CVE-2020-15652",
      "CVE-2020-15653",
      "CVE-2020-15654",
      "CVE-2020-15655",
      "CVE-2020-15656",
      "CVE-2020-15657",
      "CVE-2020-15658",
      "CVE-2020-15659",
      "CVE-2020-6463",
      "CVE-2020-6514"
    ],
    "68.10.0-r0": [
      "CVE-2020-12417",
      "CVE-2020-12418",
      "CVE-2020-12419",
      "CVE-2020-12420",
      "CVE-2020-12421"
    ],
    "68.9.0-r0": [
      "CVE-2020-12399",
      "CVE-2020-12405",
      "CVE-2020-12406",
      "CVE-2020-12410"
    ],
    "68.8.0-r0": [
      "CVE-2020-12387",
      "CVE-2020-12388",
      "CVE-2020-12389",
      "CVE-2020-12392",
      "CVE-2020-12393",
      "CVE-2020-12395",
      "CVE-2020-6831"
    ],
    "68.7.0-r0": [
      "CVE-2020-6821",
      "CVE-2020-6822",
      "CVE-2020-6825"
    ],
    "68.6.1-r0": [
      "CVE-2020-6819",
      "CVE-2020-6820"
    ],
    "68.6.0-r0": [
      "CVE-2019-20503",
      "CVE-2020-6805",
      "CVE-2020-6806",
      "CVE-2020-6807",
      "CVE-2020-6811",
      "CVE-2020-6812",
      "CVE-2020-6814"
    ],
    "68.5.0-r0": [
      "CVE-2020-6796",
      "CVE-2020-6797",
      "CVE-2020-6798",
      "CVE-2020-6799",
      "CVE-2020-6800"
    ],
    "68.4.1-r0": [
      "CVE-2019-17016",
      "CVE-2019-17022",
      "CVE-2019-17024",
      "CVE-2019-17026"
    ],
    "68.3.0-r0": [
      "CVE-2019-17005",
      "CVE-2019-17008",
      "CVE-2019-17009",
      "CVE-2019-17010",
      "CVE-2019-17011",
      "CVE-2019-17012"
    ],
    "68.2.0-r0": [
      "CVE-2019-11757",
      "CVE-2019-11758",
      "CVE-2019-11759",
      "CVE-2019-11760",
      "CVE-2019-11761",
      "CVE-2019-11762",
      "CVE-2019-11763",
      "CVE-2019-11764",
      "CVE-2019-15903"
    ],
    "68.1.0-r0": [
      "CVE-2019-9812",
      "CVE-2019-11740",
      "CVE-2019-11742",
      "CVE-2019-11743",
      "CVE-2019-11744",
      "CVE-2019-11746",
      "CVE-2019-11752"
    ],
    "68.0.2-r0": [
      "CVE-2019-11733"
    ],
    "68.0-r0": [
      "CVE-2019-11709",
      "CVE-2019-11711",
      "CVE-2019-11712",
      "CVE-2019-11713",
      "CVE-2019-11715",
      "CVE-2019-11717",
      "CVE-2019-11719",
      "CVE-2019-11729",
      "CVE-2019-11730",
      "CVE-2019-9811"
    ],
    "60.7.2-r0": [
      "CVE-2019-11708"
    ],
    "60.7.1-r0": [
      "CVE-2019-11707"
    ],
    "60.7.0-r0": [
      "CVE-2019-9815",
      "CVE-2019-9816",
      "CVE-2019-9817",
      "CVE-2019-9818",
      "CVE-2019-9819",
      "CVE-2019-9820",
      "CVE-2019-11691",
      "CVE-2019-11692",
      "CVE-2019-11693",
      "CVE-2019-7317",
      "CVE-2019-9797",
      "CVE-2018-18511",
      "CVE-2019-11694",
      "CVE-2019-11698",
      "CVE-2019-5798",
      "CVE-2019-9800"
    ],
    "60.6.1-r0": [
      "CVE-2019-9810",
      "CVE-2019-9813",
      "CVE-2019-9790",
      "CVE-2019-9791",
      "CVE-2019-9792",
      "CVE-2019-9793",
      "CVE-2019-9794",
      "CVE-2019-9795",
      "CVE-2019-9796",
      "CVE-2019-9801",
      "CVE-2018-18506",
      "CVE-2019-9788"
    ],
    "60.5.2-r0": [
      "CVE-2019-5785",
      "CVE-2018-18335",
      "CVE-2018-18356"
    ],
    "60.5.0-r0": [
      "CVE-2018-18500",
      "CVE-2018-18505",
      "CVE-2018-18501"
    ],
    "52.6.0-r0": [
      "CVE-2018-5089",
      "CVE-2018-5091",
      "CVE-2018-5095",
      "CVE-2018-5096",
      "CVE-2018-5097",
      "CVE-2018-5098",
      "CVE-2018-5099",
      "CVE-2018-5102",
      "CVE-2018-5103",
      "CVE-2018-5104",
      "CVE-2018-5117"
    ],
    "52.5.2-r0": [
      "CVE-2017-7843"
    ]
  },
  "apkurl": "{{urlprefix}}/{{distroversion}}/{{reponame}}/{{arch}}/{{pkg.name}}-{{pkg.ver}}.apk",
  "archs": [
    "aarch64",
    "armv7",
    "ppc64le",
    "x86",
    "x86_64"
  ],
  "urlprefix": "https://dl-cdn.alpinelinux.org/alpine",
  "reponame": "community",
  "distroversion": "v3.19"
}