{
  "name": "openssh",
  "secfixes": {
    "6.8_p1-r10": [
      "CVE-2016-1907",
      "CVE-2015-8325"
    ],
    "6.8_p1-r7": [
      "CVE-2016-6210"
    ],
    "6.8_p1-r8": [
      "CVE-2016-6515"
    ],
    "6.8_p1-r9": [
      "CVE-2016-10010",
      "CVE-2016-10011"
    ]
  },
  "apkurl": "{{urlprefix}}/{{distroversion}}/{{reponame}}/{{arch}}/{{pkg.name}}-{{pkg.ver}}.apk",
  "archs": [
    "aarch64",
    "armhf",
    "armv7",
    "mips64",
    "mips64el",
    "ppc64le",
    "s390x",
    "x86",
    "x86_64"
  ],
  "urlprefix": "https://dl-cdn.alpinelinux.org/alpine",
  "reponame": "main",
  "distroversion": "v3.2"
}