{
  "name": "ceph",
  "secfixes": {
    "15.2.17-r0": [
      "CVE-2022-0670"
    ],
    "15.2.8-r0": [
      "CVE-2020-27781"
    ],
    "15.2.6-r0": [
      "CVE-2020-25660",
      "CVE-2020-10736",
      "CVE-2020-10753"
    ],
    "14.2.9-r0": [
      "CVE-2020-1759",
      "CVE-2020-1760"
    ],
    "14.2.7-r0": [
      "CVE-2020-1699",
      "CVE-2020-1700"
    ],
    "14.2.3-r0": [
      "CVE-2019-10222"
    ]
  },
  "apkurl": "{{urlprefix}}/{{distroversion}}/{{reponame}}/{{arch}}/{{pkg.name}}-{{pkg.ver}}.apk",
  "archs": [
    "aarch64",
    "armhf",
    "armv7",
    "mips64el",
    "ppc64le",
    "x86",
    "x86_64"
  ],
  "urlprefix": "https://dl-cdn.alpinelinux.org/alpine",
  "reponame": "community",
  "distroversion": "v3.13"
}