{
  "name": "erlang",
  "secfixes": {
    "26.2.1-r0": [
      "CVE-2023-48795"
    ],
    "25.0.3-r0": [
      "CVE-2022-37026"
    ],
    "23.2.5-r0": [
      "CVE-2020-35733"
    ]
  },
  "apkurl": "{{urlprefix}}/{{distroversion}}/{{reponame}}/{{arch}}/{{pkg.name}}-{{pkg.ver}}.apk",
  "archs": [
    "aarch64",
    "armhf",
    "armv7",
    "mips64",
    "mips64el",
    "ppc64le",
    "s390x",
    "x86",
    "x86_64"
  ],
  "urlprefix": "https://dl-cdn.alpinelinux.org/alpine",
  "reponame": "community",
  "distroversion": "v3.20"
}