{
  "name": "libssh",
  "secfixes": {
    "0.10.6-r0": [
      "CVE-2023-6004",
      "CVE-2023-6918",
      "CVE-2023-48795"
    ],
    "0.9.6-r0": [
      "CVE-2021-3634"
    ],
    "0.9.5-r0": [
      "CVE-2020-16135"
    ],
    "0.9.4-r0": [
      "CVE-2020-1730"
    ],
    "0.9.3-r0": [
      "CVE-2019-14889"
    ],
    "0.7.6-r0": [
      "CVE-2018-10933"
    ]
  },
  "apkurl": "{{urlprefix}}/{{distroversion}}/{{reponame}}/{{arch}}/{{pkg.name}}-{{pkg.ver}}.apk",
  "archs": [
    "aarch64",
    "armhf",
    "armv7",
    "mips64",
    "mips64el",
    "ppc64le",
    "s390x",
    "x86",
    "x86_64"
  ],
  "urlprefix": "https://dl-cdn.alpinelinux.org/alpine",
  "reponame": "community",
  "distroversion": "v3.19"
}