{
  "name": "zabbix",
  "secfixes": {
    "5.4.9-r1": [
      "CVE-2022-22704"
    ],
    "5.2.6-r0": [
      "CVE-2021-27927"
    ],
    "3.0.4-r0": [
      "CVE-2016-9140"
    ]
  },
  "apkurl": "{{urlprefix}}/{{distroversion}}/{{reponame}}/{{arch}}/{{pkg.name}}-{{pkg.ver}}.apk",
  "archs": [
    "aarch64",
    "armhf",
    "armv7",
    "mips64",
    "mips64el",
    "ppc64le",
    "s390x",
    "x86",
    "x86_64"
  ],
  "urlprefix": "https://dl-cdn.alpinelinux.org/alpine",
  "reponame": "community",
  "distroversion": "v3.15"
}