{
  "name": "libnbd",
  "secfixes": {
    "1.18.0-r0": [
      "CVE-2023-5215"
    ],
    "1.14.1-r0": [
      "CVE-2022-0485"
    ],
    "1.10.5-r0": [
      "CVE-2021-20286"
    ]
  },
  "apkurl": "{{urlprefix}}/{{distroversion}}/{{reponame}}/{{arch}}/{{pkg.name}}-{{pkg.ver}}.apk",
  "archs": [
    "aarch64",
    "armhf",
    "armv7",
    "mips64",
    "mips64el",
    "ppc64le",
    "s390x",
    "x86",
    "x86_64"
  ],
  "urlprefix": "https://dl-cdn.alpinelinux.org/alpine",
  "reponame": "community",
  "distroversion": "vedge"
}