{
  "name": "bind",
  "secfixes": {
    "9.16.20-r0": [
      "CVE-2021-25218"
    ],
    "9.16.15-r0": [
      "CVE-2021-25214",
      "CVE-2021-25215",
      "CVE-2021-25216"
    ],
    "9.16.11-r2": [
      "CVE-2020-8625"
    ],
    "9.16.6-r0": [
      "CVE-2020-8620",
      "CVE-2020-8621",
      "CVE-2020-8622",
      "CVE-2020-8623",
      "CVE-2020-8624"
    ],
    "9.16.4-r0": [
      "CVE-2020-8618",
      "CVE-2020-8619"
    ],
    "9.14.12-r0": [
      "CVE-2020-8616",
      "CVE-2020-8617"
    ],
    "9.14.8-r0": [
      "CVE-2019-6477"
    ],
    "9.14.7-r0": [
      "CVE-2019-6475",
      "CVE-2019-6476"
    ],
    "9.14.4-r0": [
      "CVE-2019-6471"
    ],
    "9.14.1-r0": [
      "CVE-2019-6467",
      "CVE-2018-5743"
    ],
    "9.12.3_p4-r0": [
      "CVE-2019-6465",
      "CVE-2018-5745",
      "CVE-2018-5744"
    ],
    "9.12.2_p1-r0": [
      "CVE-2018-5740",
      "CVE-2018-5738"
    ],
    "9.12.1_p2-r0": [
      "CVE-2018-5737",
      "CVE-2018-5736"
    ],
    "9.11.2_p1-r0": [
      "CVE-2017-3145"
    ],
    "9.11.0_p5-r0": [
      "CVE-2017-3136",
      "CVE-2017-3137",
      "CVE-2017-3138"
    ],
    "9.10.4_p5-r0": [
      "CVE-2016-9131",
      "CVE-2016-9147",
      "CVE-2016-9444"
    ],
    "0": [
      "CVE-2019-6470"
    ]
  },
  "apkurl": "{{urlprefix}}/{{distroversion}}/{{reponame}}/{{arch}}/{{pkg.name}}-{{pkg.ver}}.apk",
  "archs": [
    "aarch64",
    "armhf",
    "armv7",
    "mips64",
    "mips64el",
    "ppc64le",
    "s390x",
    "x86",
    "x86_64"
  ],
  "urlprefix": "https://dl-cdn.alpinelinux.org/alpine",
  "reponame": "main",
  "distroversion": "v3.11"
}