{
  "name": "openrazer",
  "secfixes": {
    "3.4.0-r0": [
      "CVE-2022-29021",
      "CVE-2022-29022",
      "CVE-2022-29023"
    ],
    "3.5.1-r0": [
      "CVE-2022-23467"
    ]
  },
  "apkurl": "{{urlprefix}}/{{distroversion}}/{{reponame}}/{{arch}}/{{pkg.name}}-{{pkg.ver}}.apk",
  "archs": [

  ],
  "urlprefix": "https://dl-cdn.alpinelinux.org/alpine",
  "reponame": "community",
  "distroversion": "v3.19"
}