{
  "name": "roundcubemail",
  "secfixes": {
    "1.2.7-r0": [
      "CVE-2017-16651"
    ],
    "1.2.5-r0": [
      "CVE-2017-8114"
    ]
  },
  "apkurl": "{{urlprefix}}/{{distroversion}}/{{reponame}}/{{arch}}/{{pkg.name}}-{{pkg.ver}}.apk",
  "archs": [

  ],
  "urlprefix": "https://dl-cdn.alpinelinux.org/alpine",
  "reponame": "community",
  "distroversion": "v3.6"
}