{
  "name": "sofia-sip",
  "secfixes": {
    "1.13.11-r0": [
      "CVE-2023-22741"
    ],
    "1.13.8-r0": [
      "CVE-2022-31001",
      "CVE-2022-31002",
      "CVE-2022-31003"
    ]
  },
  "apkurl": "{{urlprefix}}/{{distroversion}}/{{reponame}}/{{arch}}/{{pkg.name}}-{{pkg.ver}}.apk",
  "archs": [
    "aarch64",
    "armhf",
    "armv7",
    "mips64",
    "mips64el",
    "ppc64le",
    "s390x",
    "x86",
    "x86_64"
  ],
  "urlprefix": "https://dl-cdn.alpinelinux.org/alpine",
  "reponame": "main",
  "distroversion": "vedge"
}