{
  "name": "cups",
  "secfixes": {
    "2.2.12-r2": [
      "CVE-2019-8842",
      "CVE-2020-3898"
    ],
    "2.2.12-r0": [
      "CVE-2019-8696",
      "CVE-2019-8675"
    ],
    "2.2.10-r0": [
      "CVE-2018-4700"
    ]
  },
  "apkurl": "{{urlprefix}}/{{distroversion}}/{{reponame}}/{{arch}}/{{pkg.name}}-{{pkg.ver}}.apk",
  "archs": [
    "aarch64",
    "armhf",
    "armv7",
    "mips64",
    "mips64el",
    "ppc64le",
    "s390x",
    "x86",
    "x86_64"
  ],
  "urlprefix": "https://dl-cdn.alpinelinux.org/alpine",
  "reponame": "main",
  "distroversion": "v3.11"
}