{
  "name": "php7",
  "secfixes": {
    "7.3.22-r0": [
      "CVE-2020-7068"
    ],
    "7.3.18-r0": [
      "CVE-2019-11048"
    ],
    "7.3.17-r0": [
      "CVE-2020-7067"
    ],
    "7.3.16-r0": [
      "CVE-2020-7064",
      "CVE-2020-7065",
      "CVE-2020-7066"
    ],
    "7.3.15-r0": [
      "CVE-2020-7061",
      "CVE-2020-7062",
      "CVE-2020-7063"
    ],
    "7.3.14-r0": [
      "CVE-2020-7059",
      "CVE-2020-7060"
    ],
    "7.3.13-r0": [
      "CVE-2019-11045",
      "CVE-2019-11047",
      "CVE-2019-11050"
    ],
    "7.3.11-r0": [
      "CVE-2019-11043"
    ],
    "7.3.9-r0": [
      "CVE-2019-13224"
    ],
    "7.3.8-r0": [
      "CVE-2019-11041",
      "CVE-2019-11042"
    ],
    "7.2.19-r0": [
      "CVE-2019-11039",
      "CVE-2019-11040"
    ],
    "7.2.18-r0": [
      "CVE-2019-11036"
    ],
    "7.2.17-r0": [
      "CVE-2019-11034",
      "CVE-2019-11035"
    ],
    "7.2.16-r0": [
      "CVE-2019-9641",
      "CVE-2019-9640",
      "CVE-2019-9639",
      "CVE-2019-9638",
      "CVE-2019-9637"
    ],
    "7.2.14-r0": [
      "CVE-2019-9024",
      "CVE-2019-9023",
      "CVE-2019-9022",
      "CVE-2019-9021",
      "CVE-2019-9020"
    ],
    "7.2.13-r0": [
      "CVE-2018-20783"
    ],
    "7.2.8-r0": [
      "CVE-2015-9253",
      "CVE-2018-12882",
      "CVE-2018-12883",
      "CVE-2018-14851"
    ],
    "7.2.5-r0": [
      "CVE-2018-5712",
      "CVE-2018-10546",
      "CVE-2018-10547",
      "CVE-2018-10548",
      "CVE-2018-10549"
    ]
  },
  "apkurl": "{{urlprefix}}/{{distroversion}}/{{reponame}}/{{arch}}/{{pkg.name}}-{{pkg.ver}}.apk",
  "archs": [
    "aarch64",
    "armhf",
    "armv7",
    "mips64",
    "mips64el",
    "ppc64le",
    "s390x",
    "x86",
    "x86_64"
  ],
  "urlprefix": "https://dl-cdn.alpinelinux.org/alpine",
  "reponame": "community",
  "distroversion": "v3.11"
}