{
  "name": "openvpn",
  "secfixes": {
    "2.6.11-r0": [
      "CVE-2024-5594",
      "CVE-2024-28882"
    ],
    "2.6.7-r0": [
      "CVE-2023-46849",
      "CVE-2023-46850"
    ],
    "2.5.6-r0": [
      "CVE-2022-0547"
    ],
    "2.5.2-r0": [
      "CVE-2020-15078"
    ],
    "2.4.9-r0": [
      "CVE-2020-11810"
    ],
    "2.4.6-r0": [
      "CVE-2018-9336"
    ],
    "0": [
      "CVE-2020-7224",
      "CVE-2020-27569",
      "CVE-2024-4877"
    ]
  },
  "apkurl": "{{urlprefix}}/{{distroversion}}/{{reponame}}/{{arch}}/{{pkg.name}}-{{pkg.ver}}.apk",
  "archs": [
    "aarch64",
    "armhf",
    "armv7",
    "mips64",
    "mips64el",
    "ppc64le",
    "s390x",
    "x86",
    "x86_64"
  ],
  "urlprefix": "https://dl-cdn.alpinelinux.org/alpine",
  "reponame": "main",
  "distroversion": "v3.18"
}