{
  "name": "py3-bleach",
  "secfixes": {
    "3.3.0-r0": [
      "CVE-2021-23980"
    ],
    "3.1.2-r0": [
      "CVE-2020-6816"
    ],
    "3.1.1-r0": [
      "CVE-2020-6802"
    ]
  },
  "apkurl": "{{urlprefix}}/{{distroversion}}/{{reponame}}/{{arch}}/{{pkg.name}}-{{pkg.ver}}.apk",
  "archs": [

  ],
  "urlprefix": "https://dl-cdn.alpinelinux.org/alpine",
  "reponame": "community",
  "distroversion": "v3.16"
}