{
  "name": "zeromq",
  "secfixes": {
    "4.3.3-r0": [
      "CVE-2020-15166"
    ],
    "4.3.2-r0": [
      "CVE-2019-13132"
    ],
    "4.3.1-r0": [
      "CVE-2019-6250"
    ]
  },
  "apkurl": "{{urlprefix}}/{{distroversion}}/{{reponame}}/{{arch}}/{{pkg.name}}-{{pkg.ver}}.apk",
  "archs": [
    "aarch64",
    "armhf",
    "armv7",
    "mips64",
    "mips64el",
    "ppc64le",
    "s390x",
    "x86",
    "x86_64"
  ],
  "urlprefix": "https://dl-cdn.alpinelinux.org/alpine",
  "reponame": "main",
  "distroversion": "v3.19"
}