{
  "name": "nodejs-current",
  "secfixes": {
    "21.7.2-r0": [
      "CVE-2024-27982",
      "CVE-2024-27983"
    ],
    "20.8.1-r0": [
      "CVE-2023-45143",
      "CVE-2023-39332",
      "CVE-2023-39331",
      "CVE-2023-38552",
      "CVE-2023-39333"
    ],
    "18.9.1-r0": [
      "CVE-2022-32213",
      "CVE-2022-32215",
      "CVE-2022-32222",
      "CVE-2022-35255",
      "CVE-2022-35256"
    ],
    "18.6.0-r0": [
      "CVE-2022-32212",
      "CVE-2022-32214",
      "CVE-2022-32222"
    ],
    "17.3.1-r0": [
      "CVE-2021-44531",
      "CVE-2021-44532",
      "CVE-2021-44533",
      "CVE-2022-21824"
    ],
    "16.11.1-r0": [
      "CVE-2021-22959",
      "CVE-2021-22960"
    ],
    "16.6.2-r0": [
      "CVE-2021-3672",
      "CVE-2021-22931",
      "CVE-2021-22939"
    ],
    "16.6.0-r0": [
      "CVE-2021-22930"
    ],
    "15.10.0-r0": [
      "CVE-2021-22883",
      "CVE-2021-22884"
    ],
    "15.5.1-r0": [
      "CVE-2020-8265",
      "CVE-2020-8287"
    ],
    "15.3.0-r0": [
      "CVE-2020-8277"
    ],
    "14.11.0-r0": [
      "CVE-2020-8201",
      "CVE-2020-8251"
    ],
    "14.4.0-r0": [
      "CVE-2020-8172",
      "CVE-2020-11080",
      "CVE-2020-8174"
    ],
    "13.11.0-r0": [
      "CVE-2019-15604",
      "CVE-2019-15605",
      "CVE-2019-15606"
    ],
    "11.10.1-r0": [
      "CVE-2019-5737"
    ],
    "11.3.0-r0": [
      "CVE-2018-12121",
      "CVE-2018-12122",
      "CVE-2018-12123",
      "CVE-2018-0735",
      "CVE-2018-0734"
    ],
    "9.10.0-r0": [
      "CVE-2018-7158",
      "CVE-2018-7159",
      "CVE-2018-7160"
    ],
    "9.2.1-r0": [
      "CVE-2017-15896",
      "CVE-2017-15897"
    ],
    "0": [
      "CVE-2023-44487"
    ]
  },
  "apkurl": "{{urlprefix}}/{{distroversion}}/{{reponame}}/{{arch}}/{{pkg.name}}-{{pkg.ver}}.apk",
  "archs": [
    "aarch64",
    "armhf",
    "armv7",
    "mips64",
    "mips64el",
    "ppc64le",
    "s390x",
    "x86",
    "x86_64"
  ],
  "urlprefix": "https://dl-cdn.alpinelinux.org/alpine",
  "reponame": "community",
  "distroversion": "v3.19"
}