{
  "name": "redict",
  "secfixes": {
    "7.3.2-r0": [
      "CVE-2024-46981",
      "CVE-2024-51741"
    ],
    "7.3.1-r0": [
      "CVE-2024-31227",
      "CVE-2024-31228",
      "CVE-2024-31449"
    ]
  },
  "apkurl": "{{urlprefix}}/{{distroversion}}/{{reponame}}/{{arch}}/{{pkg.name}}-{{pkg.ver}}.apk",
  "archs": [
    "aarch64",
    "armhf",
    "armv7",
    "mips64",
    "mips64el",
    "ppc64le",
    "s390x",
    "x86",
    "x86_64"
  ],
  "urlprefix": "https://dl-cdn.alpinelinux.org/alpine",
  "reponame": "community",
  "distroversion": "vedge"
}