{
  "name": "njs",
  "secfixes": {
    "0.7.3-r0": [
      "CVE-2021-46462",
      "CVE-2021-46463",
      "CVE-2022-25139"
    ],
    "0.7.1-r0": [
      "CVE-2021-46461"
    ]
  },
  "apkurl": "{{urlprefix}}/{{distroversion}}/{{reponame}}/{{arch}}/{{pkg.name}}-{{pkg.ver}}.apk",
  "archs": [
    "aarch64",
    "armhf",
    "armv7",
    "mips64",
    "mips64el",
    "ppc64le",
    "s390x",
    "x86",
    "x86_64"
  ],
  "urlprefix": "https://dl-cdn.alpinelinux.org/alpine",
  "reponame": "community",
  "distroversion": "vedge"
}