{
  "name": "gogs",
  "secfixes": {
    "0.13.0-r0": [
      "CVE-2022-32174"
    ],
    "0.12.9-r0": [
      "CVE-2022-1285"
    ],
    "0.12.7-r0": [
      "CVE-2022-1464"
    ],
    "0.12.6-r0": [
      "CVE-2022-0870",
      "CVE-2022-0871"
    ]
  },
  "apkurl": "{{urlprefix}}/{{distroversion}}/{{reponame}}/{{arch}}/{{pkg.name}}-{{pkg.ver}}.apk",
  "archs": [
    "aarch64",
    "armhf",
    "armv7",
    "mips64",
    "mips64el",
    "ppc64le",
    "s390x",
    "x86",
    "x86_64"
  ],
  "urlprefix": "https://dl-cdn.alpinelinux.org/alpine",
  "reponame": "community",
  "distroversion": "v3.18"
}