{
  "name": "lxc",
  "secfixes": {
    "4.0.12-r2": [
      "CVE-2022-47952"
    ],
    "3.1.0-r1": [
      "CVE-2019-5736"
    ],
    "2.1.1-r9": [
      "CVE-2018-6556"
    ]
  },
  "apkurl": "{{urlprefix}}/{{distroversion}}/{{reponame}}/{{arch}}/{{pkg.name}}-{{pkg.ver}}.apk",
  "archs": [
    "aarch64",
    "armhf",
    "armv7",
    "mips64",
    "mips64el",
    "ppc64le",
    "s390x",
    "x86",
    "x86_64"
  ],
  "urlprefix": "https://dl-cdn.alpinelinux.org/alpine",
  "reponame": "main",
  "distroversion": "v3.16"
}