{
  "name": "postgresql16",
  "secfixes": {
    "16.8-r0": [
      "CVE-2025-1094"
    ],
    "16.5-r0": [
      "CVE-2024-10976",
      "CVE-2024-10977",
      "CVE-2024-10978",
      "CVE-2024-10979"
    ],
    "16.4-r0": [
      "CVE-2024-7348"
    ],
    "16.2-r0": [
      "CVE-2024-0985"
    ],
    "16.1-r0": [
      "CVE-2023-5868",
      "CVE-2023-5869",
      "CVE-2023-5870"
    ]
  },
  "apkurl": "{{urlprefix}}/{{distroversion}}/{{reponame}}/{{arch}}/{{pkg.name}}-{{pkg.ver}}.apk",
  "archs": [
    "aarch64",
    "armhf",
    "armv7",
    "mips64",
    "mips64el",
    "ppc64le",
    "s390x",
    "x86",
    "x86_64"
  ],
  "urlprefix": "https://dl-cdn.alpinelinux.org/alpine",
  "reponame": "main",
  "distroversion": "v3.20"
}