{
  "name": "radare2",
  "secfixes": {
    "5.8.2-r0": [
      "CVE-2023-0302"
    ],
    "5.8.0-r0": [
      "CVE-2022-4398"
    ],
    "5.7.2-r0": [
      "CVE-2022-34520",
      "CVE-2022-34502"
    ],
    "5.7.0-r0": [
      "CVE-2022-1437",
      "CVE-2022-1444",
      "CVE-2022-1451",
      "CVE-2022-1452",
      "CVE-2022-1649",
      "CVE-2022-1714",
      "CVE-2022-1809",
      "CVE-2022-1899"
    ],
    "5.6.8-r0": [
      "CVE-2022-1061",
      "CVE-2022-1207",
      "CVE-2022-1237",
      "CVE-2022-1238",
      "CVE-2022-1244",
      "CVE-2022-1283",
      "CVE-2022-1284",
      "CVE-2022-1296",
      "CVE-2022-1297",
      "CVE-2022-1382",
      "CVE-2022-1383"
    ],
    "5.6.6-r0": [
      "CVE-2022-0849",
      "CVE-2022-1031",
      "CVE-2022-1052",
      "CVE-2022-1240"
    ],
    "5.6.4-r0": [
      "CVE-2022-0476",
      "CVE-2022-0676",
      "CVE-2022-0695",
      "CVE-2022-0712",
      "CVE-2022-0713"
    ],
    "5.6.2-r0": [
      "CVE-2022-0518",
      "CVE-2022-0519",
      "CVE-2022-0520",
      "CVE-2022-0521",
      "CVE-2022-0522",
      "CVE-2022-0523",
      "CVE-2022-0559"
    ],
    "5.6.0-r0": [
      "CVE-2022-0139",
      "CVE-2022-0173",
      "CVE-2022-0419"
    ],
    "5.5.4-r0": [
      "CVE-2021-44974",
      "CVE-2021-44975"
    ],
    "5.5.2-r0": [
      "CVE-2021-4021"
    ],
    "5.4.0-r0": [
      "CVE-2021-3673"
    ],
    "5.3.1-r0": [
      "CVE-2021-32613"
    ],
    "4.5.1-r0": [
      "CVE-2020-16269",
      "CVE-2020-17487"
    ],
    "4.5.0-r0": [
      "CVE-2020-15121"
    ],
    "4.4.0-r0": [
      "CVE-2020-27793",
      "CVE-2020-27794",
      "CVE-2020-27795"
    ],
    "4.0.0-r0": [
      "CVE-2019-19590",
      "CVE-2019-19647"
    ],
    "3.9.0-r0": [
      "CVE-2019-14745",
      "CVE-2019-12865",
      "CVE-2019-12829",
      "CVE-2019-12802",
      "CVE-2019-12790"
    ]
  },
  "apkurl": "{{urlprefix}}/{{distroversion}}/{{reponame}}/{{arch}}/{{pkg.name}}-{{pkg.ver}}.apk",
  "archs": [
    "aarch64",
    "armhf",
    "armv7",
    "mips64",
    "mips64el",
    "ppc64le",
    "s390x",
    "x86",
    "x86_64"
  ],
  "urlprefix": "https://dl-cdn.alpinelinux.org/alpine",
  "reponame": "community",
  "distroversion": "v3.20"
}