{
  "name": "exim",
  "secfixes": {
    "4.98-r0": [
      "CVE-2024-39929"
    ],
    "4.97.1-r0": [
      "CVE-2023-51766"
    ],
    "4.96.2-r0": [
      "CVE-2023-42117",
      "CVE-2023-42119"
    ],
    "4.96.1-r0": [
      "CVE-2023-42114",
      "CVE-2023-42115",
      "CVE-2023-42116"
    ],
    "4.94.2-r0": [
      "CVE-2021-27216",
      "CVE-2020-28007",
      "CVE-2020-28008",
      "CVE-2020-28009",
      "CVE-2020-28010",
      "CVE-2020-28011",
      "CVE-2020-28012",
      "CVE-2020-28013",
      "CVE-2020-28014",
      "CVE-2020-28015",
      "CVE-2020-28016",
      "CVE-2020-28017",
      "CVE-2020-28018",
      "CVE-2020-28019",
      "CVE-2020-28020",
      "CVE-2020-28021",
      "CVE-2020-28022",
      "CVE-2020-28023",
      "CVE-2020-28024",
      "CVE-2020-28025",
      "CVE-2020-28026"
    ],
    "4.93-r1": [
      "CVE-2020-12783"
    ],
    "4.92.2-r1": [
      "CVE-2019-16928"
    ],
    "4.92.2-r0": [
      "CVE-2019-15846"
    ],
    "4.92.1-r0": [
      "CVE-2019-13917"
    ],
    "4.92-r0": [
      "CVE-2019-10149"
    ],
    "4.89-r5": [
      "CVE-2017-1000369"
    ],
    "4.89-r7": [
      "CVE-2017-16943"
    ],
    "4.89.1-r0": [
      "CVE-2017-16944"
    ],
    "4.90.1-r0": [
      "CVE-2018-6789"
    ]
  },
  "apkurl": "{{urlprefix}}/{{distroversion}}/{{reponame}}/{{arch}}/{{pkg.name}}-{{pkg.ver}}.apk",
  "archs": [
    "aarch64",
    "armhf",
    "armv7",
    "mips64",
    "mips64el",
    "ppc64le",
    "s390x",
    "x86",
    "x86_64"
  ],
  "urlprefix": "https://dl-cdn.alpinelinux.org/alpine",
  "reponame": "community",
  "distroversion": "vedge"
}