{
  "name": "giflib",
  "secfixes": {
    "5.2.2-r0": [
      "CVE-2023-39742",
      "CVE-2023-48161",
      "CVE-2021-40633"
    ],
    "5.2.1-r2": [
      "CVE-2022-28506"
    ]
  },
  "apkurl": "{{urlprefix}}/{{distroversion}}/{{reponame}}/{{arch}}/{{pkg.name}}-{{pkg.ver}}.apk",
  "archs": [
    "aarch64",
    "armhf",
    "armv7",
    "mips64",
    "mips64el",
    "ppc64le",
    "s390x",
    "x86",
    "x86_64"
  ],
  "urlprefix": "https://dl-cdn.alpinelinux.org/alpine",
  "reponame": "main",
  "distroversion": "v3.17"
}