{
  "name": "dbus",
  "secfixes": {
    "1.14.4-r0": [
      "CVE-2022-42010",
      "CVE-2022-42011",
      "CVE-2022-42012"
    ],
    "1.12.18-r0": [
      "CVE-2020-12049"
    ],
    "1.12.16-r0": [
      "CVE-2019-12749"
    ]
  },
  "apkurl": "{{urlprefix}}/{{distroversion}}/{{reponame}}/{{arch}}/{{pkg.name}}-{{pkg.ver}}.apk",
  "archs": [
    "aarch64",
    "armhf",
    "armv7",
    "mips64",
    "mips64el",
    "ppc64le",
    "s390x",
    "x86",
    "x86_64"
  ],
  "urlprefix": "https://dl-cdn.alpinelinux.org/alpine",
  "reponame": "main",
  "distroversion": "v3.17"
}