{
  "name": "postgresql17",
  "secfixes": {
    "17.4-r0": [
      "CVE-2025-1094"
    ],
    "17.1-r0": [
      "CVE-2024-10976",
      "CVE-2024-10977",
      "CVE-2024-10978",
      "CVE-2024-10979"
    ]
  },
  "apkurl": "{{urlprefix}}/{{distroversion}}/{{reponame}}/{{arch}}/{{pkg.name}}-{{pkg.ver}}.apk",
  "archs": [
    "aarch64",
    "armhf",
    "armv7",
    "mips64",
    "mips64el",
    "ppc64le",
    "s390x",
    "x86",
    "x86_64"
  ],
  "urlprefix": "https://dl-cdn.alpinelinux.org/alpine",
  "reponame": "main",
  "distroversion": "vedge"
}