{
  "name": "samba",
  "secfixes": {
    "4.2.14-r4": [
      "CVE-2017-11103"
    ],
    "4.2.14-r3": [
      "CVE-2017-7494"
    ],
    "4.2.14-r2": [
      "CVE-2017-2619"
    ],
    "4.2.14-r1": [
      "CVE-2016-2123",
      "CVE-2016-2125",
      "CVE-2016-2126"
    ]
  },
  "apkurl": "{{urlprefix}}/{{distroversion}}/{{reponame}}/{{arch}}/{{pkg.name}}-{{pkg.ver}}.apk",
  "archs": [
    "aarch64",
    "armhf",
    "armv7",
    "mips64",
    "mips64el",
    "ppc64le",
    "s390x",
    "x86",
    "x86_64"
  ],
  "urlprefix": "https://dl-cdn.alpinelinux.org/alpine",
  "reponame": "main",
  "distroversion": "v3.3"
}