{
  "name": "cups",
  "secfixes": {
    "2.4.10-r1": [
      "CVE-2024-47175"
    ],
    "2.4.9-r0": [
      "CVE-2024-35235"
    ],
    "2.4.7-r0": [
      "CVE-2023-4504"
    ],
    "2.4.2-r7": [
      "CVE-2023-32324"
    ],
    "2.4.2-r0": [
      "CVE-2022-26691"
    ],
    "2.3.3-r0": [
      "CVE-2020-3898",
      "CVE-2019-8842"
    ],
    "2.2.12-r0": [
      "CVE-2019-8696",
      "CVE-2019-8675"
    ],
    "2.2.10-r0": [
      "CVE-2018-4700"
    ]
  },
  "apkurl": "{{urlprefix}}/{{distroversion}}/{{reponame}}/{{arch}}/{{pkg.name}}-{{pkg.ver}}.apk",
  "archs": [
    "aarch64",
    "armhf",
    "armv7",
    "mips64",
    "mips64el",
    "ppc64le",
    "s390x",
    "x86",
    "x86_64"
  ],
  "urlprefix": "https://dl-cdn.alpinelinux.org/alpine",
  "reponame": "main",
  "distroversion": "v3.21"
}