{
  "name": "stb",
  "secfixes": {
    "0_git20231012-r0": [
      "CVE-2023-43898",
      "CVE-2023-45661",
      "CVE-2023-45662",
      "CVE-2023-45663",
      "CVE-2023-45664",
      "CVE-2023-45666",
      "CVE-2023-45667",
      "CVE-2023-45675"
    ]
  },
  "apkurl": "{{urlprefix}}/{{distroversion}}/{{reponame}}/{{arch}}/{{pkg.name}}-{{pkg.ver}}.apk",
  "archs": [

  ],
  "urlprefix": "https://dl-cdn.alpinelinux.org/alpine",
  "reponame": "community",
  "distroversion": "v3.21"
}