{
  "name": "lighttpd",
  "secfixes": {
    "1.4.76-r0": [
      "CVE-2024-3094"
    ],
    "1.4.73-r0": [
      "CVE-2023-44487"
    ],
    "1.4.67-r0": [
      "CVE-2022-41556"
    ],
    "1.4.64-r0": [
      "CVE-2022-22707"
    ]
  },
  "apkurl": "{{urlprefix}}/{{distroversion}}/{{reponame}}/{{arch}}/{{pkg.name}}-{{pkg.ver}}.apk",
  "archs": [
    "aarch64",
    "armhf",
    "armv7",
    "mips64",
    "mips64el",
    "ppc64le",
    "s390x",
    "x86",
    "x86_64"
  ],
  "urlprefix": "https://dl-cdn.alpinelinux.org/alpine",
  "reponame": "main",
  "distroversion": "v3.16"
}