{
  "name": "cosign",
  "secfixes": {
    "2.2.1-r0": [
      "CVE-2023-46737"
    ],
    "1.12.1-r0": [
      "CVE-2022-36056"
    ],
    "1.10.1-r0": [
      "CVE-2022-35929"
    ],
    "1.5.2-r0": [
      "CVE-2022-23649"
    ]
  },
  "apkurl": "{{urlprefix}}/{{distroversion}}/{{reponame}}/{{arch}}/{{pkg.name}}-{{pkg.ver}}.apk",
  "archs": [
    "aarch64",
    "armhf",
    "armv7",
    "mips64",
    "mips64el",
    "ppc64le",
    "s390x",
    "x86",
    "x86_64"
  ],
  "urlprefix": "https://dl-cdn.alpinelinux.org/alpine",
  "reponame": "community",
  "distroversion": "vedge"
}