{
  "name": "jenkins",
  "secfixes": {
    "2.346.2-r0": [
      "CVE-2022-34174",
      "CVE-2022-34173",
      "CVE-2022-34172",
      "CVE-2022-34171",
      "CVE-2022-34170"
    ],
    "2.332.1-r0": [
      "CVE-2022-20612"
    ],
    "2.319.3-r0": [
      "CVE-2022-0538"
    ],
    "2.319.2-r0": [
      "CVE-2022-20612"
    ],
    "2.287-r0": [
      "CVE-2021-21639",
      "CVE-2021-21640"
    ],
    "2.275-r0": [
      "CVE-2021-21602",
      "CVE-2021-21603",
      "CVE-2021-21604",
      "CVE-2021-21605",
      "CVE-2021-21606",
      "CVE-2021-21607",
      "CVE-2021-21608",
      "CVE-2021-21609",
      "CVE-2021-21610",
      "CVE-2021-21611"
    ],
    "2.245-r0": [
      "CVE-2020-2220",
      "CVE-2020-2221",
      "CVE-2020-2222",
      "CVE-2020-2223"
    ],
    "2.228-r0": [
      "CVE-2020-2160",
      "CVE-2020-2161",
      "CVE-2020-2162",
      "CVE-2020-2163"
    ]
  },
  "apkurl": "{{urlprefix}}/{{distroversion}}/{{reponame}}/{{arch}}/{{pkg.name}}-{{pkg.ver}}.apk",
  "archs": [

  ],
  "urlprefix": "https://dl-cdn.alpinelinux.org/alpine",
  "reponame": "community",
  "distroversion": "v3.16"
}