{
  "name": "dovecot",
  "secfixes": {
    "2.2.36.4-r0": [
      "CVE-2019-11500"
    ],
    "2.2.36.3-r0": [
      "CVE-2019-7524"
    ],
    "2.2.36.1-r0": [
      "CVE-2019-3814"
    ],
    "2.2.34-r0": [
      "CVE-2017-15130",
      "CVE-2017-14461",
      "CVE-2017-15132"
    ]
  },
  "apkurl": "{{urlprefix}}/{{distroversion}}/{{reponame}}/{{arch}}/{{pkg.name}}-{{pkg.ver}}.apk",
  "archs": [
    "aarch64",
    "armhf",
    "armv7",
    "mips64",
    "mips64el",
    "ppc64le",
    "s390x",
    "x86",
    "x86_64"
  ],
  "urlprefix": "https://dl-cdn.alpinelinux.org/alpine",
  "reponame": "main",
  "distroversion": "v3.7"
}