{
  "name": "java-postgresql-jdbc",
  "secfixes": {
    "42.5.1-r0": [
      "CVE-2022-41946"
    ],
    "42.4.2-r0": [
      "CVE-2022-31197"
    ],
    "42.2.25-r0": [
      "CVE-2022-21724",
      "CVE-2020-13692"
    ]
  },
  "apkurl": "{{urlprefix}}/{{distroversion}}/{{reponame}}/{{arch}}/{{pkg.name}}-{{pkg.ver}}.apk",
  "archs": [

  ],
  "urlprefix": "https://dl-cdn.alpinelinux.org/alpine",
  "reponame": "community",
  "distroversion": "v3.17"
}