{
  "name": "bind",
  "secfixes": {
    "9.10.8_p1-r0": [
      "CVE-2018-5740"
    ],
    "9.10.6_p1-r0": [
      "CVE-2017-3145"
    ],
    "9.10.4_p8-r1": [
      "CVE-2017-3142",
      "CVE-2017-3143"
    ],
    "9.10.4_p8-r0": [
      "CVE-2017-3136",
      "CVE-2017-3137",
      "CVE-2017-3138"
    ],
    "9.10.4_p6-r0": [
      "CVE-2017-3135"
    ],
    "9.10.4_p5-r0": [
      "CVE-2016-9131",
      "CVE-2016-9147",
      "CVE-2016-9444"
    ]
  },
  "apkurl": "{{urlprefix}}/{{distroversion}}/{{reponame}}/{{arch}}/{{pkg.name}}-{{pkg.ver}}.apk",
  "archs": [
    "aarch64",
    "armhf",
    "armv7",
    "mips64",
    "mips64el",
    "ppc64le",
    "s390x",
    "x86",
    "x86_64"
  ],
  "urlprefix": "https://dl-cdn.alpinelinux.org/alpine",
  "reponame": "main",
  "distroversion": "v3.5"
}