{
  "name": "mutt",
  "secfixes": {
    "1.10.1-r0": [
      "CVE-2018-14349",
      "CVE-2018-14350",
      "CVE-2018-14351",
      "CVE-2018-14352",
      "CVE-2018-14353",
      "CVE-2018-14354",
      "CVE-2018-14355",
      "CVE-2018-14356",
      "CVE-2018-14357",
      "CVE-2018-14358",
      "CVE-2018-14359",
      "CVE-2018-14362"
    ]
  },
  "apkurl": "{{urlprefix}}/{{distroversion}}/{{reponame}}/{{arch}}/{{pkg.name}}-{{pkg.ver}}.apk",
  "archs": [
    "aarch64",
    "armhf",
    "armv7",
    "mips64",
    "mips64el",
    "ppc64le",
    "s390x",
    "x86",
    "x86_64"
  ],
  "urlprefix": "https://dl-cdn.alpinelinux.org/alpine",
  "reponame": "main",
  "distroversion": "v3.7"
}