{
  "name": "containerd",
  "secfixes": {
    "1.6.18-r0": [
      "CVE-2023-25153",
      "CVE-2023-25173"
    ],
    "1.6.12-r0": [
      "CVE-2022-23471"
    ],
    "1.6.6-r0": [
      "CVE-2022-31030"
    ],
    "1.6.2-r0": [
      "CVE-2022-24769"
    ],
    "1.6.1-r0": [
      "CVE-2022-23648"
    ],
    "1.5.9-r0": [
      "CVE-2021-43816"
    ],
    "1.5.8-r0": [
      "CVE-2021-41190"
    ],
    "1.5.7-r0": [
      "CVE-2021-41103"
    ],
    "1.5.4-r0": [
      "CVE-2021-32760"
    ],
    "1.4.4-r0": [
      "CVE-2021-21334"
    ],
    "1.4.3-r0": [
      "CVE-2020-15257"
    ],
    "1.3.3-r0": [
      "CVE-2019-19921",
      "CVE-2020-0601",
      "CVE-2020-7919",
      "CVE-2019-11253"
    ],
    "1.3.1-r0": [
      "CVE-2019-17596"
    ],
    "1.3.0-r0": [
      "CVE-2019-16884"
    ],
    "1.2.9-r0": [
      "CVE-2019-9512",
      "CVE-2019-9514",
      "CVE-2019-9515"
    ],
    "1.2.6-r0": [
      "CVE-2019-9946"
    ]
  },
  "apkurl": "{{urlprefix}}/{{distroversion}}/{{reponame}}/{{arch}}/{{pkg.name}}-{{pkg.ver}}.apk",
  "archs": [
    "aarch64",
    "armhf",
    "armv7",
    "mips64",
    "mips64el",
    "ppc64le",
    "s390x",
    "x86",
    "x86_64"
  ],
  "urlprefix": "https://dl-cdn.alpinelinux.org/alpine",
  "reponame": "community",
  "distroversion": "v3.17"
}