{
  "name": "tiff",
  "secfixes": {
    "4.5.0-r5": [
      "CVE-2023-0795",
      "CVE-2023-0796",
      "CVE-2023-0797",
      "CVE-2023-0798",
      "CVE-2023-0799",
      "CVE-2023-0800",
      "CVE-2023-0801",
      "CVE-2023-0802",
      "CVE-2023-0803",
      "CVE-2023-0804"
    ],
    "4.5.0-r3": [
      "CVE-2022-48281"
    ],
    "4.5.0-r0": [
      "CVE-2022-2953",
      "CVE-2022-3213",
      "CVE-2022-3570",
      "CVE-2022-3597",
      "CVE-2022-3598",
      "CVE-2022-3599",
      "CVE-2022-3626",
      "CVE-2022-3627",
      "CVE-2022-3970"
    ],
    "4.4.0-r1": [
      "CVE-2022-2056",
      "CVE-2022-2057",
      "CVE-2022-2058",
      "CVE-2022-2519",
      "CVE-2022-2520",
      "CVE-2022-2521",
      "CVE-2022-34526"
    ],
    "4.4.0-r0": [
      "CVE-2022-2867",
      "CVE-2022-2868",
      "CVE-2022-2869"
    ],
    "4.3.0-r1": [
      "CVE-2022-0561",
      "CVE-2022-0562",
      "CVE-2022-0865",
      "CVE-2022-0891",
      "CVE-2022-0907",
      "CVE-2022-0908",
      "CVE-2022-0909",
      "CVE-2022-0924",
      "CVE-2022-22844",
      "CVE-2022-34266"
    ],
    "4.2.0-r0": [
      "CVE-2020-35521",
      "CVE-2020-35522",
      "CVE-2020-35523",
      "CVE-2020-35524"
    ],
    "4.1.0-r0": [
      "CVE-2019-6128"
    ],
    "4.0.10-r2": [
      "CVE-2019-10927"
    ],
    "4.0.10-r1": [
      "CVE-2019-14973"
    ],
    "4.0.10-r0": [
      "CVE-2018-12900",
      "CVE-2018-18557",
      "CVE-2018-18661"
    ],
    "4.0.9-r8": [
      "CVE-2018-10779",
      "CVE-2018-17100",
      "CVE-2018-17101"
    ],
    "4.0.9-r6": [
      "CVE-2017-9935",
      "CVE-2017-11613",
      "CVE-2017-17095",
      "CVE-2018-10963"
    ],
    "4.0.9-r5": [
      "CVE-2018-8905"
    ],
    "4.0.9-r4": [
      "CVE-2018-7456"
    ],
    "4.0.9-r2": [
      "CVE-2018-5784"
    ],
    "4.0.9-r1": [
      "CVE-2017-18013"
    ],
    "4.0.9-r0": [
      "CVE-2017-16231",
      "CVE-2017-16232"
    ],
    "4.0.8-r1": [
      "CVE-2017-9936",
      "CVE-2017-10688"
    ],
    "4.0.7-r2": [
      "CVE-2017-7592",
      "CVE-2017-7593",
      "CVE-2017-7594",
      "CVE-2017-7595",
      "CVE-2017-7596",
      "CVE-2017-7598",
      "CVE-2017-7601",
      "CVE-2017-7602"
    ],
    "4.0.7-r1": [
      "CVE-2017-5225"
    ]
  },
  "apkurl": "{{urlprefix}}/{{distroversion}}/{{reponame}}/{{arch}}/{{pkg.name}}-{{pkg.ver}}.apk",
  "archs": [
    "aarch64",
    "armhf",
    "armv7",
    "mips64",
    "mips64el",
    "ppc64le",
    "s390x",
    "x86",
    "x86_64"
  ],
  "urlprefix": "https://dl-cdn.alpinelinux.org/alpine",
  "reponame": "main",
  "distroversion": "v3.19"
}