{
  "name": "curl",
  "secfixes": {
    "7.60.0-r0": [
      "CVE-2018-1000300",
      "CVE-2018-1000301"
    ],
    "7.59.0-r0": [
      "CVE-2018-1000120",
      "CVE-2018-1000121",
      "CVE-2018-1000122"
    ],
    "7.58.0-r0": [
      "CVE-2018-1000005"
    ],
    "7.57.0-r0": [
      "CVE-2017-8816",
      "CVE-2017-8817",
      "CVE-2017-8818"
    ],
    "7.55.0-r2": [
      "CVE-2017-1000257"
    ],
    "7.55.0-r1": [
      "CVE-2017-1000254"
    ],
    "7.55.0-r0": [
      "CVE-2017-1000099",
      "CVE-2017-1000100",
      "CVE-2017-1000101"
    ],
    "7.52.1-r2": [
      "CVE-2017-7468",
      "CVE-2017-7407",
      "CVE-2017-2629"
    ],
    "7.52.1-r0": [
      "CVE-2016-9594"
    ],
    "7.51.0-r0": [
      "CVE-2016-8615",
      "CVE-2016-8616",
      "CVE-2016-8617",
      "CVE-2016-8618",
      "CVE-2016-8619",
      "CVE-2016-8620",
      "CVE-2016-8621",
      "CVE-2016-8622",
      "CVE-2016-8623",
      "CVE-2016-8624",
      "CVE-2016-8625"
    ],
    "7.50.3-r0": [
      "CVE-2016-7167"
    ],
    "7.50.2-r0": [
      "CVE-2016-7141"
    ],
    "7.50.1-r0": [
      "CVE-2016-5419",
      "CVE-2016-5420",
      "CVE-2016-5421"
    ],
    "7.36.0-r0": [
      "CVE-2014-0138",
      "CVE-2014-0139"
    ]
  },
  "apkurl": "{{urlprefix}}/{{distroversion}}/{{reponame}}/{{arch}}/{{pkg.name}}-{{pkg.ver}}.apk",
  "archs": [
    "aarch64",
    "armhf",
    "armv7",
    "mips64",
    "mips64el",
    "ppc64le",
    "s390x",
    "x86",
    "x86_64"
  ],
  "urlprefix": "https://dl-cdn.alpinelinux.org/alpine",
  "reponame": "main",
  "distroversion": "v3.4"
}