{
  "name": "phpmyadmin",
  "secfixes": {
    "4.4.15.8-r0": [
      "CVE-2016-6606",
      "CVE-2016-6607",
      "CVE-2016-6608",
      "CVE-2016-6609",
      "CVE-2016-6610",
      "CVE-2016-6611",
      "CVE-2016-6612",
      "CVE-2016-6613",
      "CVE-2016-6614",
      "CVE-2016-6615",
      "CVE-2016-6616",
      "CVE-2016-6617",
      "CVE-2016-6618",
      "CVE-2016-6619",
      "CVE-2016-6620",
      "CVE-2016-6622",
      "CVE-2016-6623",
      "CVE-2016-6624",
      "CVE-2016-6625",
      "CVE-2016-6626",
      "CVE-2016-6627",
      "CVE-2016-6628",
      "CVE-2016-6629",
      "CVE-2016-6630",
      "CVE-2016-6631",
      "CVE-2016-6632",
      "CVE-2016-6633"
    ],
    "4.4.15.9-r0": [
      "CVE-2016-9847",
      "CVE-2016-9848",
      "CVE-2016-9849",
      "CVE-2016-9850",
      "CVE-2016-9851",
      "CVE-2016-9852",
      "CVE-2016-9853",
      "CVE-2016-9854",
      "CVE-2016-9855",
      "CVE-2016-9856",
      "CVE-2016-9857",
      "CVE-2016-9858",
      "CVE-2016-9859",
      "CVE-2016-9860",
      "CVE-2016-9861",
      "CVE-2016-9864",
      "CVE-2016-9865",
      "CVE-2016-9866"
    ]
  },
  "apkurl": "{{urlprefix}}/{{distroversion}}/{{reponame}}/{{arch}}/{{pkg.name}}-{{pkg.ver}}.apk",
  "archs": [

  ],
  "urlprefix": "https://dl-cdn.alpinelinux.org/alpine",
  "reponame": "main",
  "distroversion": "v3.2"
}