{
  "name": "gradle",
  "secfixes": {
    "7.2-r0": [
      "CVE-2021-32751"
    ],
    "6.8.3-r0": [
      "CVE-2020-11979"
    ]
  },
  "apkurl": "{{urlprefix}}/{{distroversion}}/{{reponame}}/{{arch}}/{{pkg.name}}-{{pkg.ver}}.apk",
  "archs": [

  ],
  "urlprefix": "https://dl-cdn.alpinelinux.org/alpine",
  "reponame": "community",
  "distroversion": "v3.16"
}