{
  "name": "qt5-qtbase",
  "secfixes": {
    "5.15.9_git20230505-r0": [
      "CVE-2023-32762",
      "CVE-2023-32763"
    ],
    "5.15.0-r2": [
      "CVE-2020-17507"
    ]
  },
  "apkurl": "{{urlprefix}}/{{distroversion}}/{{reponame}}/{{arch}}/{{pkg.name}}-{{pkg.ver}}.apk",
  "archs": [
    "aarch64",
    "armhf",
    "armv7",
    "mips64",
    "mips64el",
    "ppc64le",
    "s390x",
    "x86",
    "x86_64"
  ],
  "urlprefix": "https://dl-cdn.alpinelinux.org/alpine",
  "reponame": "community",
  "distroversion": "vedge"
}