{
  "name": "libvirt",
  "secfixes": {
    "5.5.0-r2": [
      "CVE-2019-20485"
    ],
    "5.5.0-r1": [
      "CVE-2020-12430"
    ],
    "5.5.0-r0": [
      "CVE-2019-10161",
      "CVE-2019-10166",
      "CVE-2019-10167",
      "CVE-2019-10168"
    ]
  },
  "apkurl": "{{urlprefix}}/{{distroversion}}/{{reponame}}/{{arch}}/{{pkg.name}}-{{pkg.ver}}.apk",
  "archs": [
    "aarch64",
    "armhf",
    "armv7",
    "mips64",
    "mips64el",
    "ppc64le",
    "s390x",
    "x86",
    "x86_64"
  ],
  "urlprefix": "https://dl-cdn.alpinelinux.org/alpine",
  "reponame": "main",
  "distroversion": "v3.9"
}