{
  "name": "privoxy",
  "secfixes": {
    "3.0.33-r0": [
      "CVE-2021-44540",
      "CVE-2021-44541",
      "CVE-2021-44542",
      "CVE-2021-44543"
    ],
    "3.0.32-r0": [
      "CVE-2021-20272",
      "CVE-2021-20273",
      "CVE-2021-20274",
      "CVE-2021-20275",
      "CVE-2021-20276"
    ],
    "3.0.31-r0": [
      "CVE-2021-20216",
      "CVE-2021-20217"
    ],
    "3.0.29-r0": [
      "CVE-2021-20210",
      "CVE-2021-20211",
      "CVE-2021-20212",
      "CVE-2021-20213",
      "CVE-2021-20214",
      "CVE-2021-20215"
    ]
  },
  "apkurl": "{{urlprefix}}/{{distroversion}}/{{reponame}}/{{arch}}/{{pkg.name}}-{{pkg.ver}}.apk",
  "archs": [
    "aarch64",
    "armhf",
    "armv7",
    "mips64",
    "mips64el",
    "ppc64le",
    "s390x",
    "x86",
    "x86_64"
  ],
  "urlprefix": "https://dl-cdn.alpinelinux.org/alpine",
  "reponame": "main",
  "distroversion": "v3.15"
}