{
  "name": "zoneminder",
  "secfixes": {
    "1.30.2-r0": [
      "CVE-2016-10140",
      "CVE-2017-5595"
    ],
    "1.30.2-r3": [
      "CVE-2017-5367",
      "CVE-2017-5368"
    ],
    "1.36.7-r0": [
      "CVE-2019-6777",
      "CVE-2019-6990",
      "CVE-2019-6991",
      "CVE-2019-6992",
      "CVE-2019-7325",
      "CVE-2019-7326",
      "CVE-2019-7327",
      "CVE-2019-7328",
      "CVE-2019-7329",
      "CVE-2019-7330",
      "CVE-2019-7331",
      "CVE-2019-7332",
      "CVE-2019-7333",
      "CVE-2019-7334",
      "CVE-2019-7335",
      "CVE-2019-7336",
      "CVE-2019-7337",
      "CVE-2019-7338",
      "CVE-2019-7339",
      "CVE-2019-7340",
      "CVE-2019-7341",
      "CVE-2019-7342",
      "CVE-2019-7343",
      "CVE-2019-7344",
      "CVE-2019-7345",
      "CVE-2019-7346",
      "CVE-2019-7347",
      "CVE-2019-7348",
      "CVE-2019-7349",
      "CVE-2019-7350",
      "CVE-2019-7351",
      "CVE-2019-7352",
      "CVE-2019-8423",
      "CVE-2019-13072",
      "CVE-2020-25729"
    ],
    "1.36.31-r0": [
      "CVE-2022-39285",
      "CVE-2022-39289",
      "CVE-2022-39290",
      "CVE-2022-39291"
    ],
    "1.36.33-r0": [
      "CVE-2023-26035"
    ]
  },
  "apkurl": "{{urlprefix}}/{{distroversion}}/{{reponame}}/{{arch}}/{{pkg.name}}-{{pkg.ver}}.apk",
  "archs": [
    "aarch64",
    "armv7",
    "mips64",
    "mips64el",
    "ppc64le",
    "x86",
    "x86_64"
  ],
  "urlprefix": "https://dl-cdn.alpinelinux.org/alpine",
  "reponame": "community",
  "distroversion": "v3.20"
}