{
  "name": "linux-lts",
  "secfixes": {
    "5.10.4-r0": [
      "CVE-2020-29568",
      "CVE-2020-29569"
    ],
    "5.15.74-r0": [
      "CVE-2022-41674",
      "CVE-2022-42719",
      "CVE-2022-42720",
      "CVE-2022-42721",
      "CVE-2022-42722"
    ],
    "6.1.27-r3": [
      "CVE-2023-32233"
    ],
    "6.1.74-r0": [
      "CVE-2023-46838"
    ]
  },
  "apkurl": "{{urlprefix}}/{{distroversion}}/{{reponame}}/{{arch}}/{{pkg.name}}-{{pkg.ver}}.apk",
  "archs": [
    "aarch64",
    "armv7",
    "mips64",
    "mips64el",
    "ppc64le",
    "s390x",
    "x86",
    "x86_64"
  ],
  "urlprefix": "https://dl-cdn.alpinelinux.org/alpine",
  "reponame": "main",
  "distroversion": "v3.18"
}