{
  "name": "vim",
  "secfixes": {
    "9.1.0707-r0": [
      "CVE-2024-43790",
      "CVE-2024-43802"
    ],
    "9.1.0678-r0": [
      "CVE-2024-43374"
    ],
    "9.1.0652-r0": [
      "CVE-2024-41957",
      "CVE-2024-41965"
    ],
    "9.0.2127-r0": [
      "CVE-2023-48706"
    ],
    "9.0.2112-r0": [
      "CVE-2023-48231"
    ],
    "9.0.2073-r0": [
      "CVE-2023-5535"
    ],
    "9.0.1994-r0": [
      "CVE-2023-5344"
    ],
    "9.0.1888-r0": [
      "CVE-2023-4733",
      "CVE-2023-4734",
      "CVE-2023-4735",
      "CVE-2023-4736",
      "CVE-2023-4738",
      "CVE-2023-4750",
      "CVE-2023-4752",
      "CVE-2023-4781"
    ],
    "9.0.1413-r0": [
      "CVE-2023-1264"
    ],
    "9.0.1395-r0": [
      "CVE-2023-1127",
      "CVE-2023-1170",
      "CVE-2023-1175",
      "CVE-2023-1355"
    ],
    "9.0.1251-r0": [
      "CVE-2023-0433",
      "CVE-2023-0512"
    ],
    "9.0.1198-r0": [
      "CVE-2023-0288"
    ],
    "9.0.1167-r0": [
      "CVE-2023-0049",
      "CVE-2023-0051",
      "CVE-2023-0054"
    ],
    "9.0.0999-r0": [
      "CVE-2022-4141",
      "CVE-2022-4292",
      "CVE-2022-4293",
      "CVE-2022-47024"
    ],
    "9.0.0815-r0": [
      "CVE-2022-3705"
    ],
    "9.0.0636-r0": [
      "CVE-2022-3352"
    ],
    "9.0.0598-r0": [
      "CVE-2022-3234",
      "CVE-2022-3235",
      "CVE-2022-3256",
      "CVE-2022-3278"
    ],
    "9.0.0437-r0": [
      "CVE-2022-3134"
    ],
    "9.0.0369-r0": [
      "CVE-2022-2980",
      "CVE-2022-2982",
      "CVE-2022-3016",
      "CVE-2022-3037",
      "CVE-2022-3099"
    ],
    "9.0.0270-r0": [
      "CVE-2022-2923",
      "CVE-2022-2946"
    ],
    "9.0.0224-r0": [
      "CVE-2022-2816",
      "CVE-2022-2817",
      "CVE-2022-2819"
    ],
    "9.0.0050-r0": [
      "CVE-2022-2264",
      "CVE-2022-2284",
      "CVE-2022-2285",
      "CVE-2022-2286",
      "CVE-2022-2287",
      "CVE-2022-2288",
      "CVE-2022-2289",
      "CVE-2022-2304"
    ],
    "8.2.5170-r0": [
      "CVE-2022-2124",
      "CVE-2022-2125",
      "CVE-2022-2126",
      "CVE-2022-2129"
    ],
    "8.2.5055-r0": [
      "CVE-2022-1851",
      "CVE-2022-1886",
      "CVE-2022-1898"
    ],
    "8.2.5000-r0": [
      "CVE-2022-1796"
    ],
    "8.2.4969-r0": [
      "CVE-2022-1619",
      "CVE-2022-1620",
      "CVE-2022-1621",
      "CVE-2022-1629"
    ],
    "8.2.4836-r0": [
      "CVE-2022-1381"
    ],
    "8.2.4708-r0": [
      "CVE-2022-1154",
      "CVE-2022-1160"
    ],
    "8.2.4619-r0": [
      "CVE-2022-0943"
    ],
    "8.2.4542-r0": [
      "CVE-2022-0572",
      "CVE-2022-0629",
      "CVE-2022-0685",
      "CVE-2022-0696",
      "CVE-2022-0714",
      "CVE-2022-0729"
    ],
    "8.2.4350-r0": [
      "CVE-2022-0359",
      "CVE-2022-0361",
      "CVE-2022-0368",
      "CVE-2022-0392",
      "CVE-2022-0393",
      "CVE-2022-0407",
      "CVE-2022-0408",
      "CVE-2022-0413",
      "CVE-2022-0417",
      "CVE-2022-0443"
    ],
    "8.2.4173-r0": [
      "CVE-2021-4069",
      "CVE-2021-4136",
      "CVE-2021-4166",
      "CVE-2021-4173",
      "CVE-2021-4187",
      "CVE-2021-4192",
      "CVE-2021-4193",
      "CVE-2021-46059",
      "CVE-2022-0128",
      "CVE-2022-0156",
      "CVE-2022-0158",
      "CVE-2022-0213"
    ],
    "8.2.3779-r0": [
      "CVE-2021-4019"
    ],
    "8.2.3650-r0": [
      "CVE-2021-3927",
      "CVE-2021-3928",
      "CVE-2021-3968",
      "CVE-2021-3973",
      "CVE-2021-3974",
      "CVE-2021-3984"
    ],
    "8.2.3567-r0": [
      "CVE-2021-3903"
    ],
    "8.2.3500-r0": [
      "CVE-2021-3875"
    ],
    "8.2.3437-r0": [
      "CVE-2021-3770",
      "CVE-2021-3778",
      "CVE-2021-3796"
    ],
    "8.1.1365-r0": [
      "CVE-2019-12735"
    ],
    "8.0.1521-r0": [
      "CVE-2017-6350",
      "CVE-2017-6349"
    ],
    "8.0.0329-r0": [
      "CVE-2017-5953"
    ],
    "8.0.0056-r0": [
      "CVE-2016-1248"
    ]
  },
  "apkurl": "{{urlprefix}}/{{distroversion}}/{{reponame}}/{{arch}}/{{pkg.name}}-{{pkg.ver}}.apk",
  "archs": [
    "aarch64",
    "armhf",
    "armv7",
    "mips64",
    "mips64el",
    "ppc64le",
    "s390x",
    "x86",
    "x86_64"
  ],
  "urlprefix": "https://dl-cdn.alpinelinux.org/alpine",
  "reponame": "main",
  "distroversion": "v3.20"
}