{
  "name": "glib",
  "secfixes": {
    "2.80.1-r0": [
      "CVE-2024-34397"
    ],
    "2.66.6-r0": [
      "CVE-2021-27219"
    ],
    "2.62.5-r0": [
      "CVE-2020-6750"
    ],
    "2.60.4-r0": [
      "CVE-2019-12450"
    ]
  },
  "apkurl": "{{urlprefix}}/{{distroversion}}/{{reponame}}/{{arch}}/{{pkg.name}}-{{pkg.ver}}.apk",
  "archs": [
    "aarch64",
    "armhf",
    "armv7",
    "mips64",
    "mips64el",
    "ppc64le",
    "s390x",
    "x86",
    "x86_64"
  ],
  "urlprefix": "https://dl-cdn.alpinelinux.org/alpine",
  "reponame": "main",
  "distroversion": "v3.21"
}