{
  "name": "busybox",
  "secfixes": {
    "1.24.2-r13": [
      "CVE-2017-15873",
      "CVE-2017-16544"
    ],
    "1.24.2-r12": [
      "CVE-2016-6301"
    ],
    "1.24.2-r0": [
      "CVE-2016-2147",
      "CVE-2016-2148"
    ]
  },
  "apkurl": "{{urlprefix}}/{{distroversion}}/{{reponame}}/{{arch}}/{{pkg.name}}-{{pkg.ver}}.apk",
  "archs": [
    "aarch64",
    "armhf",
    "armv7",
    "mips64",
    "mips64el",
    "ppc64le",
    "s390x",
    "x86",
    "x86_64"
  ],
  "urlprefix": "https://dl-cdn.alpinelinux.org/alpine",
  "reponame": "main",
  "distroversion": "v3.4"
}