{
  "name": "perl-image-exiftool",
  "secfixes": {
    "12.40-r0": [
      "CVE-2022-23935"
    ],
    "12.24-r0": [
      "CVE-2021-22204"
    ]
  },
  "apkurl": "{{urlprefix}}/{{distroversion}}/{{reponame}}/{{arch}}/{{pkg.name}}-{{pkg.ver}}.apk",
  "archs": [

  ],
  "urlprefix": "https://dl-cdn.alpinelinux.org/alpine",
  "reponame": "community",
  "distroversion": "vedge"
}