{
  "name": "rdesktop",
  "secfixes": {
    "1.8.6-r0": [
      "CVE-2018-8794",
      "CVE-2018-8795",
      "CVE-2018-8797",
      "CVE-2018-20175",
      "CVE-2018-20176",
      "CVE-2018-8791",
      "CVE-2018-8792",
      "CVE-2018-8793",
      "CVE-2018-8796",
      "CVE-2018-8798",
      "CVE-2018-8799",
      "CVE-2018-8800",
      "CVE-2018-20174",
      "CVE-2018-20177",
      "CVE-2018-20178",
      "CVE-2018-20179",
      "CVE-2018-20180",
      "CVE-2018-20181",
      "CVE-2018-20182"
    ]
  },
  "apkurl": "{{urlprefix}}/{{distroversion}}/{{reponame}}/{{arch}}/{{pkg.name}}-{{pkg.ver}}.apk",
  "archs": [
    "aarch64",
    "armhf",
    "armv7",
    "mips64",
    "mips64el",
    "ppc64le",
    "s390x",
    "x86",
    "x86_64"
  ],
  "urlprefix": "https://dl-cdn.alpinelinux.org/alpine",
  "reponame": "community",
  "distroversion": "vedge"
}