{
  "name": "imagemagick6",
  "secfixes": {
    "6.9.12.65-r0": [
      "CVE-2022-3213"
    ],
    "6.9.12.31-r0": [
      "CVE-2021-39212"
    ],
    "6.9.11.42-r0": [
      "CVE-2020-29599"
    ],
    "6.9.11.35-r0": [
      "CVE-2020-27560"
    ],
    "6.9.11.9-r0": [
      "CVE-2020-19667"
    ],
    "6.9.10.80-r0": [
      "CVE-2019-19952"
    ],
    "6.9.10.55-r0": [
      "CVE-2019-13454"
    ],
    "6.9.10.53-r0": [
      "CVE-2019-13391",
      "CVE-2019-13311",
      "CVE-2019-13310",
      "CVE-2019-13309",
      "CVE-2019-13308",
      "CVE-2019-13307",
      "CVE-2019-13306",
      "CVE-2019-13305",
      "CVE-2019-13304",
      "CVE-2019-13303",
      "CVE-2019-13302",
      "CVE-2019-13301",
      "CVE-2019-13300",
      "CVE-2019-13299",
      "CVE-2019-13298",
      "CVE-2019-13297",
      "CVE-2019-13296",
      "CVE-2019-13295",
      "CVE-2019-13137",
      "CVE-2019-13136",
      "CVE-2019-13135",
      "CVE-2019-13134",
      "CVE-2019-13133"
    ],
    "6.9.10.43-r0": [
      "CVE-2019-19949",
      "CVE-2019-19948",
      "CVE-2019-14981",
      "CVE-2019-14980",
      "CVE-2019-11598",
      "CVE-2019-11597",
      "CVE-2019-11472"
    ],
    "6.9.10.37-r0": [
      "CVE-2019-10649",
      "CVE-2019-10650",
      "CVE-2019-7175",
      "CVE-2019-7395",
      "CVE-2019-7396",
      "CVE-2019-7397",
      "CVE-2019-7398",
      "CVE-2019-9956",
      "CVE-2018-12599",
      "CVE-2018-12600",
      "CVE-2018-13153",
      "CVE-2018-14434",
      "CVE-2018-14435",
      "CVE-2018-14436",
      "CVE-2018-14437",
      "CVE-2018-14551",
      "CVE-2018-15607",
      "CVE-2018-16329",
      "CVE-2018-16412",
      "CVE-2018-16413",
      "CVE-2018-16640",
      "CVE-2018-16642",
      "CVE-2018-16643",
      "CVE-2018-16644",
      "CVE-2018-16645",
      "CVE-2018-16749",
      "CVE-2018-16750",
      "CVE-2018-17965",
      "CVE-2018-17966",
      "CVE-2018-17967",
      "CVE-2018-18016",
      "CVE-2018-18024",
      "CVE-2018-18025",
      "CVE-2018-18544",
      "CVE-2018-20467",
      "CVE-2018-5246",
      "CVE-2018-5247",
      "CVE-2018-5357",
      "CVE-2018-5358",
      "CVE-2018-6405",
      "CVE-2018-7443",
      "CVE-2018-7470",
      "CVE-2018-8804",
      "CVE-2018-8960",
      "CVE-2018-9133",
      "CVE-2018-9135"
    ]
  },
  "apkurl": "{{urlprefix}}/{{distroversion}}/{{reponame}}/{{arch}}/{{pkg.name}}-{{pkg.ver}}.apk",
  "archs": [
    "aarch64",
    "armhf",
    "armv7",
    "mips64",
    "mips64el",
    "ppc64le",
    "s390x",
    "x86",
    "x86_64"
  ],
  "urlprefix": "https://dl-cdn.alpinelinux.org/alpine",
  "reponame": "community",
  "distroversion": "v3.15"
}