{
  "name": "zoneminder",
  "secfixes": {
    "1.30.2-r0": [
      "CVE-2016-10140",
      "CVE-2017-5595"
    ],
    "1.30.2-r3": [
      "CVE-2017-5367",
      "CVE-2017-5368"
    ]
  },
  "apkurl": "{{urlprefix}}/{{distroversion}}/{{reponame}}/{{arch}}/{{pkg.name}}-{{pkg.ver}}.apk",
  "archs": [
    "aarch64",
    "armv7",
    "mips64el",
    "ppc64le",
    "x86",
    "x86_64"
  ],
  "urlprefix": "https://dl-cdn.alpinelinux.org/alpine",
  "reponame": "community",
  "distroversion": "v3.13"
}