{
  "name": "rt4",
  "secfixes": {
    "4.4.7-r0": [
      "CVE-2021-38562",
      "CVE-2022-25802",
      "CVE-2023-41259",
      "CVE-2023-41260"
    ]
  },
  "apkurl": "{{urlprefix}}/{{distroversion}}/{{reponame}}/{{arch}}/{{pkg.name}}-{{pkg.ver}}.apk",
  "archs": [

  ],
  "urlprefix": "https://dl-cdn.alpinelinux.org/alpine",
  "reponame": "community",
  "distroversion": "v3.20"
}