{
  "name": "tcpreplay",
  "secfixes": {
    "4.4.1-r0": [
      "CVE-2021-45386",
      "CVE-2021-45387"
    ],
    "4.3.2-r0": [
      "CVE-2019-8381",
      "CVE-2019-8376",
      "CVE-2019-8377"
    ],
    "4.3.4-r0": [
      "CVE-2020-24265",
      "CVE-2020-24266"
    ]
  },
  "apkurl": "{{urlprefix}}/{{distroversion}}/{{reponame}}/{{arch}}/{{pkg.name}}-{{pkg.ver}}.apk",
  "archs": [
    "aarch64",
    "armhf",
    "armv7",
    "mips64",
    "mips64el",
    "ppc64le",
    "s390x",
    "x86",
    "x86_64"
  ],
  "urlprefix": "https://dl-cdn.alpinelinux.org/alpine",
  "reponame": "community",
  "distroversion": "v3.21"
}