{
  "name": "php-phpmailer",
  "secfixes": {
    "5.2.4-r0": [
      "CVE-2016-10033",
      "CVE-2016-10045"
    ]
  },
  "apkurl": "{{urlprefix}}/{{distroversion}}/{{reponame}}/{{arch}}/{{pkg.name}}-{{pkg.ver}}.apk",
  "archs": [

  ],
  "urlprefix": "https://dl-cdn.alpinelinux.org/alpine",
  "reponame": "main",
  "distroversion": "v3.2"
}