{
  "name": "dnsmasq",
  "secfixes": {
    "2.76-r3": [
      "CVE-2017-15107"
    ],
    "2.76-r2": [
      "CVE-2017-14491",
      "CVE-2017-14492",
      "CVE-2017-14493",
      "CVE-2017-14494",
      "CVE-2017-14495",
      "CVE-2017-14496"
    ],
    "": [

    ]
  },
  "apkurl": "{{urlprefix}}/{{distroversion}}/{{reponame}}/{{arch}}/{{pkg.name}}-{{pkg.ver}}.apk",
  "archs": [
    "aarch64",
    "armhf",
    "armv7",
    "mips64",
    "mips64el",
    "ppc64le",
    "s390x",
    "x86",
    "x86_64"
  ],
  "urlprefix": "https://dl-cdn.alpinelinux.org/alpine",
  "reponame": "main",
  "distroversion": "v3.5"
}