{
  "name": "isync",
  "secfixes": {
    "1.4.4-r0": [
      "CVE-2021-3657",
      "CVE-2021-44143"
    ],
    "1.4.2-r0": [
      "CVE-2021-3578"
    ],
    "1.4.1-r0": [
      "CVE-2021-20247"
    ]
  },
  "apkurl": "{{urlprefix}}/{{distroversion}}/{{reponame}}/{{arch}}/{{pkg.name}}-{{pkg.ver}}.apk",
  "archs": [
    "aarch64",
    "armhf",
    "armv7",
    "mips64",
    "mips64el",
    "ppc64le",
    "s390x",
    "x86",
    "x86_64"
  ],
  "urlprefix": "https://dl-cdn.alpinelinux.org/alpine",
  "reponame": "community",
  "distroversion": "v3.20"
}