{
  "name": "qpdf",
  "secfixes": {
    "7.0.0-r0": [
      "CVE-2017-9208",
      "CVE-2017-9209",
      "CVE-2017-9210",
      "CVE-2017-11624",
      "CVE-2017-11625",
      "CVE-2017-11626",
      "CVE-2017-11627",
      "CVE-2017-12595"
    ]
  },
  "apkurl": "{{urlprefix}}/{{distroversion}}/{{reponame}}/{{arch}}/{{pkg.name}}-{{pkg.ver}}.apk",
  "archs": [
    "aarch64",
    "armhf",
    "armv7",
    "mips64",
    "mips64el",
    "ppc64le",
    "s390x",
    "x86",
    "x86_64"
  ],
  "urlprefix": "https://dl-cdn.alpinelinux.org/alpine",
  "reponame": "main",
  "distroversion": "v3.9"
}