{
  "name": "imagemagick",
  "secfixes": {
    "7.1.1.13-r1": [
      "CVE-2023-5341"
    ],
    "7.1.0.52-r0": [
      "CVE-2022-44267",
      "CVE-2022-44268"
    ],
    "7.1.0.47-r0": [
      "CVE-2022-3213"
    ],
    "7.1.0.30-r0": [
      "CVE-2022-1115",
      "CVE-2022-1114",
      "CVE-2022-2719"
    ],
    "7.1.0.24-r0": [
      "CVE-2022-0284"
    ],
    "7.1.0.10-r0": [
      "CVE-2021-39212"
    ],
    "7.1.0.0-r0": [
      "CVE-2021-34183"
    ],
    "7.0.11.9-r0": [
      "CVE-2021-3574"
    ],
    "7.0.11.1-r0": [
      "CVE-2021-20241",
      "CVE-2021-20243",
      "CVE-2021-20244",
      "CVE-2021-20245",
      "CVE-2021-20246",
      "CVE-2021-20309",
      "CVE-2021-20310",
      "CVE-2021-20311",
      "CVE-2021-20312",
      "CVE-2021-20313"
    ],
    "7.0.10.57-r0": [
      "CVE-2021-20176",
      "CVE-2021-20224"
    ],
    "7.0.10.42-r0": [
      "CVE-2020-29599"
    ],
    "7.0.10.35-r0": [
      "CVE-2020-27560"
    ],
    "7.0.10.31-r0": [
      "CVE-2021-3596",
      "CVE-2022-28463",
      "CVE-2022-32545",
      "CVE-2022-32546",
      "CVE-2022-32547"
    ],
    "7.0.10.18-r0": [
      "CVE-2020-13902"
    ],
    "7.0.10.8-r0": [
      "CVE-2020-19667"
    ],
    "7.0.10.0-r0": [
      "CVE-2020-10251"
    ],
    "7.0.9.7-r0": [
      "CVE-2019-19952"
    ],
    "7.0.8.62-r0": [
      "CVE-2019-17547"
    ],
    "7.0.8.56-r0": [
      "CVE-2019-17541",
      "CVE-2019-17540",
      "CVE-2019-14981",
      "CVE-2019-13454"
    ],
    "7.0.8.53-r0": [
      "CVE-2019-13391",
      "CVE-2019-13311",
      "CVE-2019-13310",
      "CVE-2019-13309",
      "CVE-2019-13308",
      "CVE-2019-13307",
      "CVE-2019-13306",
      "CVE-2019-13305",
      "CVE-2019-13304",
      "CVE-2019-13303",
      "CVE-2019-13302",
      "CVE-2019-13301",
      "CVE-2019-13300",
      "CVE-2019-13299",
      "CVE-2019-13298",
      "CVE-2019-13297",
      "CVE-2019-13296",
      "CVE-2019-13295",
      "CVE-2019-13137",
      "CVE-2019-13136",
      "CVE-2019-13135",
      "CVE-2019-13134",
      "CVE-2019-13133"
    ],
    "7.0.8.44-r0": [
      "CVE-2019-19949",
      "CVE-2019-19948",
      "CVE-2019-16713",
      "CVE-2019-16712",
      "CVE-2019-16711",
      "CVE-2019-15141",
      "CVE-2019-15140",
      "CVE-2019-15139",
      "CVE-2019-14980",
      "CVE-2019-11598",
      "CVE-2019-11597",
      "CVE-2019-11472"
    ],
    "7.0.8.38-r0": [
      "CVE-2019-9956",
      "CVE-2019-16710",
      "CVE-2019-16709",
      "CVE-2019-16708",
      "CVE-2019-10650",
      "CVE-2019-10649"
    ]
  },
  "apkurl": "{{urlprefix}}/{{distroversion}}/{{reponame}}/{{arch}}/{{pkg.name}}-{{pkg.ver}}.apk",
  "archs": [
    "aarch64",
    "armhf",
    "armv7",
    "mips64",
    "mips64el",
    "ppc64le",
    "s390x",
    "x86",
    "x86_64"
  ],
  "urlprefix": "https://dl-cdn.alpinelinux.org/alpine",
  "reponame": "community",
  "distroversion": "v3.18"
}