{
  "name": "ruby-nokogiri",
  "secfixes": {
    "1.13.10-r0": [
      "CVE-2022-23476"
    ],
    "1.13.6-r0": [
      "CVE-2022-29181"
    ],
    "1.13.4-r0": [
      "CVE-2022-24836"
    ],
    "1.11.6-r0": [
      "CVE-2020-26247"
    ],
    "1.10.4-r0": [
      "CVE-2019-5477"
    ]
  },
  "apkurl": "{{urlprefix}}/{{distroversion}}/{{reponame}}/{{arch}}/{{pkg.name}}-{{pkg.ver}}.apk",
  "archs": [
    "aarch64",
    "armhf",
    "armv7",
    "mips64",
    "mips64el",
    "ppc64le",
    "s390x",
    "x86",
    "x86_64"
  ],
  "urlprefix": "https://dl-cdn.alpinelinux.org/alpine",
  "reponame": "community",
  "distroversion": "v3.19"
}