{
  "name": "asterisk",
  "secfixes": {
    "16.16.1-r1": [
      "CVE-2021-32558"
    ],
    "16.16.1-r0": [
      "CVE-2020-35776",
      "CVE-2021-26712",
      "CVE-2021-26713",
      "CVE-2021-26717",
      "CVE-2021-26906"
    ],
    "16.15.1-r0": [
      "CVE-2020-35652"
    ],
    "16.14.1-r0": [
      "CVE-2020-28327"
    ],
    "16.6.2-r0": [
      "CVE-2019-18610",
      "CVE-2019-18790"
    ],
    "16.5.1-r0": [
      "CVE-2019-15297",
      "CVE-2019-15639"
    ],
    "16.4.1-r0": [
      "CVE-2019-12827"
    ],
    "16.3.0-r0": [
      "CVE-2019-7251"
    ],
    "15.7.1-r0": [
      "CVE-2018-19278"
    ]
  },
  "apkurl": "{{urlprefix}}/{{distroversion}}/{{reponame}}/{{arch}}/{{pkg.name}}-{{pkg.ver}}.apk",
  "archs": [
    "aarch64",
    "armhf",
    "armv7",
    "mips64",
    "mips64el",
    "ppc64le",
    "s390x",
    "x86",
    "x86_64"
  ],
  "urlprefix": "https://dl-cdn.alpinelinux.org/alpine",
  "reponame": "main",
  "distroversion": "v3.12"
}