{
  "name": "spamassassin",
  "secfixes": {
    "3.4.5-r0": [
      "CVE-2020-1946"
    ],
    "3.4.4-r0": [
      "CVE-2020-1930",
      "CVE-2020-1931"
    ],
    "3.4.3-r0": [
      "CVE-2018-11805",
      "CVE-2019-12420"
    ],
    "3.4.2-r0": [
      "CVE-2016-1238",
      "CVE-2017-15705",
      "CVE-2018-11780",
      "CVE-2018-11781"
    ]
  },
  "apkurl": "{{urlprefix}}/{{distroversion}}/{{reponame}}/{{arch}}/{{pkg.name}}-{{pkg.ver}}.apk",
  "archs": [
    "aarch64",
    "armhf",
    "armv7",
    "mips64",
    "mips64el",
    "ppc64le",
    "s390x",
    "x86",
    "x86_64"
  ],
  "urlprefix": "https://dl-cdn.alpinelinux.org/alpine",
  "reponame": "main",
  "distroversion": "v3.12"
}