{
  "name": "libxml2",
  "secfixes": {
    "2.13.6-r0": [
      "CVE-2025-24928",
      "CVE-2024-56171"
    ],
    "2.12.7-r0": [
      "CVE-2024-34459"
    ],
    "2.12.5-r0": [
      "CVE-2024-25062"
    ],
    "2.10.4-r0": [
      "CVE-2023-28484",
      "CVE-2023-29469"
    ],
    "2.10.3-r0": [
      "CVE-2022-40303",
      "CVE-2022-40304"
    ],
    "2.10.0-r0": [
      "CVE-2022-2309"
    ],
    "2.9.14-r0": [
      "CVE-2022-29824"
    ],
    "2.9.13-r0": [
      "CVE-2022-23308"
    ],
    "2.9.11-r0": [
      "CVE-2016-3709",
      "CVE-2021-3517",
      "CVE-2021-3518",
      "CVE-2021-3537",
      "CVE-2021-3541"
    ],
    "2.9.10-r5": [
      "CVE-2020-24977"
    ],
    "2.9.10-r4": [
      "CVE-2019-20388"
    ],
    "2.9.8-r3": [
      "CVE-2020-7595"
    ],
    "2.9.8-r1": [
      "CVE-2018-9251",
      "CVE-2018-14404",
      "CVE-2018-14567"
    ],
    "2.9.4-r4": [
      "CVE-2017-5969"
    ],
    "2.9.4-r2": [
      "CVE-2016-9318"
    ],
    "2.9.4-r1": [
      "CVE-2016-5131"
    ]
  },
  "apkurl": "{{urlprefix}}/{{distroversion}}/{{reponame}}/{{arch}}/{{pkg.name}}-{{pkg.ver}}.apk",
  "archs": [
    "aarch64",
    "armhf",
    "armv7",
    "mips64",
    "mips64el",
    "ppc64le",
    "s390x",
    "x86",
    "x86_64"
  ],
  "urlprefix": "https://dl-cdn.alpinelinux.org/alpine",
  "reponame": "main",
  "distroversion": "vedge"
}