{
  "name": "radare2",
  "secfixes": {
    "4.5.0-r0": [
      "CVE-2020-15121"
    ],
    "3.9.0-r0": [
      "CVE-2019-14745",
      "CVE-2019-12865",
      "CVE-2019-12829",
      "CVE-2019-12802",
      "CVE-2019-12790"
    ]
  },
  "apkurl": "{{urlprefix}}/{{distroversion}}/{{reponame}}/{{arch}}/{{pkg.name}}-{{pkg.ver}}.apk",
  "archs": [
    "aarch64",
    "armhf",
    "armv7",
    "mips64",
    "mips64el",
    "ppc64le",
    "s390x",
    "x86",
    "x86_64"
  ],
  "urlprefix": "https://dl-cdn.alpinelinux.org/alpine",
  "reponame": "community",
  "distroversion": "v3.13"
}