{
  "version": "2.3",
  "vulnerabilities": [
    {
      "category": "dependency_scanning",
      "message": "ruby-ffi DDL loading issue on Windows OS",
      "cve": "Gemfile.lock:ffi:cve:CVE-2018-1000201",
      "severity": "High",
      "solution": "upgrade to \u003e= 1.9.24",
      "scanner": {
        "id": "bundler_audit",
        "name": "bundler-audit"
      },
      "location": {
        "file": "Gemfile.lock",
        "dependency": {
          "package": {
            "name": "ffi"
          },
          "version": "1.9.21"
        }
      },
      "identifiers": [
        {
          "type": "cve",
          "name": "CVE-2018-1000201",
          "value": "CVE-2018-1000201",
          "url": "https://cve.mitre.org/cgi-bin/cvename.cgi?name=CVE-2018-1000201"
        }
      ],
      "links": [
        {
          "url": "https://github.com/ffi/ffi/releases/tag/1.9.24"
        }
      ]
    },
    {
      "category": "dependency_scanning",
      "message": "Nokogiri Command Injection Vulnerability via Nokogiri::CSS::Tokenizer#load_file",
      "cve": "Gemfile.lock:nokogiri:cve:CVE-2019-5477",
      "severity": "High",
      "solution": "upgrade to \u003e= 1.10.4",
      "scanner": {
        "id": "bundler_audit",
        "name": "bundler-audit"
      },
      "location": {
        "file": "Gemfile.lock",
        "dependency": {
          "package": {
            "name": "nokogiri"
          },
          "version": "1.8.2"
        }
      },
      "identifiers": [
        {
          "type": "cve",
          "name": "CVE-2019-5477",
          "value": "CVE-2019-5477",
          "url": "https://cve.mitre.org/cgi-bin/cvename.cgi?name=CVE-2019-5477"
        }
      ],
      "links": [
        {
          "url": "https://github.com/sparklemotion/nokogiri/issues/1915"
        }
      ]
    },
    {
      "category": "dependency_scanning",
      "message": "Keepalive thread overload/DoS in puma",
      "cve": "Gemfile.lock:puma:cve:CVE-2019-16770",
      "severity": "High",
      "solution": "upgrade to ~\u003e 3.12.2, \u003e= 4.3.1",
      "scanner": {
        "id": "bundler_audit",
        "name": "bundler-audit"
      },
      "location": {
        "file": "Gemfile.lock",
        "dependency": {
          "package": {
            "name": "puma"
          },
          "version": "3.11.2"
        }
      },
      "identifiers": [
        {
          "type": "cve",
          "name": "CVE-2019-16770",
          "value": "CVE-2019-16770",
          "url": "https://cve.mitre.org/cgi-bin/cvename.cgi?name=CVE-2019-16770"
        }
      ],
      "links": [
        {
          "url": "https://github.com/puma/puma/security/advisories/GHSA-7xx3-m584-x994"
        }
      ]
    },
    {
      "category": "dependency_scanning",
      "message": "OS Command Injection in Rake",
      "cve": "Gemfile.lock:rake:cve:CVE-2020-8130",
      "severity": "High",
      "solution": "upgrade to \u003e= 12.3.3",
      "scanner": {
        "id": "bundler_audit",
        "name": "bundler-audit"
      },
      "location": {
        "file": "Gemfile.lock",
        "dependency": {
          "package": {
            "name": "rake"
          },
          "version": "12.3.0"
        }
      },
      "identifiers": [
        {
          "type": "cve",
          "name": "CVE-2020-8130",
          "value": "CVE-2020-8130",
          "url": "https://cve.mitre.org/cgi-bin/cvename.cgi?name=CVE-2020-8130"
        }
      ],
      "links": [
        {
          "url": "https://github.com/advisories/GHSA-jppv-gw3r-w3q8"
        }
      ]
    },
    {
      "category": "dependency_scanning",
      "message": "libxml2 2.9.10 has an infinite loop in a certain end-of-file situation",
      "cve": "Gemfile.lock:nokogiri:cve:CVE-2020-7595",
      "severity": "Medium",
      "solution": "upgrade to \u003e= 1.10.8",
      "scanner": {
        "id": "bundler_audit",
        "name": "bundler-audit"
      },
      "location": {
        "file": "Gemfile.lock",
        "dependency": {
          "package": {
            "name": "nokogiri"
          },
          "version": "1.8.2"
        }
      },
      "identifiers": [
        {
          "type": "cve",
          "name": "CVE-2020-7595",
          "value": "CVE-2020-7595",
          "url": "https://cve.mitre.org/cgi-bin/cvename.cgi?name=CVE-2020-7595"
        }
      ],
      "links": [
        {
          "url": "https://github.com/sparklemotion/nokogiri/issues/1992"
        }
      ]
    },
    {
      "category": "dependency_scanning",
      "message": "Possible XSS Vulnerability in Action View",
      "cve": "Gemfile.lock:actionview:cve:CVE-2016-6316",
      "severity": "Unknown",
      "solution": "upgrade to ~\u003e 4.2.7.1, ~\u003e 4.2.8, \u003e= 5.0.0.1",
      "scanner": {
        "id": "bundler_audit",
        "name": "bundler-audit"
      },
      "location": {
        "file": "Gemfile.lock",
        "dependency": {
          "package": {
            "name": "actionview"
          },
          "version": "5.0.0"
        }
      },
      "identifiers": [
        {
          "type": "cve",
          "name": "CVE-2016-6316",
          "value": "CVE-2016-6316",
          "url": "https://cve.mitre.org/cgi-bin/cvename.cgi?name=CVE-2016-6316"
        }
      ],
      "links": [
        {
          "url": "https://groups.google.com/forum/#!topic/rubyonrails-security/I-VWr034ouk"
        }
      ]
    },
    {
      "category": "dependency_scanning",
      "message": "File Content Disclosure in Action View",
      "cve": "Gemfile.lock:actionview:cve:CVE-2019-5418",
      "severity": "Unknown",
      "solution": "upgrade to ~\u003e 4.2.11, \u003e= 4.2.11.1, ~\u003e 5.0.7, \u003e= 5.0.7.2, ~\u003e 5.1.6, \u003e= 5.1.6.2, ~\u003e 5.2.2, \u003e= 5.2.2.1, \u003e= 6.0.0.beta3",
      "scanner": {
        "id": "bundler_audit",
        "name": "bundler-audit"
      },
      "location": {
        "file": "Gemfile.lock",
        "dependency": {
          "package": {
            "name": "actionview"
          },
          "version": "5.0.0"
        }
      },
      "identifiers": [
        {
          "type": "cve",
          "name": "CVE-2019-5418",
          "value": "CVE-2019-5418",
          "url": "https://cve.mitre.org/cgi-bin/cvename.cgi?name=CVE-2019-5418"
        }
      ],
      "links": [
        {
          "url": "https://groups.google.com/forum/#!topic/rubyonrails-security/pFRKI96Sm8Q"
        }
      ]
    },
    {
      "category": "dependency_scanning",
      "message": "Denial of Service Vulnerability in Action View",
      "cve": "Gemfile.lock:actionview:cve:CVE-2019-5419",
      "severity": "Unknown",
      "solution": "upgrade to \u003e= 6.0.0.beta3, ~\u003e 5.2.2, \u003e= 5.2.2.1, ~\u003e 5.1.6, \u003e= 5.1.6.2, ~\u003e 5.0.7, \u003e= 5.0.7.2, ~\u003e 4.2.11, \u003e= 4.2.11.1",
      "scanner": {
        "id": "bundler_audit",
        "name": "bundler-audit"
      },
      "location": {
        "file": "Gemfile.lock",
        "dependency": {
          "package": {
            "name": "actionview"
          },
          "version": "5.0.0"
        }
      },
      "identifiers": [
        {
          "type": "cve",
          "name": "CVE-2019-5419",
          "value": "CVE-2019-5419",
          "url": "https://cve.mitre.org/cgi-bin/cvename.cgi?name=CVE-2019-5419"
        }
      ],
      "links": [
        {
          "url": "https://groups.google.com/forum/#!topic/rubyonrails-security/GN7w9fFAQeI"
        }
      ]
    },
    {
      "category": "dependency_scanning",
      "message": "Possible XSS vulnerability in ActionView",
      "cve": "Gemfile.lock:actionview:cve:CVE-2020-5267",
      "severity": "Unknown",
      "solution": "upgrade to ~\u003e 5.2.4, \u003e= 5.2.4.2, \u003e= 6.0.2.2",
      "scanner": {
        "id": "bundler_audit",
        "name": "bundler-audit"
      },
      "location": {
        "file": "Gemfile.lock",
        "dependency": {
          "package": {
            "name": "actionview"
          },
          "version": "5.0.0"
        }
      },
      "identifiers": [
        {
          "type": "cve",
          "name": "CVE-2020-5267",
          "value": "CVE-2020-5267",
          "url": "https://cve.mitre.org/cgi-bin/cvename.cgi?name=CVE-2020-5267"
        }
      ],
      "links": [
        {
          "url": "https://groups.google.com/forum/#!topic/rubyonrails-security/55reWMM_Pg8"
        }
      ]
    },
    {
      "category": "dependency_scanning",
      "message": "Broken Access Control vulnerability in Active Job",
      "cve": "Gemfile.lock:activejob:cve:CVE-2018-16476",
      "severity": "Unknown",
      "solution": "upgrade to ~\u003e 4.2.11, ~\u003e 5.0.7.1, ~\u003e 5.1.6.1, ~\u003e 5.1.7, \u003e= 5.2.1.1",
      "scanner": {
        "id": "bundler_audit",
        "name": "bundler-audit"
      },
      "location": {
        "file": "Gemfile.lock",
        "dependency": {
          "package": {
            "name": "activejob"
          },
          "version": "5.0.0"
        }
      },
      "identifiers": [
        {
          "type": "cve",
          "name": "CVE-2018-16476",
          "value": "CVE-2018-16476",
          "url": "https://cve.mitre.org/cgi-bin/cvename.cgi?name=CVE-2018-16476"
        }
      ],
      "links": [
        {
          "url": "https://groups.google.com/forum/#!topic/rubyonrails-security/FL4dSdzr2zw"
        }
      ]
    },
    {
      "category": "dependency_scanning",
      "message": "Loofah XSS Vulnerability",
      "cve": "Gemfile.lock:loofah:cve:CVE-2018-16468",
      "severity": "Unknown",
      "solution": "upgrade to \u003e= 2.2.3",
      "scanner": {
        "id": "bundler_audit",
        "name": "bundler-audit"
      },
      "location": {
        "file": "Gemfile.lock",
        "dependency": {
          "package": {
            "name": "loofah"
          },
          "version": "2.2.0"
        }
      },
      "identifiers": [
        {
          "type": "cve",
          "name": "CVE-2018-16468",
          "value": "CVE-2018-16468",
          "url": "https://cve.mitre.org/cgi-bin/cvename.cgi?name=CVE-2018-16468"
        }
      ],
      "links": [
        {
          "url": "https://github.com/flavorjones/loofah/issues/154"
        }
      ]
    },
    {
      "category": "dependency_scanning",
      "message": "Loofah XSS Vulnerability",
      "cve": "Gemfile.lock:loofah:cve:CVE-2018-8048",
      "severity": "Unknown",
      "solution": "upgrade to \u003e= 2.2.1",
      "scanner": {
        "id": "bundler_audit",
        "name": "bundler-audit"
      },
      "location": {
        "file": "Gemfile.lock",
        "dependency": {
          "package": {
            "name": "loofah"
          },
          "version": "2.2.0"
        }
      },
      "identifiers": [
        {
          "type": "cve",
          "name": "CVE-2018-8048",
          "value": "CVE-2018-8048",
          "url": "https://cve.mitre.org/cgi-bin/cvename.cgi?name=CVE-2018-8048"
        }
      ],
      "links": [
        {
          "url": "https://github.com/flavorjones/loofah/issues/144"
        }
      ]
    },
    {
      "category": "dependency_scanning",
      "message": "Loofah XSS Vulnerability",
      "cve": "Gemfile.lock:loofah:cve:CVE-2019-15587",
      "severity": "Unknown",
      "solution": "upgrade to \u003e= 2.3.1",
      "scanner": {
        "id": "bundler_audit",
        "name": "bundler-audit"
      },
      "location": {
        "file": "Gemfile.lock",
        "dependency": {
          "package": {
            "name": "loofah"
          },
          "version": "2.2.0"
        }
      },
      "identifiers": [
        {
          "type": "cve",
          "name": "CVE-2019-15587",
          "value": "CVE-2019-15587",
          "url": "https://cve.mitre.org/cgi-bin/cvename.cgi?name=CVE-2019-15587"
        }
      ],
      "links": [
        {
          "url": "https://github.com/flavorjones/loofah/issues/171"
        }
      ]
    },
    {
      "category": "dependency_scanning",
      "message": "Nokogiri gem, via libxml2, is affected by multiple vulnerabilities",
      "cve": "Gemfile.lock:nokogiri:cve:CVE-2018-14404",
      "severity": "Unknown",
      "solution": "upgrade to \u003e= 1.8.5",
      "scanner": {
        "id": "bundler_audit",
        "name": "bundler-audit"
      },
      "location": {
        "file": "Gemfile.lock",
        "dependency": {
          "package": {
            "name": "nokogiri"
          },
          "version": "1.8.2"
        }
      },
      "identifiers": [
        {
          "type": "cve",
          "name": "CVE-2018-14404",
          "value": "CVE-2018-14404",
          "url": "https://cve.mitre.org/cgi-bin/cvename.cgi?name=CVE-2018-14404"
        }
      ],
      "links": [
        {
          "url": "https://github.com/sparklemotion/nokogiri/issues/1785"
        }
      ]
    },
    {
      "category": "dependency_scanning",
      "message": "Revert libxml2 behavior in Nokogiri gem that could cause XSS",
      "cve": "Gemfile.lock:nokogiri:cve:CVE-2018-8048",
      "severity": "Unknown",
      "solution": "upgrade to \u003e= 1.8.3",
      "scanner": {
        "id": "bundler_audit",
        "name": "bundler-audit"
      },
      "location": {
        "file": "Gemfile.lock",
        "dependency": {
          "package": {
            "name": "nokogiri"
          },
          "version": "1.8.2"
        }
      },
      "identifiers": [
        {
          "type": "cve",
          "name": "CVE-2018-8048",
          "value": "CVE-2018-8048",
          "url": "https://cve.mitre.org/cgi-bin/cvename.cgi?name=CVE-2018-8048"
        }
      ],
      "links": [
        {
          "url": "https://github.com/sparklemotion/nokogiri/pull/1746"
        }
      ]
    },
    {
      "category": "dependency_scanning",
      "message": "Nokogiri gem, via libxslt, is affected by improper access control vulnerability",
      "cve": "Gemfile.lock:nokogiri:cve:CVE-2019-11068",
      "severity": "Unknown",
      "solution": "upgrade to \u003e= 1.10.3",
      "scanner": {
        "id": "bundler_audit",
        "name": "bundler-audit"
      },
      "location": {
        "file": "Gemfile.lock",
        "dependency": {
          "package": {
            "name": "nokogiri"
          },
          "version": "1.8.2"
        }
      },
      "identifiers": [
        {
          "type": "cve",
          "name": "CVE-2019-11068",
          "value": "CVE-2019-11068",
          "url": "https://cve.mitre.org/cgi-bin/cvename.cgi?name=CVE-2019-11068"
        }
      ],
      "links": [
        {
          "url": "https://github.com/sparklemotion/nokogiri/issues/1892"
        }
      ]
    },
    {
      "category": "dependency_scanning",
      "message": "Nokogiri gem, via libxslt, is affected by multiple vulnerabilities",
      "cve": "Gemfile.lock:nokogiri:cve:CVE-2019-13117",
      "severity": "Unknown",
      "solution": "upgrade to \u003e= 1.10.5",
      "scanner": {
        "id": "bundler_audit",
        "name": "bundler-audit"
      },
      "location": {
        "file": "Gemfile.lock",
        "dependency": {
          "package": {
            "name": "nokogiri"
          },
          "version": "1.8.2"
        }
      },
      "identifiers": [
        {
          "type": "cve",
          "name": "CVE-2019-13117",
          "value": "CVE-2019-13117",
          "url": "https://cve.mitre.org/cgi-bin/cvename.cgi?name=CVE-2019-13117"
        }
      ],
      "links": [
        {
          "url": "https://github.com/sparklemotion/nokogiri/issues/1943"
        }
      ]
    },
    {
      "category": "dependency_scanning",
      "name": "Access of Resource Using Incompatible Type (Type Confusion)",
      "message": "Access of Resource Using Incompatible Type (Type Confusion) in nokogiri",
      "description": "Type confusion in `xsltNumberFormatGetMultipleLevel` in libxslt, which is included in nokogiri, could allow attackers to potentially exploit heap corruption via crafted XML data.",
      "cve": "Gemfile.lock:nokogiri:gemnasium:66bbb585-09a1-4042-bb63-e57e64568ded",
      "severity": "Unknown",
      "solution": "Upgrade to version 1.2.0 or above.",
      "scanner": {
        "id": "gemnasium",
        "name": "Gemnasium"
      },
      "location": {
        "file": "Gemfile.lock",
        "dependency": {
          "package": {
            "name": "nokogiri"
          },
          "version": "1.8.2"
        }
      },
      "identifiers": [
        {
          "type": "gemnasium",
          "name": "Gemnasium-66bbb585-09a1-4042-bb63-e57e64568ded",
          "value": "66bbb585-09a1-4042-bb63-e57e64568ded",
          "url": "https://deps.sec.gitlab.com/packages/gem/nokogiri/versions/1.8.2/advisories"
        },
        {
          "type": "cve",
          "name": "CVE-2019-5815",
          "value": "CVE-2019-5815",
          "url": "https://cve.mitre.org/cgi-bin/cvename.cgi?name=CVE-2019-5815"
        }
      ],
      "links": [
        {
          "url": "https://bugs.chromium.org/p/chromium/issues/detail?id=930663"
        },
        {
          "url": "https://gitlab.gnome.org/GNOME/libxslt/commit/08b62c25871b38d5d573515ca8a065b4b8f64f6b"
        },
        {
          "url": "https://nvd.nist.gov/vuln/detail/CVE-2019-5815"
        }
      ]
    },
    {
      "category": "dependency_scanning",
      "name": "Improper Input Validation",
      "message": "Improper Input Validation in nokogiri",
      "description": "In `numbers.c` in libxslt 1.1.33, which is used by nokogiri, a type holding grouping characters of an xsl:number instruction was too narrow and an invalid character/length combination could be passed to `xsltNumberFormatDecimal`, leading to a read of uninitialized stack data.",
      "cve": "Gemfile.lock:nokogiri:gemnasium:e81fe131-f92b-4449-bc54-ca2baa35b06f",
      "severity": "Unknown",
      "solution": "Upgrade to version 1.10.5 or above.",
      "scanner": {
        "id": "gemnasium",
        "name": "Gemnasium"
      },
      "location": {
        "file": "Gemfile.lock",
        "dependency": {
          "package": {
            "name": "nokogiri"
          },
          "version": "1.8.2"
        }
      },
      "identifiers": [
        {
          "type": "gemnasium",
          "name": "Gemnasium-e81fe131-f92b-4449-bc54-ca2baa35b06f",
          "value": "e81fe131-f92b-4449-bc54-ca2baa35b06f",
          "url": "https://deps.sec.gitlab.com/packages/gem/nokogiri/versions/1.8.2/advisories"
        },
        {
          "type": "cve",
          "name": "CVE-2019-13118",
          "value": "CVE-2019-13118",
          "url": "https://cve.mitre.org/cgi-bin/cvename.cgi?name=CVE-2019-13118"
        }
      ],
      "links": [
        {
          "url": "https://nvd.nist.gov/vuln/detail/CVE-2019-13118"
        }
      ]
    },
    {
      "category": "dependency_scanning",
      "name": "Use After Free",
      "message": "Use After Free in nokogiri",
      "description": "In `xsltCopyText` in `transform.c` in libxslt, which is used by nokogiri, a pointer variable isn't reset under certain circumstances. If the relevant memory area happened to be freed and reused in a certain way, a bounds check could fail and memory outside a buffer could be written to, or uninitialized data could be disclosed.",
      "cve": "Gemfile.lock:nokogiri:gemnasium:ecf64d0e-4f5c-4ebe-9f3f-c75ea81dc837",
      "severity": "Unknown",
      "solution": "Upgrade to version 1.10.5 or above.",
      "scanner": {
        "id": "gemnasium",
        "name": "Gemnasium"
      },
      "location": {
        "file": "Gemfile.lock",
        "dependency": {
          "package": {
            "name": "nokogiri"
          },
          "version": "1.8.2"
        }
      },
      "identifiers": [
        {
          "type": "gemnasium",
          "name": "Gemnasium-ecf64d0e-4f5c-4ebe-9f3f-c75ea81dc837",
          "value": "ecf64d0e-4f5c-4ebe-9f3f-c75ea81dc837",
          "url": "https://deps.sec.gitlab.com/packages/gem/nokogiri/versions/1.8.2/advisories"
        },
        {
          "type": "cve",
          "name": "CVE-2019-18197",
          "value": "CVE-2019-18197",
          "url": "https://cve.mitre.org/cgi-bin/cvename.cgi?name=CVE-2019-18197"
        }
      ],
      "links": [
        {
          "url": "https://nvd.nist.gov/vuln/detail/CVE-2019-18197"
        }
      ]
    },
    {
      "category": "dependency_scanning",
      "message": "HTTP Response Splitting vulnerability in puma",
      "cve": "Gemfile.lock:puma:cve:CVE-2020-5247",
      "severity": "Unknown",
      "solution": "upgrade to ~\u003e 3.12.4, \u003e= 4.3.3",
      "scanner": {
        "id": "bundler_audit",
        "name": "bundler-audit"
      },
      "location": {
        "file": "Gemfile.lock",
        "dependency": {
          "package": {
            "name": "puma"
          },
          "version": "3.11.2"
        }
      },
      "identifiers": [
        {
          "type": "cve",
          "name": "CVE-2020-5247",
          "value": "CVE-2020-5247",
          "url": "https://cve.mitre.org/cgi-bin/cvename.cgi?name=CVE-2020-5247"
        }
      ],
      "links": [
        {
          "url": "https://github.com/puma/puma/security/advisories/GHSA-84j7-475p-hp8v"
        }
      ]
    },
    {
      "category": "dependency_scanning",
      "message": "Possible DoS vulnerability in Rack",
      "cve": "Gemfile.lock:rack:cve:CVE-2018-16470",
      "severity": "Unknown",
      "solution": "upgrade to \u003e= 2.0.6",
      "scanner": {
        "id": "bundler_audit",
        "name": "bundler-audit"
      },
      "location": {
        "file": "Gemfile.lock",
        "dependency": {
          "package": {
            "name": "rack"
          },
          "version": "2.0.4"
        }
      },
      "identifiers": [
        {
          "type": "cve",
          "name": "CVE-2018-16470",
          "value": "CVE-2018-16470",
          "url": "https://cve.mitre.org/cgi-bin/cvename.cgi?name=CVE-2018-16470"
        }
      ],
      "links": [
        {
          "url": "https://groups.google.com/forum/#!topic/ruby-security-ann/Dz4sRl-ktKk"
        }
      ]
    },
    {
      "category": "dependency_scanning",
      "message": "Possible XSS vulnerability in Rack",
      "cve": "Gemfile.lock:rack:cve:CVE-2018-16471",
      "severity": "Unknown",
      "solution": "upgrade to ~\u003e 1.6.11, \u003e= 2.0.6",
      "scanner": {
        "id": "bundler_audit",
        "name": "bundler-audit"
      },
      "location": {
        "file": "Gemfile.lock",
        "dependency": {
          "package": {
            "name": "rack"
          },
          "version": "2.0.4"
        }
      },
      "identifiers": [
        {
          "type": "cve",
          "name": "CVE-2018-16471",
          "value": "CVE-2018-16471",
          "url": "https://cve.mitre.org/cgi-bin/cvename.cgi?name=CVE-2018-16471"
        }
      ],
      "links": [
        {
          "url": "https://groups.google.com/forum/#!topic/ruby-security-ann/NAalCee8n6o"
        }
      ]
    },
    {
      "category": "dependency_scanning",
      "message": "Possible information leak / session hijack vulnerability",
      "cve": "Gemfile.lock:rack:cve:CVE-2019-16782",
      "severity": "Unknown",
      "solution": "upgrade to ~\u003e 1.6.12, \u003e= 2.0.8",
      "scanner": {
        "id": "bundler_audit",
        "name": "bundler-audit"
      },
      "location": {
        "file": "Gemfile.lock",
        "dependency": {
          "package": {
            "name": "rack"
          },
          "version": "2.0.4"
        }
      },
      "identifiers": [
        {
          "type": "cve",
          "name": "CVE-2019-16782",
          "value": "CVE-2019-16782",
          "url": "https://cve.mitre.org/cgi-bin/cvename.cgi?name=CVE-2019-16782"
        }
      ],
      "links": [
        {
          "url": "https://github.com/rack/rack/security/advisories/GHSA-hrqr-hxpp-chr3"
        }
      ]
    },
    {
      "category": "dependency_scanning",
      "message": "XSS vulnerability in rails-html-sanitizer",
      "cve": "Gemfile.lock:rails-html-sanitizer:cve:CVE-2018-3741",
      "severity": "Unknown",
      "solution": "upgrade to \u003e= 1.0.4",
      "scanner": {
        "id": "bundler_audit",
        "name": "bundler-audit"
      },
      "location": {
        "file": "Gemfile.lock",
        "dependency": {
          "package": {
            "name": "rails-html-sanitizer"
          },
          "version": "1.0.3"
        }
      },
      "identifiers": [
        {
          "type": "cve",
          "name": "CVE-2018-3741",
          "value": "CVE-2018-3741",
          "url": "https://cve.mitre.org/cgi-bin/cvename.cgi?name=CVE-2018-3741"
        }
      ],
      "links": [
        {
          "url": "https://groups.google.com/d/msg/rubyonrails-security/tP7W3kLc5u4/uDy2Br7xBgAJ"
        }
      ]
    },
    {
      "category": "dependency_scanning",
      "name": "Uncontrolled Resource Consumption",
      "message": "Uncontrolled Resource Consumption in rails",
      "description": "There is a possible denial of service vulnerability in Action View (Rails) where specially crafted accept headers can cause action view to consume 100% cpu and make the server unresponsive.",
      "cve": "Gemfile.lock:rails:gemnasium:03fb9fd8-0566-4b25-9a50-9918b3798ff4",
      "severity": "Unknown",
      "solution": "Upgrade to versions 4.2.11.1, 5.0.7.2, 5.1.6.2, 5.2.2.1 or above.",
      "scanner": {
        "id": "gemnasium",
        "name": "Gemnasium"
      },
      "location": {
        "file": "Gemfile.lock",
        "dependency": {
          "package": {
            "name": "rails"
          },
          "version": "5.0.0"
        }
      },
      "identifiers": [
        {
          "type": "gemnasium",
          "name": "Gemnasium-03fb9fd8-0566-4b25-9a50-9918b3798ff4",
          "value": "03fb9fd8-0566-4b25-9a50-9918b3798ff4",
          "url": "https://deps.sec.gitlab.com/packages/gem/rails/versions/5.0.0/advisories"
        },
        {
          "type": "cve",
          "name": "CVE-2019-5419",
          "value": "CVE-2019-5419",
          "url": "https://cve.mitre.org/cgi-bin/cvename.cgi?name=CVE-2019-5419"
        }
      ],
      "links": [
        {
          "url": "https://nvd.nist.gov/vuln/detail/CVE-2019-5419"
        }
      ]
    },
    {
      "category": "dependency_scanning",
      "name": "Deserialization of Untrusted Data",
      "message": "Deserialization of Untrusted Data in rails",
      "description": "A Broken Access Control vulnerability in Active Job allows an attacker to craft user input which can cause Active Job to deserialize it using GlobalId and give them access to information that they should not have.",
      "cve": "Gemfile.lock:rails:gemnasium:18b3b503-c508-4713-9bb9-057fcefe6dfe",
      "severity": "Unknown",
      "solution": "Upgrade to versions 4.2.11, 5.0.7.1, 5.1.6.1, 5.2.1.1 or above.",
      "scanner": {
        "id": "gemnasium",
        "name": "Gemnasium"
      },
      "location": {
        "file": "Gemfile.lock",
        "dependency": {
          "package": {
            "name": "rails"
          },
          "version": "5.0.0"
        }
      },
      "identifiers": [
        {
          "type": "gemnasium",
          "name": "Gemnasium-18b3b503-c508-4713-9bb9-057fcefe6dfe",
          "value": "18b3b503-c508-4713-9bb9-057fcefe6dfe",
          "url": "https://deps.sec.gitlab.com/packages/gem/rails/versions/5.0.0/advisories"
        },
        {
          "type": "cve",
          "name": "CVE-2018-16476",
          "value": "CVE-2018-16476",
          "url": "https://cve.mitre.org/cgi-bin/cvename.cgi?name=CVE-2018-16476"
        }
      ],
      "links": [
        {
          "url": "https://nvd.nist.gov/vuln/detail/CVE-2018-16476"
        },
        {
          "url": "https://weblog.rubyonrails.org/2018/11/27/Rails-4-2-5-0-5-1-5-2-have-been-released/"
        }
      ]
    },
    {
      "category": "dependency_scanning",
      "name": "Improper Input Validation",
      "message": "Improper Input Validation in rails",
      "description": "A remote code execution vulnerability in development mode Rails can allow an attacker to guess the automatically generated development mode secret token. This secret token can be used in combination with other Rails internals to escalate to a remote code execution exploit.",
      "cve": "Gemfile.lock:rails:gemnasium:31ddd20a-862e-4bb9-a953-de04bb4c7caf",
      "severity": "Unknown",
      "solution": "Upgrade to versions 5.2.2.1, 6.0.0 or above.",
      "scanner": {
        "id": "gemnasium",
        "name": "Gemnasium"
      },
      "location": {
        "file": "Gemfile.lock",
        "dependency": {
          "package": {
            "name": "rails"
          },
          "version": "5.0.0"
        }
      },
      "identifiers": [
        {
          "type": "gemnasium",
          "name": "Gemnasium-31ddd20a-862e-4bb9-a953-de04bb4c7caf",
          "value": "31ddd20a-862e-4bb9-a953-de04bb4c7caf",
          "url": "https://deps.sec.gitlab.com/packages/gem/rails/versions/5.0.0/advisories"
        },
        {
          "type": "cve",
          "name": "CVE-2019-5420",
          "value": "CVE-2019-5420",
          "url": "https://cve.mitre.org/cgi-bin/cvename.cgi?name=CVE-2019-5420"
        }
      ],
      "links": [
        {
          "url": "http://packetstormsecurity.com/files/152704/Ruby-On-Rails-DoubleTap-Development-Mode-secret_key_base-Remote-Code-Execution.html"
        },
        {
          "url": "https://nvd.nist.gov/vuln/detail/CVE-2019-5420"
        },
        {
          "url": "https://weblog.rubyonrails.org/2019/3/13/Rails-4-2-5-1-5-1-6-2-have-been-released/"
        },
        {
          "url": "https://www.exploit-db.com/exploits/46785/"
        }
      ]
    },
    {
      "category": "dependency_scanning",
      "name": "Information Exposure",
      "message": "Information Exposure in rails",
      "description": "There is a File Content Disclosure vulnerability in Action View where specially crafted accept headers can cause contents of arbitrary files on the target system's filesystem to be exposed.",
      "cve": "Gemfile.lock:rails:gemnasium:8d1df401-d117-44ce-8106-c147d960ae4c",
      "severity": "Unknown",
      "solution": "Upgrade to versions 4.2.11.1, 5.0.7.2, 5.1.6.2, 5.2.2.1 or above.",
      "scanner": {
        "id": "gemnasium",
        "name": "Gemnasium"
      },
      "location": {
        "file": "Gemfile.lock",
        "dependency": {
          "package": {
            "name": "rails"
          },
          "version": "5.0.0"
        }
      },
      "identifiers": [
        {
          "type": "gemnasium",
          "name": "Gemnasium-8d1df401-d117-44ce-8106-c147d960ae4c",
          "value": "8d1df401-d117-44ce-8106-c147d960ae4c",
          "url": "https://deps.sec.gitlab.com/packages/gem/rails/versions/5.0.0/advisories"
        },
        {
          "type": "cve",
          "name": "CVE-2019-5418",
          "value": "CVE-2019-5418",
          "url": "https://cve.mitre.org/cgi-bin/cvename.cgi?name=CVE-2019-5418"
        }
      ],
      "links": [
        {
          "url": "http://packetstormsecurity.com/files/152178/Rails-5.2.1-Arbitrary-File-Content-Disclosure.html"
        },
        {
          "url": "https://nvd.nist.gov/vuln/detail/CVE-2019-5418"
        },
        {
          "url": "https://weblog.rubyonrails.org/2019/3/13/Rails-4-2-5-1-5-1-6-2-have-been-released/"
        },
        {
          "url": "https://www.exploit-db.com/exploits/46585/"
        }
      ]
    },
    {
      "category": "dependency_scanning",
      "message": "Directory Traversal in rubyzip",
      "cve": "Gemfile.lock:rubyzip:cve:CVE-2018-1000544",
      "severity": "Unknown",
      "solution": "upgrade to \u003e= 1.2.2",
      "scanner": {
        "id": "bundler_audit",
        "name": "bundler-audit"
      },
      "location": {
        "file": "Gemfile.lock",
        "dependency": {
          "package": {
            "name": "rubyzip"
          },
          "version": "1.2.1"
        }
      },
      "identifiers": [
        {
          "type": "cve",
          "name": "CVE-2018-1000544",
          "value": "CVE-2018-1000544",
          "url": "https://cve.mitre.org/cgi-bin/cvename.cgi?name=CVE-2018-1000544"
        }
      ],
      "links": [
        {
          "url": "https://github.com/rubyzip/rubyzip/issues/369"
        }
      ]
    },
    {
      "category": "dependency_scanning",
      "message": "Denial of Service in rubyzip (\"zip bombs\")",
      "cve": "Gemfile.lock:rubyzip:cve:CVE-2019-16892",
      "severity": "Unknown",
      "solution": "upgrade to \u003e= 1.3.0",
      "scanner": {
        "id": "bundler_audit",
        "name": "bundler-audit"
      },
      "location": {
        "file": "Gemfile.lock",
        "dependency": {
          "package": {
            "name": "rubyzip"
          },
          "version": "1.2.1"
        }
      },
      "identifiers": [
        {
          "type": "cve",
          "name": "CVE-2019-16892",
          "value": "CVE-2019-16892",
          "url": "https://cve.mitre.org/cgi-bin/cvename.cgi?name=CVE-2019-16892"
        }
      ],
      "links": [
        {
          "url": "https://github.com/rubyzip/rubyzip/pull/403"
        }
      ]
    },
    {
      "category": "dependency_scanning",
      "message": "Path Traversal in Sprockets",
      "cve": "Gemfile.lock:sprockets:cve:CVE-2018-3760",
      "severity": "Unknown",
      "solution": "upgrade to \u003e= 2.12.5, \u003c 3.0.0, \u003e= 3.7.2, \u003c 4.0.0, \u003e= 4.0.0.beta8",
      "scanner": {
        "id": "bundler_audit",
        "name": "bundler-audit"
      },
      "location": {
        "file": "Gemfile.lock",
        "dependency": {
          "package": {
            "name": "sprockets"
          },
          "version": "3.7.1"
        }
      },
      "identifiers": [
        {
          "type": "cve",
          "name": "CVE-2018-3760",
          "value": "CVE-2018-3760",
          "url": "https://cve.mitre.org/cgi-bin/cvename.cgi?name=CVE-2018-3760"
        }
      ],
      "links": [
        {
          "url": "https://groups.google.com/forum/#!topic/ruby-security-ann/2S9Pwz2i16k"
        }
      ]
    }
  ],
  "remediations": [],
  "dependency_files": [
    {
      "path": "Gemfile.lock",
      "package_manager": "bundler",
      "dependencies": [
        {
          "package": {
            "name": "actioncable"
          },
          "version": "5.0.0"
        },
        {
          "package": {
            "name": "actionmailer"
          },
          "version": "5.0.0"
        },
        {
          "package": {
            "name": "actionpack"
          },
          "version": "5.0.0"
        },
        {
          "package": {
            "name": "actionview"
          },
          "version": "5.0.0"
        },
        {
          "package": {
            "name": "activejob"
          },
          "version": "5.0.0"
        },
        {
          "package": {
            "name": "activemodel"
          },
          "version": "5.0.0"
        },
        {
          "package": {
            "name": "activerecord"
          },
          "version": "5.0.0"
        },
        {
          "package": {
            "name": "activesupport"
          },
          "version": "5.0.0"
        },
        {
          "package": {
            "name": "addressable"
          },
          "version": "2.5.2"
        },
        {
          "package": {
            "name": "arel"
          },
          "version": "7.1.4"
        },
        {
          "package": {
            "name": "bindex"
          },
          "version": "0.5.0"
        },
        {
          "package": {
            "name": "builder"
          },
          "version": "3.2.3"
        },
        {
          "package": {
            "name": "byebug"
          },
          "version": "10.0.0"
        },
        {
          "package": {
            "name": "capybara"
          },
          "version": "2.18.0"
        },
        {
          "package": {
            "name": "childprocess"
          },
          "version": "0.8.0"
        },
        {
          "package": {
            "name": "coffee-rails"
          },
          "version": "4.2.2"
        },
        {
          "package": {
            "name": "coffee-script"
          },
          "version": "2.4.1"
        },
        {
          "package": {
            "name": "coffee-script-source"
          },
          "version": "1.12.2"
        },
        {
          "package": {
            "name": "concurrent-ruby"
          },
          "version": "1.0.5"
        },
        {
          "package": {
            "name": "crass"
          },
          "version": "1.0.3"
        },
        {
          "package": {
            "name": "erubis"
          },
          "version": "2.7.0"
        },
        {
          "package": {
            "name": "execjs"
          },
          "version": "2.7.0"
        },
        {
          "package": {
            "name": "ffi"
          },
          "version": "1.9.21"
        },
        {
          "package": {
            "name": "globalid"
          },
          "version": "0.4.1"
        },
        {
          "package": {
            "name": "i18n"
          },
          "version": "0.9.5"
        },
        {
          "package": {
            "name": "jbuilder"
          },
          "version": "2.7.0"
        },
        {
          "package": {
            "name": "listen"
          },
          "version": "3.1.5"
        },
        {
          "package": {
            "name": "loofah"
          },
          "version": "2.2.0"
        },
        {
          "package": {
            "name": "mail"
          },
          "version": "2.7.0"
        },
        {
          "package": {
            "name": "method_source"
          },
          "version": "0.9.0"
        },
        {
          "package": {
            "name": "mini_mime"
          },
          "version": "1.0.0"
        },
        {
          "package": {
            "name": "mini_portile2"
          },
          "version": "2.3.0"
        },
        {
          "package": {
            "name": "minitest"
          },
          "version": "5.11.3"
        },
        {
          "package": {
            "name": "multi_json"
          },
          "version": "1.13.1"
        },
        {
          "package": {
            "name": "nio4r"
          },
          "version": "1.2.1"
        },
        {
          "package": {
            "name": "nokogiri"
          },
          "version": "1.8.2"
        },
        {
          "package": {
            "name": "public_suffix"
          },
          "version": "3.0.2"
        },
        {
          "package": {
            "name": "puma"
          },
          "version": "3.11.2"
        },
        {
          "package": {
            "name": "rack"
          },
          "version": "2.0.4"
        },
        {
          "package": {
            "name": "rack-test"
          },
          "version": "0.6.3"
        },
        {
          "package": {
            "name": "rails"
          },
          "version": "5.0.0"
        },
        {
          "package": {
            "name": "rails-dom-testing"
          },
          "version": "2.0.3"
        },
        {
          "package": {
            "name": "rails-html-sanitizer"
          },
          "version": "1.0.3"
        },
        {
          "package": {
            "name": "railties"
          },
          "version": "5.0.0"
        },
        {
          "package": {
            "name": "rake"
          },
          "version": "12.3.0"
        },
        {
          "package": {
            "name": "rb-fsevent"
          },
          "version": "0.10.2"
        },
        {
          "package": {
            "name": "rb-inotify"
          },
          "version": "0.9.10"
        },
        {
          "package": {
            "name": "ruby_dep"
          },
          "version": "1.5.0"
        },
        {
          "package": {
            "name": "rubyzip"
          },
          "version": "1.2.1"
        },
        {
          "package": {
            "name": "sass"
          },
          "version": "3.5.5"
        },
        {
          "package": {
            "name": "sass-listen"
          },
          "version": "4.0.0"
        },
        {
          "package": {
            "name": "sass-rails"
          },
          "version": "5.0.7"
        },
        {
          "package": {
            "name": "selenium-webdriver"
          },
          "version": "3.9.0"
        },
        {
          "package": {
            "name": "spring"
          },
          "version": "2.0.2"
        },
        {
          "package": {
            "name": "spring-watcher-listen"
          },
          "version": "2.0.1"
        },
        {
          "package": {
            "name": "sprockets"
          },
          "version": "3.7.1"
        },
        {
          "package": {
            "name": "sprockets-rails"
          },
          "version": "3.2.1"
        },
        {
          "package": {
            "name": "sqlite3"
          },
          "version": "1.3.13"
        },
        {
          "package": {
            "name": "thor"
          },
          "version": "0.20.0"
        },
        {
          "package": {
            "name": "thread_safe"
          },
          "version": "0.3.6"
        },
        {
          "package": {
            "name": "tilt"
          },
          "version": "2.0.8"
        },
        {
          "package": {
            "name": "turbolinks"
          },
          "version": "5.1.0"
        },
        {
          "package": {
            "name": "turbolinks-source"
          },
          "version": "5.1.0"
        },
        {
          "package": {
            "name": "tzinfo"
          },
          "version": "1.2.5"
        },
        {
          "package": {
            "name": "uglifier"
          },
          "version": "4.1.6"
        },
        {
          "package": {
            "name": "web-console"
          },
          "version": "3.5.1"
        },
        {
          "package": {
            "name": "websocket-driver"
          },
          "version": "0.6.5"
        },
        {
          "package": {
            "name": "websocket-extensions"
          },
          "version": "0.1.3"
        },
        {
          "package": {
            "name": "xpath"
          },
          "version": "3.0.0"
        }
      ]
    }
  ]
}
