{
  "profiles": {
    "DotNetSoapServiceClient": {
      "commandName": "Project",
      "environmentVariables": {
        "TARGET_URL": "https://localhost:6001",
        //"TARGET_URL": "http://localhost:6000",
        //"HTTP_PROXY": "127.0.0.1:8888"
      }
    }
  }
}