{
  "version": "15.1.4",
  "vulnerabilities": [
    {
      "id": ":SKIP:",
      "category": "sast",
      "name": "RouterTable with Default Routing",
      "description": "NAT gateways are recommended, and not the default route which permits all traffic, in Route Tables.",
      "cve": "kics_id:4f0908b9-eb66-433f-9145-134274e1e944:112:0",
      "severity": "Info",
      "scanner": {
        "id": "kics",
        "name": "kics"
      },
      "location": {
        "file": "aws/solutions/VPCPeering/templates/VPCPeering-Updates.cfn.yaml",
        "start_line": 112
      },
      "identifiers": [
        {
          "type": "kics_id",
          "name": "RouterTable with Default Routing",
          "value": "4f0908b9-eb66-433f-9145-134274e1e944",
          "url": "https://docs.aws.amazon.com/AWSCloudFormation/latest/UserGuide/aws-resource-ec2-route-table.html"
        }
      ]
    },
    {
      "id": ":SKIP:",
      "category": "sast",
      "name": "RouterTable with Default Routing",
      "description": "NAT gateways are recommended, and not the default route which permits all traffic, in Route Tables.",
      "cve": "kics_id:4f0908b9-eb66-433f-9145-134274e1e944:119:0",
      "severity": "Info",
      "scanner": {
        "id": "kics",
        "name": "kics"
      },
      "location": {
        "file": "aws/solutions/VPCPeering/templates/VPCPeering-Updates.cfn.yaml",
        "start_line": 119
      },
      "identifiers": [
        {
          "type": "kics_id",
          "name": "RouterTable with Default Routing",
          "value": "4f0908b9-eb66-433f-9145-134274e1e944",
          "url": "https://docs.aws.amazon.com/AWSCloudFormation/latest/UserGuide/aws-resource-ec2-route-table.html"
        }
      ]
    },
    {
      "id": ":SKIP:",
      "category": "sast",
      "name": "RouterTable with Default Routing",
      "description": "NAT gateways are recommended, and not the default route which permits all traffic, in Route Tables.",
      "cve": "kics_id:4f0908b9-eb66-433f-9145-134274e1e944:126:0",
      "severity": "Info",
      "scanner": {
        "id": "kics",
        "name": "kics"
      },
      "location": {
        "file": "aws/solutions/VPCPeering/templates/VPCPeering-Updates.cfn.yaml",
        "start_line": 126
      },
      "identifiers": [
        {
          "type": "kics_id",
          "name": "RouterTable with Default Routing",
          "value": "4f0908b9-eb66-433f-9145-134274e1e944",
          "url": "https://docs.aws.amazon.com/AWSCloudFormation/latest/UserGuide/aws-resource-ec2-route-table.html"
        }
      ]
    },
    {
      "id": ":SKIP:",
      "category": "sast",
      "name": "RouterTable with Default Routing",
      "description": "NAT gateways are recommended, and not the default route which permits all traffic, in Route Tables.",
      "cve": "kics_id:4f0908b9-eb66-433f-9145-134274e1e944:133:0",
      "severity": "Info",
      "scanner": {
        "id": "kics",
        "name": "kics"
      },
      "location": {
        "file": "aws/solutions/VPCPeering/templates/VPCPeering-Updates.cfn.yaml",
        "start_line": 133
      },
      "identifiers": [
        {
          "type": "kics_id",
          "name": "RouterTable with Default Routing",
          "value": "4f0908b9-eb66-433f-9145-134274e1e944",
          "url": "https://docs.aws.amazon.com/AWSCloudFormation/latest/UserGuide/aws-resource-ec2-route-table.html"
        }
      ]
    },
    {
      "id": ":SKIP:",
      "category": "sast",
      "name": "RouterTable with Default Routing",
      "description": "NAT gateways are recommended, and not the default route which permits all traffic, in Route Tables.",
      "cve": "kics_id:4f0908b9-eb66-433f-9145-134274e1e944:140:0",
      "severity": "Info",
      "scanner": {
        "id": "kics",
        "name": "kics"
      },
      "location": {
        "file": "aws/solutions/VPCPeering/templates/VPCPeering-Updates.cfn.yaml",
        "start_line": 140
      },
      "identifiers": [
        {
          "type": "kics_id",
          "name": "RouterTable with Default Routing",
          "value": "4f0908b9-eb66-433f-9145-134274e1e944",
          "url": "https://docs.aws.amazon.com/AWSCloudFormation/latest/UserGuide/aws-resource-ec2-route-table.html"
        }
      ]
    },
    {
      "id": ":SKIP:",
      "category": "sast",
      "name": "RouterTable with Default Routing",
      "description": "NAT gateways are recommended, and not the default route which permits all traffic, in Route Tables.",
      "cve": "kics_id:4f0908b9-eb66-433f-9145-134274e1e944:147:0",
      "severity": "Info",
      "scanner": {
        "id": "kics",
        "name": "kics"
      },
      "location": {
        "file": "aws/solutions/VPCPeering/templates/VPCPeering-Updates.cfn.yaml",
        "start_line": 147
      },
      "identifiers": [
        {
          "type": "kics_id",
          "name": "RouterTable with Default Routing",
          "value": "4f0908b9-eb66-433f-9145-134274e1e944",
          "url": "https://docs.aws.amazon.com/AWSCloudFormation/latest/UserGuide/aws-resource-ec2-route-table.html"
        }
      ]
    },
    {
      "id": ":SKIP:",
      "category": "sast",
      "name": "Stack Notifications Disabled",
      "description": "AWS CloudFormation should have stack notifications enabled to be notified when an event occurs",
      "cve": "kics_id:837e033c-4717-40bd-807e-6abaa30161b7:127:0",
      "severity": "Info",
      "scanner": {
        "id": "kics",
        "name": "kics"
      },
      "location": {
        "file": "aws/solutions/VPCPeering/templates/VPCPeering-Requester.main.cfn.yaml",
        "start_line": 127
      },
      "identifiers": [
        {
          "type": "kics_id",
          "name": "Stack Notifications Disabled",
          "value": "837e033c-4717-40bd-807e-6abaa30161b7",
          "url": "https://docs.aws.amazon.com/AWSCloudFormation/latest/UserGuide/aws-properties-stack.html"
        }
      ]
    },
    {
      "id": ":SKIP:",
      "category": "sast",
      "name": "Stack Notifications Disabled",
      "description": "AWS CloudFormation should have stack notifications enabled to be notified when an event occurs",
      "cve": "kics_id:837e033c-4717-40bd-807e-6abaa30161b7:141:0",
      "severity": "Info",
      "scanner": {
        "id": "kics",
        "name": "kics"
      },
      "location": {
        "file": "aws/solutions/VPCPeering/templates/VPCPeering-Requester.main.cfn.yaml",
        "start_line": 141
      },
      "identifiers": [
        {
          "type": "kics_id",
          "name": "Stack Notifications Disabled",
          "value": "837e033c-4717-40bd-807e-6abaa30161b7",
          "url": "https://docs.aws.amazon.com/AWSCloudFormation/latest/UserGuide/aws-properties-stack.html"
        }
      ]
    },
    {
      "id": ":SKIP:",
      "category": "sast",
      "name": "Stack Notifications Disabled",
      "description": "AWS CloudFormation should have stack notifications enabled to be notified when an event occurs",
      "cve": "kics_id:837e033c-4717-40bd-807e-6abaa30161b7:146:0",
      "severity": "Info",
      "scanner": {
        "id": "kics",
        "name": "kics"
      },
      "location": {
        "file": "aws/solutions/VPCPeering/templates/VPCPeering-Accepter.main.cfn.yaml",
        "start_line": 146
      },
      "identifiers": [
        {
          "type": "kics_id",
          "name": "Stack Notifications Disabled",
          "value": "837e033c-4717-40bd-807e-6abaa30161b7",
          "url": "https://docs.aws.amazon.com/AWSCloudFormation/latest/UserGuide/aws-properties-stack.html"
        }
      ]
    },
    {
      "id": ":SKIP:",
      "category": "sast",
      "name": "Stack Notifications Disabled",
      "description": "AWS CloudFormation should have stack notifications enabled to be notified when an event occurs",
      "cve": "kics_id:837e033c-4717-40bd-807e-6abaa30161b7:163:0",
      "severity": "Info",
      "scanner": {
        "id": "kics",
        "name": "kics"
      },
      "location": {
        "file": "aws/solutions/VPCPeering/templates/VPCPeering-Accepter.main.cfn.yaml",
        "start_line": 163
      },
      "identifiers": [
        {
          "type": "kics_id",
          "name": "Stack Notifications Disabled",
          "value": "837e033c-4717-40bd-807e-6abaa30161b7",
          "url": "https://docs.aws.amazon.com/AWSCloudFormation/latest/UserGuide/aws-properties-stack.html"
        }
      ]
    },
    {
      "id": ":SKIP:",
      "category": "sast",
      "name": "IAM Access Analyzer Not Enabled",
      "description": "IAM Access Analyzer should be enabled and configured to continuously monitor resource permissions",
      "cve": "kics_id:8d29754a-2a18-460d-a1ba-9509f8d359da:109:0",
      "severity": "Info",
      "scanner": {
        "id": "kics",
        "name": "kics"
      },
      "location": {
        "file": "aws/solutions/VPCPeering/templates/VPCPeering-Updates.cfn.yaml",
        "start_line": 109
      },
      "identifiers": [
        {
          "type": "kics_id",
          "name": "IAM Access Analyzer Not Enabled",
          "value": "8d29754a-2a18-460d-a1ba-9509f8d359da",
          "url": "https://docs.amazonaws.cn/en_us/AWSCloudFormation/latest/UserGuide/aws-resource-accessanalyzer-analyzer.html"
        }
      ]
    },
    {
      "id": ":SKIP:",
      "category": "sast",
      "name": "IAM Access Analyzer Not Enabled",
      "description": "IAM Access Analyzer should be enabled and configured to continuously monitor resource permissions",
      "cve": "kics_id:8d29754a-2a18-460d-a1ba-9509f8d359da:124:0",
      "severity": "Info",
      "scanner": {
        "id": "kics",
        "name": "kics"
      },
      "location": {
        "file": "aws/solutions/VPCPeering/templates/VPCPeering-Requester.main.cfn.yaml",
        "start_line": 124
      },
      "identifiers": [
        {
          "type": "kics_id",
          "name": "IAM Access Analyzer Not Enabled",
          "value": "8d29754a-2a18-460d-a1ba-9509f8d359da",
          "url": "https://docs.amazonaws.cn/en_us/AWSCloudFormation/latest/UserGuide/aws-resource-accessanalyzer-analyzer.html"
        }
      ]
    },
    {
      "id": ":SKIP:",
      "category": "sast",
      "name": "IAM Access Analyzer Not Enabled",
      "description": "IAM Access Analyzer should be enabled and configured to continuously monitor resource permissions",
      "cve": "kics_id:8d29754a-2a18-460d-a1ba-9509f8d359da:143:0",
      "severity": "Info",
      "scanner": {
        "id": "kics",
        "name": "kics"
      },
      "location": {
        "file": "aws/solutions/VPCPeering/templates/VPCPeering-Accepter.main.cfn.yaml",
        "start_line": 143
      },
      "identifiers": [
        {
          "type": "kics_id",
          "name": "IAM Access Analyzer Not Enabled",
          "value": "8d29754a-2a18-460d-a1ba-9509f8d359da",
          "url": "https://docs.amazonaws.cn/en_us/AWSCloudFormation/latest/UserGuide/aws-resource-accessanalyzer-analyzer.html"
        }
      ]
    },
    {
      "id": ":SKIP:",
      "category": "sast",
      "name": "IAM Access Analyzer Not Enabled",
      "description": "IAM Access Analyzer should be enabled and configured to continuously monitor resource permissions",
      "cve": "kics_id:8d29754a-2a18-460d-a1ba-9509f8d359da:19:0",
      "severity": "Info",
      "scanner": {
        "id": "kics",
        "name": "kics"
      },
      "location": {
        "file": "aws/solutions/VPCPeering/templates/VPCPeering-Accepter-Role.cfn.yaml",
        "start_line": 19
      },
      "identifiers": [
        {
          "type": "kics_id",
          "name": "IAM Access Analyzer Not Enabled",
          "value": "8d29754a-2a18-460d-a1ba-9509f8d359da",
          "url": "https://docs.amazonaws.cn/en_us/AWSCloudFormation/latest/UserGuide/aws-resource-accessanalyzer-analyzer.html"
        }
      ]
    },
    {
      "id": ":SKIP:",
      "category": "sast",
      "name": "IAM Access Analyzer Not Enabled",
      "description": "IAM Access Analyzer should be enabled and configured to continuously monitor resource permissions",
      "cve": "kics_id:8d29754a-2a18-460d-a1ba-9509f8d359da:59:0",
      "severity": "Info",
      "scanner": {
        "id": "kics",
        "name": "kics"
      },
      "location": {
        "file": "aws/solutions/VPCPeering/templates/VPCPeering-Requester-Setup.cfn.yaml",
        "start_line": 59
      },
      "identifiers": [
        {
          "type": "kics_id",
          "name": "IAM Access Analyzer Not Enabled",
          "value": "8d29754a-2a18-460d-a1ba-9509f8d359da",
          "url": "https://docs.amazonaws.cn/en_us/AWSCloudFormation/latest/UserGuide/aws-resource-accessanalyzer-analyzer.html"
        }
      ]
    },
    {
      "id": ":SKIP:",
      "category": "sast",
      "name": "IAM Access Analyzer Not Enabled",
      "description": "IAM Access Analyzer should be enabled and configured to continuously monitor resource permissions",
      "cve": "kics_id:8d29754a-2a18-460d-a1ba-9509f8d359da:66:0",
      "severity": "Info",
      "scanner": {
        "id": "kics",
        "name": "kics"
      },
      "location": {
        "file": "aws/solutions/VPCPeering/templates/VPCPeering-Accepter-Tag.cfn.yaml",
        "start_line": 66
      },
      "identifiers": [
        {
          "type": "kics_id",
          "name": "IAM Access Analyzer Not Enabled",
          "value": "8d29754a-2a18-460d-a1ba-9509f8d359da",
          "url": "https://docs.amazonaws.cn/en_us/AWSCloudFormation/latest/UserGuide/aws-resource-accessanalyzer-analyzer.html"
        }
      ]
    },
    {
      "id": ":SKIP:",
      "category": "sast",
      "name": "Lambda Function Without Tags",
      "description": "AWS Lambda Functions must have associated tags.",
      "cve": "kics_id:8df8e857-bd59-44fa-9f4c-d77594b95b46:130:0",
      "severity": "Info",
      "scanner": {
        "id": "kics",
        "name": "kics"
      },
      "location": {
        "file": "aws/solutions/VPCPeering/templates/VPCPeering-Accepter-Tag.cfn.yaml",
        "start_line": 130
      },
      "identifiers": [
        {
          "type": "kics_id",
          "name": "Lambda Function Without Tags",
          "value": "8df8e857-bd59-44fa-9f4c-d77594b95b46",
          "url": "https://docs.aws.amazon.com/AWSCloudFormation/latest/UserGuide/aws-resource-lambda-function.html"
        }
      ]
    },
    {
      "id": ":SKIP:",
      "category": "sast",
      "name": "Lambda Functions Without X-Ray Tracing",
      "description": "AWS Lambda functions should have TracingConfig enabled. For this, property 'tracingConfig.mode' should have the value 'Active'",
      "cve": "kics_id:9488c451-074e-4cd3-aee3-7db6104f542c:130:0",
      "severity": "Info",
      "scanner": {
        "id": "kics",
        "name": "kics"
      },
      "location": {
        "file": "aws/solutions/VPCPeering/templates/VPCPeering-Accepter-Tag.cfn.yaml",
        "start_line": 130
      },
      "identifiers": [
        {
          "type": "kics_id",
          "name": "Lambda Functions Without X-Ray Tracing",
          "value": "9488c451-074e-4cd3-aee3-7db6104f542c",
          "url": "https://docs.aws.amazon.com/AWSCloudFormation/latest/UserGuide/aws-properties-lambda-function-tracingconfig.html"
        }
      ]
    },
    {
      "id": ":SKIP:",
      "category": "sast",
      "name": "Lambda Function Without Dead Letter Queue",
      "description": "AWS Lambda Function should be configured for a Dead Letter Queue(DLQ)",
      "cve": "kics_id:c2eae442-d3ba-4cb1-84ca-1db4f80eae3d:130:0",
      "severity": "Info",
      "scanner": {
        "id": "kics",
        "name": "kics"
      },
      "location": {
        "file": "aws/solutions/VPCPeering/templates/VPCPeering-Accepter-Tag.cfn.yaml",
        "start_line": 130
      },
      "identifiers": [
        {
          "type": "kics_id",
          "name": "Lambda Function Without Dead Letter Queue",
          "value": "c2eae442-d3ba-4cb1-84ca-1db4f80eae3d",
          "url": "https://docs.aws.amazon.com/AWSCloudFormation/latest/UserGuide/aws-resource-lambda-function.html#cfn-lambda-function-deadletterconfig"
        }
      ]
    }
  ],
  "scan": {
    "analyzer": {
      "id": "kics",
      "name": "kics",
      "url": "https://gitlab.com/gitlab-org/security-products/analyzers/kics",
      "vendor": {
        "name": "GitLab"
      },
      "version": ":SKIP:"
    },
    "scanner": {
      "id": "kics",
      "name": "kics",
      "url": "https://github.com/Checkmarx/kics",
      "vendor": {
        "name": "GitLab"
      },
      "version": ":SKIP:"
    },
    "type": "sast",
    "start_time": ":SKIP:",
    "end_time": ":SKIP:",
    "status": "success"
  }
}
