{
    "version": "15.0.4",
    "vulnerabilities": [
      {
        "id": ":SKIP:",
        "category": "sast",
        "name": "HTTPS Not Enabled",
        "description": "HTTPS: Without HTTPS, attackers in a priveleged network position can intercept and modify traffic. Sobelow detects missing HTTPS by checking the prod configuration.",
        "cve": "config/prod.exs:0:config_https_not_enabled",
        "severity": "Unknown",
        "confidence": "High",
        "scanner": {
          "id": "sobelow",
          "name": "Sobelow"
        },
        "location": {
          "file": "config/prod.exs"
        },
        "identifiers": [
          {
            "type": "sobelow_rule_id",
            "name": "Sobelow Rule ID config_https_not_enabled",
            "value": "config_https_not_enabled"
          }
        ]
      },
      {
        "id": ":SKIP:",
        "category": "sast",
        "name": "Unsafe `binary_to_term`",
        "description": "Insecure use of `binary_to_term`: If user input is passed to Erlang's `binary_to_term` function it may result in memory exhaustion or code execution. Even with the `:safe` option, `binary_to_term` will deserialize functions, and shouldn't be considered safe to use with untrusted input.",
        "cve": "lib/elixir_phoenix_web/controllers/page_controller.ex:10:misc_unsafe_binary_to_term",
        "severity": "Unknown",
        "confidence": "High",
        "scanner": {
          "id": "sobelow",
          "name": "Sobelow"
        },
        "location": {
          "file": "lib/elixir_phoenix_web/controllers/page_controller.ex",
          "start_line": 10
        },
        "identifiers": [
          {
            "type": "sobelow_rule_id",
            "name": "Sobelow Rule ID misc_unsafe_binary_to_term",
            "value": "misc_unsafe_binary_to_term"
          }
        ]
      },
      {
        "id": ":SKIP:",
        "category": "sast",
        "name": "Directory Traversal in `send_download`",
        "description": "Path Traversal: Path traversal vulnerabilities are a result of interacting with the filesystem using untrusted input. This class of vulnerability may result in file disclosure, code execution, denial of service, and other issues. Read more about Path Traversal here: https://www.owasp.org/index.php/Path_Traversal",
        "cve": "lib/elixir_phoenix_web/controllers/page_controller.ex:15:traversal_in_send_download",
        "severity": "Unknown",
        "confidence": "High",
        "scanner": {
          "id": "sobelow",
          "name": "Sobelow"
        },
        "location": {
          "file": "lib/elixir_phoenix_web/controllers/page_controller.ex",
          "start_line": 15
        },
        "identifiers": [
          {
            "type": "sobelow_rule_id",
            "name": "Sobelow Rule ID traversal_in_send_download",
            "value": "traversal_in_send_download"
          }
        ]
      },
      {
        "id": ":SKIP:",
        "category": "sast",
        "name": "Directory Traversal in `send_file`",
        "description": "Path Traversal: Path traversal vulnerabilities are a result of interacting with the filesystem using untrusted input. This class of vulnerability may result in file disclosure, code execution, denial of service, and other issues. Read more about Path Traversal here: https://www.owasp.org/index.php/Path_Traversal",
        "cve": "lib/elixir_phoenix_web/controllers/page_controller.ex:24:traversal_in_send_file",
        "severity": "Unknown",
        "confidence": "High",
        "scanner": {
          "id": "sobelow",
          "name": "Sobelow"
        },
        "location": {
          "file": "lib/elixir_phoenix_web/controllers/page_controller.ex",
          "start_line": 24
        },
        "identifiers": [
          {
            "type": "sobelow_rule_id",
            "name": "Sobelow Rule ID traversal_in_send_file",
            "value": "traversal_in_send_file"
          }
        ]
      },
      {
        "id": ":SKIP:",
        "category": "sast",
        "name": "SQL injection",
        "description": "SQL Injection: SQL injection occurs when untrusted input is interpolated directly into a SQL query. In a typical Phoenix application, this would mean using the `Ecto.Adapters.SQL.query` method and not using the parameterization feature. Read more about SQL injection here: https://www.owasp.org/index.php/SQL_Injection",
        "cve": "lib/elixir_phoenix_web/controllers/page_controller.ex:29:sql_injection",
        "severity": "Unknown",
        "confidence": "High",
        "scanner": {
          "id": "sobelow",
          "name": "Sobelow"
        },
        "location": {
          "file": "lib/elixir_phoenix_web/controllers/page_controller.ex",
          "start_line": 29
        },
        "identifiers": [
          {
            "type": "sobelow_rule_id",
            "name": "Sobelow Rule ID sql_injection",
            "value": "sql_injection"
          }
        ]
      },
      {
        "id": ":SKIP:",
        "category": "sast",
        "name": "SQL injection",
        "description": "SQL Injection: SQL injection occurs when untrusted input is interpolated directly into a SQL query. In a typical Phoenix application, this would mean using the `Ecto.Adapters.SQL.query` method and not using the parameterization feature. Read more about SQL injection here: https://www.owasp.org/index.php/SQL_Injection",
        "cve": "lib/elixir_phoenix_web/controllers/page_controller.ex:34:sql_injection",
        "severity": "Unknown",
        "confidence": "High",
        "scanner": {
          "id": "sobelow",
          "name": "Sobelow"
        },
        "location": {
          "file": "lib/elixir_phoenix_web/controllers/page_controller.ex",
          "start_line": 34
        },
        "identifiers": [
          {
            "type": "sobelow_rule_id",
            "name": "Sobelow Rule ID sql_injection",
            "value": "sql_injection"
          }
        ]
      },
      {
        "id": ":SKIP:",
        "category": "sast",
        "name": "Unsafe atom interpolation",
        "description": "Denial of Service via Unsafe Atom Interpolation: In Elixir, atoms are not garbage collected. As such, if user input is used to create atoms (as in :\"foo\\#{bar}\", or in `:erlang.binary_to_atom`), it may result in memory exhaustion. Prefer the `String.to_existing_atom` function for untrusted user input.",
        "cve": "lib/elixir_phoenix_web/controllers/page_controller.ex:39:dos_unsafe_atom_interpolation",
        "severity": "Unknown",
        "confidence": "High",
        "scanner": {
          "id": "sobelow",
          "name": "Sobelow"
        },
        "location": {
          "file": "lib/elixir_phoenix_web/controllers/page_controller.ex",
          "start_line": 39
        },
        "identifiers": [
          {
            "type": "sobelow_rule_id",
            "name": "Sobelow Rule ID dos_unsafe_atom_interpolation",
            "value": "dos_unsafe_atom_interpolation"
          }
        ]
      },
      {
        "id": ":SKIP:",
        "category": "sast",
        "name": "Command Injection in `System.cmd`",
        "description": "Command Injection: Command Injection vulnerabilities are a result of passing untrusted input to an operating system shell, and may result in complete system compromise. Read more about Command Injection here: https://www.owasp.org/index.php/Command_Injection",
        "cve": "lib/elixir_phoenix_web/controllers/page_controller.ex:44:ci_in_system_cmd",
        "severity": "Unknown",
        "confidence": "High",
        "scanner": {
          "id": "sobelow",
          "name": "Sobelow"
        },
        "location": {
          "file": "lib/elixir_phoenix_web/controllers/page_controller.ex",
          "start_line": 44
        },
        "identifiers": [
          {
            "type": "sobelow_rule_id",
            "name": "Sobelow Rule ID ci_in_system_cmd",
            "value": "ci_in_system_cmd"
          }
        ]
      },
      {
        "id": ":SKIP:",
        "category": "sast",
        "name": "Command Injection in `:os.cmd`",
        "description": "Command Injection: Command Injection vulnerabilities are a result of passing untrusted input to an operating system shell, and may result in complete system compromise. Read more about Command Injection here: https://www.owasp.org/index.php/Command_Injection",
        "cve": "lib/elixir_phoenix_web/controllers/page_controller.ex:49:ci_in_os_cmd",
        "severity": "Unknown",
        "confidence": "High",
        "scanner": {
          "id": "sobelow",
          "name": "Sobelow"
        },
        "location": {
          "file": "lib/elixir_phoenix_web/controllers/page_controller.ex",
          "start_line": 49
        },
        "identifiers": [
          {
            "type": "sobelow_rule_id",
            "name": "Sobelow Rule ID ci_in_os_cmd",
            "value": "ci_in_os_cmd"
          }
        ]
      },
      {
        "id": ":SKIP:",
        "category": "sast",
        "name": "Unsafe `List.to_atom`",
        "description": "Denial of Service via `List.to_atom`: In Elixir, atoms are not garbage collected. As such, if user input is passed to the `List.to_atom` function, it may result in memory exhaustion. Prefer the `List.to_existing_atom` function for untrusted user input.",
        "cve": "lib/elixir_phoenix_web/controllers/page_controller.ex:54:dos_unsafe_list_to_atom",
        "severity": "Unknown",
        "confidence": "High",
        "scanner": {
          "id": "sobelow",
          "name": "Sobelow"
        },
        "location": {
          "file": "lib/elixir_phoenix_web/controllers/page_controller.ex",
          "start_line": 54
        },
        "identifiers": [
          {
            "type": "sobelow_rule_id",
            "name": "Sobelow Rule ID dos_unsafe_list_to_atom",
            "value": "dos_unsafe_list_to_atom"
          }
        ]
      },
      {
        "id": ":SKIP:",
        "category": "sast",
        "name": "Unsafe `String.to_atom`",
        "description": "Denial of Service via `String.to_atom`: In Elixir, atoms are not garbage collected. As such, if user input is passed to the `String.to_atom` function, it may result in memory exhaustion. Prefer the `String.to_existing_atom` function for untrusted user input.",
        "cve": "lib/elixir_phoenix_web/controllers/page_controller.ex:59:dos_unsafe_string_to_atom",
        "severity": "Unknown",
        "confidence": "High",
        "scanner": {
          "id": "sobelow",
          "name": "Sobelow"
        },
        "location": {
          "file": "lib/elixir_phoenix_web/controllers/page_controller.ex",
          "start_line": 59
        },
        "identifiers": [
          {
            "type": "sobelow_rule_id",
            "name": "Sobelow Rule ID dos_unsafe_string_to_atom",
            "value": "dos_unsafe_string_to_atom"
          }
        ]
      },
      {
        "id": ":SKIP:",
        "category": "sast",
        "name": "Code Execution in `Code.eval_string`",
        "description": "Remote Code Execution: Remote Code Execution vulnerabilities are a result of untrusted user input being executed or interpreted by the system and may result in complete system compromise.",
        "cve": "lib/elixir_phoenix_web/controllers/page_controller.ex:64:rce_in_code_eval_string",
        "severity": "Unknown",
        "confidence": "High",
        "scanner": {
          "id": "sobelow",
          "name": "Sobelow"
        },
        "location": {
          "file": "lib/elixir_phoenix_web/controllers/page_controller.ex",
          "start_line": 64
        },
        "identifiers": [
          {
            "type": "sobelow_rule_id",
            "name": "Sobelow Rule ID rce_in_code_eval_string",
            "value": "rce_in_code_eval_string"
          }
        ]
      },
      {
        "id": ":SKIP:",
        "category": "sast",
        "name": "Code Execution in `Code.eval_file`",
        "description": "Remote Code Execution: Remote Code Execution vulnerabilities are a result of untrusted user input being executed or interpreted by the system and may result in complete system compromise.",
        "cve": "lib/elixir_phoenix_web/controllers/page_controller.ex:65:rce_in_code_eval_file",
        "severity": "Unknown",
        "confidence": "High",
        "scanner": {
          "id": "sobelow",
          "name": "Sobelow"
        },
        "location": {
          "file": "lib/elixir_phoenix_web/controllers/page_controller.ex",
          "start_line": 65
        },
        "identifiers": [
          {
            "type": "sobelow_rule_id",
            "name": "Sobelow Rule ID rce_in_code_eval_file",
            "value": "rce_in_code_eval_file"
          }
        ]
      },
      {
        "id": ":SKIP:",
        "category": "sast",
        "name": "Code Execution in `Code.eval_quoted`",
        "description": "Remote Code Execution: Remote Code Execution vulnerabilities are a result of untrusted user input being executed or interpreted by the system and may result in complete system compromise.",
        "cve": "lib/elixir_phoenix_web/controllers/page_controller.ex:66:rce_in_code_eval_quoted",
        "severity": "Unknown",
        "confidence": "High",
        "scanner": {
          "id": "sobelow",
          "name": "Sobelow"
        },
        "location": {
          "file": "lib/elixir_phoenix_web/controllers/page_controller.ex",
          "start_line": 66
        },
        "identifiers": [
          {
            "type": "sobelow_rule_id",
            "name": "Sobelow Rule ID rce_in_code_eval_quoted",
            "value": "rce_in_code_eval_quoted"
          }
        ]
      },
      {
        "id": ":SKIP:",
        "category": "sast",
        "name": "Code Execution in `EEx.eval_string`",
        "description": "Insecure EEx evaluation: If user input is passed to EEx eval functions, it may result in arbitrary code execution. The root cause of these issues is often directory traversal.",
        "cve": "lib/elixir_phoenix_web/controllers/page_controller.ex:71:rce_in_eex_eval_string",
        "severity": "Unknown",
        "confidence": "High",
        "scanner": {
          "id": "sobelow",
          "name": "Sobelow"
        },
        "location": {
          "file": "lib/elixir_phoenix_web/controllers/page_controller.ex",
          "start_line": 71
        },
        "identifiers": [
          {
            "type": "sobelow_rule_id",
            "name": "Sobelow Rule ID rce_in_eex_eval_string",
            "value": "rce_in_eex_eval_string"
          }
        ]
      },
      {
        "id": ":SKIP:",
        "category": "sast",
        "name": "Code Execution in `EEx.eval_file`",
        "description": "Insecure EEx evaluation: If user input is passed to EEx eval functions, it may result in arbitrary code execution. The root cause of these issues is often directory traversal.",
        "cve": "lib/elixir_phoenix_web/controllers/page_controller.ex:72:rce_in_eex_eval_file",
        "severity": "Unknown",
        "confidence": "High",
        "scanner": {
          "id": "sobelow",
          "name": "Sobelow"
        },
        "location": {
          "file": "lib/elixir_phoenix_web/controllers/page_controller.ex",
          "start_line": 72
        },
        "identifiers": [
          {
            "type": "sobelow_rule_id",
            "name": "Sobelow Rule ID rce_in_eex_eval_file",
            "value": "rce_in_eex_eval_file"
          }
        ]
      },
      {
        "id": ":SKIP:",
        "category": "sast",
        "name": "Directory Traversal in `File.read`",
        "description": "Path Traversal: Path traversal vulnerabilities are a result of interacting with the filesystem using untrusted input. This class of vulnerability may result in file disclosure, code execution, denial of service, and other issues. Read more about Path Traversal here: https://www.owasp.org/index.php/Path_Traversal",
        "cve": "lib/elixir_phoenix_web/controllers/page_controller.ex:78:traversal_in_file_module",
        "severity": "Unknown",
        "confidence": "High",
        "scanner": {
          "id": "sobelow",
          "name": "Sobelow"
        },
        "location": {
          "file": "lib/elixir_phoenix_web/controllers/page_controller.ex",
          "start_line": 78
        },
        "identifiers": [
          {
            "type": "sobelow_rule_id",
            "name": "Sobelow Rule ID traversal_in_file_module",
            "value": "traversal_in_file_module"
          }
        ]
      },
      {
        "id": ":SKIP:",
        "category": "sast",
        "name": "Directory Traversal in `File.read!`",
        "description": "Path Traversal: Path traversal vulnerabilities are a result of interacting with the filesystem using untrusted input. This class of vulnerability may result in file disclosure, code execution, denial of service, and other issues. Read more about Path Traversal here: https://www.owasp.org/index.php/Path_Traversal",
        "cve": "lib/elixir_phoenix_web/controllers/page_controller.ex:79:traversal_in_file_module",
        "severity": "Unknown",
        "confidence": "High",
        "scanner": {
          "id": "sobelow",
          "name": "Sobelow"
        },
        "location": {
          "file": "lib/elixir_phoenix_web/controllers/page_controller.ex",
          "start_line": 79
        },
        "identifiers": [
          {
            "type": "sobelow_rule_id",
            "name": "Sobelow Rule ID traversal_in_file_module",
            "value": "traversal_in_file_module"
          }
        ]
      },
      {
        "id": ":SKIP:",
        "category": "sast",
        "name": "Directory Traversal in `File.rm`",
        "description": "Path Traversal: Path traversal vulnerabilities are a result of interacting with the filesystem using untrusted input. This class of vulnerability may result in file disclosure, code execution, denial of service, and other issues. Read more about Path Traversal here: https://www.owasp.org/index.php/Path_Traversal",
        "cve": "lib/elixir_phoenix_web/controllers/page_controller.ex:80:traversal_in_file_module",
        "severity": "Unknown",
        "confidence": "High",
        "scanner": {
          "id": "sobelow",
          "name": "Sobelow"
        },
        "location": {
          "file": "lib/elixir_phoenix_web/controllers/page_controller.ex",
          "start_line": 80
        },
        "identifiers": [
          {
            "type": "sobelow_rule_id",
            "name": "Sobelow Rule ID traversal_in_file_module",
            "value": "traversal_in_file_module"
          }
        ]
      },
      {
        "id": ":SKIP:",
        "category": "sast",
        "name": "Directory Traversal in `File.rm!`",
        "description": "Path Traversal: Path traversal vulnerabilities are a result of interacting with the filesystem using untrusted input. This class of vulnerability may result in file disclosure, code execution, denial of service, and other issues. Read more about Path Traversal here: https://www.owasp.org/index.php/Path_Traversal",
        "cve": "lib/elixir_phoenix_web/controllers/page_controller.ex:81:traversal_in_file_module",
        "severity": "Unknown",
        "confidence": "High",
        "scanner": {
          "id": "sobelow",
          "name": "Sobelow"
        },
        "location": {
          "file": "lib/elixir_phoenix_web/controllers/page_controller.ex",
          "start_line": 81
        },
        "identifiers": [
          {
            "type": "sobelow_rule_id",
            "name": "Sobelow Rule ID traversal_in_file_module",
            "value": "traversal_in_file_module"
          }
        ]
      },
      {
        "id": ":SKIP:",
        "category": "sast",
        "name": "Directory Traversal in `File.rm_rf`",
        "description": "Path Traversal: Path traversal vulnerabilities are a result of interacting with the filesystem using untrusted input. This class of vulnerability may result in file disclosure, code execution, denial of service, and other issues. Read more about Path Traversal here: https://www.owasp.org/index.php/Path_Traversal",
        "cve": "lib/elixir_phoenix_web/controllers/page_controller.ex:82:traversal_in_file_module",
        "severity": "Unknown",
        "confidence": "High",
        "scanner": {
          "id": "sobelow",
          "name": "Sobelow"
        },
        "location": {
          "file": "lib/elixir_phoenix_web/controllers/page_controller.ex",
          "start_line": 82
        },
        "identifiers": [
          {
            "type": "sobelow_rule_id",
            "name": "Sobelow Rule ID traversal_in_file_module",
            "value": "traversal_in_file_module"
          }
        ]
      },
      {
        "id": ":SKIP:",
        "category": "sast",
        "name": "Directory Traversal in `File.write`",
        "description": "Path Traversal: Path traversal vulnerabilities are a result of interacting with the filesystem using untrusted input. This class of vulnerability may result in file disclosure, code execution, denial of service, and other issues. Read more about Path Traversal here: https://www.owasp.org/index.php/Path_Traversal",
        "cve": "lib/elixir_phoenix_web/controllers/page_controller.ex:83:traversal_in_file_module",
        "severity": "Unknown",
        "confidence": "High",
        "scanner": {
          "id": "sobelow",
          "name": "Sobelow"
        },
        "location": {
          "file": "lib/elixir_phoenix_web/controllers/page_controller.ex",
          "start_line": 83
        },
        "identifiers": [
          {
            "type": "sobelow_rule_id",
            "name": "Sobelow Rule ID traversal_in_file_module",
            "value": "traversal_in_file_module"
          }
        ]
      },
      {
        "id": ":SKIP:",
        "category": "sast",
        "name": "Directory Traversal in `File.write!`",
        "description": "Path Traversal: Path traversal vulnerabilities are a result of interacting with the filesystem using untrusted input. This class of vulnerability may result in file disclosure, code execution, denial of service, and other issues. Read more about Path Traversal here: https://www.owasp.org/index.php/Path_Traversal",
        "cve": "lib/elixir_phoenix_web/controllers/page_controller.ex:84:traversal_in_file_module",
        "severity": "Unknown",
        "confidence": "High",
        "scanner": {
          "id": "sobelow",
          "name": "Sobelow"
        },
        "location": {
          "file": "lib/elixir_phoenix_web/controllers/page_controller.ex",
          "start_line": 84
        },
        "identifiers": [
          {
            "type": "sobelow_rule_id",
            "name": "Sobelow Rule ID traversal_in_file_module",
            "value": "traversal_in_file_module"
          }
        ]
      },
      {
        "id": ":SKIP:",
        "category": "sast",
        "name": "Directory Traversal in `File.cp`",
        "description": "Path Traversal: Path traversal vulnerabilities are a result of interacting with the filesystem using untrusted input. This class of vulnerability may result in file disclosure, code execution, denial of service, and other issues. Read more about Path Traversal here: https://www.owasp.org/index.php/Path_Traversal",
        "cve": "lib/elixir_phoenix_web/controllers/page_controller.ex:85:traversal_in_file_module",
        "severity": "Unknown",
        "confidence": "High",
        "scanner": {
          "id": "sobelow",
          "name": "Sobelow"
        },
        "location": {
          "file": "lib/elixir_phoenix_web/controllers/page_controller.ex",
          "start_line": 85
        },
        "identifiers": [
          {
            "type": "sobelow_rule_id",
            "name": "Sobelow Rule ID traversal_in_file_module",
            "value": "traversal_in_file_module"
          }
        ]
      },
      {
        "id": ":SKIP:",
        "category": "sast",
        "name": "Directory Traversal in `File.cp!`",
        "description": "Path Traversal: Path traversal vulnerabilities are a result of interacting with the filesystem using untrusted input. This class of vulnerability may result in file disclosure, code execution, denial of service, and other issues. Read more about Path Traversal here: https://www.owasp.org/index.php/Path_Traversal",
        "cve": "lib/elixir_phoenix_web/controllers/page_controller.ex:86:traversal_in_file_module",
        "severity": "Unknown",
        "confidence": "High",
        "scanner": {
          "id": "sobelow",
          "name": "Sobelow"
        },
        "location": {
          "file": "lib/elixir_phoenix_web/controllers/page_controller.ex",
          "start_line": 86
        },
        "identifiers": [
          {
            "type": "sobelow_rule_id",
            "name": "Sobelow Rule ID traversal_in_file_module",
            "value": "traversal_in_file_module"
          }
        ]
      },
      {
        "id": ":SKIP:",
        "category": "sast",
        "name": "Directory Traversal in `File.cp_r`",
        "description": "Path Traversal: Path traversal vulnerabilities are a result of interacting with the filesystem using untrusted input. This class of vulnerability may result in file disclosure, code execution, denial of service, and other issues. Read more about Path Traversal here: https://www.owasp.org/index.php/Path_Traversal",
        "cve": "lib/elixir_phoenix_web/controllers/page_controller.ex:87:traversal_in_file_module",
        "severity": "Unknown",
        "confidence": "High",
        "scanner": {
          "id": "sobelow",
          "name": "Sobelow"
        },
        "location": {
          "file": "lib/elixir_phoenix_web/controllers/page_controller.ex",
          "start_line": 87
        },
        "identifiers": [
          {
            "type": "sobelow_rule_id",
            "name": "Sobelow Rule ID traversal_in_file_module",
            "value": "traversal_in_file_module"
          }
        ]
      },
      {
        "id": ":SKIP:",
        "category": "sast",
        "name": "Directory Traversal in `File.cp_r!`",
        "description": "Path Traversal: Path traversal vulnerabilities are a result of interacting with the filesystem using untrusted input. This class of vulnerability may result in file disclosure, code execution, denial of service, and other issues. Read more about Path Traversal here: https://www.owasp.org/index.php/Path_Traversal",
        "cve": "lib/elixir_phoenix_web/controllers/page_controller.ex:88:traversal_in_file_module",
        "severity": "Unknown",
        "confidence": "High",
        "scanner": {
          "id": "sobelow",
          "name": "Sobelow"
        },
        "location": {
          "file": "lib/elixir_phoenix_web/controllers/page_controller.ex",
          "start_line": 88
        },
        "identifiers": [
          {
            "type": "sobelow_rule_id",
            "name": "Sobelow Rule ID traversal_in_file_module",
            "value": "traversal_in_file_module"
          }
        ]
      },
      {
        "id": ":SKIP:",
        "category": "sast",
        "name": "Directory Traversal in `File.ln`",
        "description": "Path Traversal: Path traversal vulnerabilities are a result of interacting with the filesystem using untrusted input. This class of vulnerability may result in file disclosure, code execution, denial of service, and other issues. Read more about Path Traversal here: https://www.owasp.org/index.php/Path_Traversal",
        "cve": "lib/elixir_phoenix_web/controllers/page_controller.ex:89:traversal_in_file_module",
        "severity": "Unknown",
        "confidence": "High",
        "scanner": {
          "id": "sobelow",
          "name": "Sobelow"
        },
        "location": {
          "file": "lib/elixir_phoenix_web/controllers/page_controller.ex",
          "start_line": 89
        },
        "identifiers": [
          {
            "type": "sobelow_rule_id",
            "name": "Sobelow Rule ID traversal_in_file_module",
            "value": "traversal_in_file_module"
          }
        ]
      },
      {
        "id": ":SKIP:",
        "category": "sast",
        "name": "Directory Traversal in `File.ln!`",
        "description": "Path Traversal: Path traversal vulnerabilities are a result of interacting with the filesystem using untrusted input. This class of vulnerability may result in file disclosure, code execution, denial of service, and other issues. Read more about Path Traversal here: https://www.owasp.org/index.php/Path_Traversal",
        "cve": "lib/elixir_phoenix_web/controllers/page_controller.ex:90:traversal_in_file_module",
        "severity": "Unknown",
        "confidence": "High",
        "scanner": {
          "id": "sobelow",
          "name": "Sobelow"
        },
        "location": {
          "file": "lib/elixir_phoenix_web/controllers/page_controller.ex",
          "start_line": 90
        },
        "identifiers": [
          {
            "type": "sobelow_rule_id",
            "name": "Sobelow Rule ID traversal_in_file_module",
            "value": "traversal_in_file_module"
          }
        ]
      },
      {
        "id": ":SKIP:",
        "category": "sast",
        "name": "Directory Traversal in `File.ln_s`",
        "description": "Path Traversal: Path traversal vulnerabilities are a result of interacting with the filesystem using untrusted input. This class of vulnerability may result in file disclosure, code execution, denial of service, and other issues. Read more about Path Traversal here: https://www.owasp.org/index.php/Path_Traversal",
        "cve": "lib/elixir_phoenix_web/controllers/page_controller.ex:91:traversal_in_file_module",
        "severity": "Unknown",
        "confidence": "High",
        "scanner": {
          "id": "sobelow",
          "name": "Sobelow"
        },
        "location": {
          "file": "lib/elixir_phoenix_web/controllers/page_controller.ex",
          "start_line": 91
        },
        "identifiers": [
          {
            "type": "sobelow_rule_id",
            "name": "Sobelow Rule ID traversal_in_file_module",
            "value": "traversal_in_file_module"
          }
        ]
      },
      {
        "id": ":SKIP:",
        "category": "sast",
        "name": "Directory Traversal in `File.ln_s!`",
        "description": "Path Traversal: Path traversal vulnerabilities are a result of interacting with the filesystem using untrusted input. This class of vulnerability may result in file disclosure, code execution, denial of service, and other issues. Read more about Path Traversal here: https://www.owasp.org/index.php/Path_Traversal",
        "cve": "lib/elixir_phoenix_web/controllers/page_controller.ex:92:traversal_in_file_module",
        "severity": "Unknown",
        "confidence": "High",
        "scanner": {
          "id": "sobelow",
          "name": "Sobelow"
        },
        "location": {
          "file": "lib/elixir_phoenix_web/controllers/page_controller.ex",
          "start_line": 92
        },
        "identifiers": [
          {
            "type": "sobelow_rule_id",
            "name": "Sobelow Rule ID traversal_in_file_module",
            "value": "traversal_in_file_module"
          }
        ]
      },
      {
        "id": ":SKIP:",
        "category": "sast",
        "name": "Directory Traversal in `send_download`",
        "description": "Path Traversal: Path traversal vulnerabilities are a result of interacting with the filesystem using untrusted input. This class of vulnerability may result in file disclosure, code execution, denial of service, and other issues. Read more about Path Traversal here: https://www.owasp.org/index.php/Path_Traversal",
        "cve": "lib/elixir_phoenix_web/controllers/page_controller.ex:97:traversal_in_send_download",
        "severity": "Unknown",
        "confidence": "High",
        "scanner": {
          "id": "sobelow",
          "name": "Sobelow"
        },
        "location": {
          "file": "lib/elixir_phoenix_web/controllers/page_controller.ex",
          "start_line": 97
        },
        "identifiers": [
          {
            "type": "sobelow_rule_id",
            "name": "Sobelow Rule ID traversal_in_send_download",
            "value": "traversal_in_send_download"
          }
        ]
      },
      {
        "id": ":SKIP:",
        "category": "sast",
        "name": "XSS in `put_resp_content_type`",
        "description": "Cross-Site Scripting: Cross-Site Scripting (XSS) vulnerabilities are a result of rendering untrusted input on a page without proper encoding. XSS may allow an attacker to perform actions on behalf of other users, steal session tokens, or access private data. Read more about XSS here: https://www.owasp.org/index.php/Cross-site_Scripting_(XSS)",
        "cve": "lib/elixir_phoenix_web/controllers/xss_controller.ex:12:xss_in_put_resp_content_type",
        "severity": "Unknown",
        "confidence": "High",
        "scanner": {
          "id": "sobelow",
          "name": "Sobelow"
        },
        "location": {
          "file": "lib/elixir_phoenix_web/controllers/xss_controller.ex",
          "start_line": 12
        },
        "identifiers": [
          {
            "type": "sobelow_rule_id",
            "name": "Sobelow Rule ID xss_in_put_resp_content_type",
            "value": "xss_in_put_resp_content_type"
          }
        ]
      },
      {
        "id": ":SKIP:",
        "category": "sast",
        "name": "XSS in `html`",
        "description": "Cross-Site Scripting: Cross-Site Scripting (XSS) vulnerabilities are a result of rendering untrusted input on a page without proper encoding. XSS may allow an attacker to perform actions on behalf of other users, steal session tokens, or access private data. Read more about XSS here: https://www.owasp.org/index.php/Cross-site_Scripting_(XSS)",
        "cve": "lib/elixir_phoenix_web/controllers/xss_controller.ex:18:xss_in_html",
        "severity": "Unknown",
        "confidence": "High",
        "scanner": {
          "id": "sobelow",
          "name": "Sobelow"
        },
        "location": {
          "file": "lib/elixir_phoenix_web/controllers/xss_controller.ex",
          "start_line": 18
        },
        "identifiers": [
          {
            "type": "sobelow_rule_id",
            "name": "Sobelow Rule ID xss_in_html",
            "value": "xss_in_html"
          }
        ]
      },
      {
        "id": ":SKIP:",
        "category": "sast",
        "name": "XSS in `send_resp`",
        "description": "Cross-Site Scripting: Cross-Site Scripting (XSS) vulnerabilities are a result of rendering untrusted input on a page without proper encoding. XSS may allow an attacker to perform actions on behalf of other users, steal session tokens, or access private data. Read more about XSS here: https://www.owasp.org/index.php/Cross-site_Scripting_(XSS)",
        "cve": "lib/elixir_phoenix_web/controllers/xss_controller.ex:23:xss",
        "severity": "Unknown",
        "confidence": "High",
        "scanner": {
          "id": "sobelow",
          "name": "Sobelow"
        },
        "location": {
          "file": "lib/elixir_phoenix_web/controllers/xss_controller.ex",
          "start_line": 23
        },
        "identifiers": [
          {
            "type": "sobelow_rule_id",
            "name": "Sobelow Rule ID xss",
            "value": "xss"
          }
        ]
      },
      {
        "id": ":SKIP:",
        "category": "sast",
        "name": "XSS in `put_resp_content_type`",
        "description": "Cross-Site Scripting: Cross-Site Scripting (XSS) vulnerabilities are a result of rendering untrusted input on a page without proper encoding. XSS may allow an attacker to perform actions on behalf of other users, steal session tokens, or access private data. Read more about XSS here: https://www.owasp.org/index.php/Cross-site_Scripting_(XSS)",
        "cve": "lib/elixir_phoenix_web/controllers/xss_controller.ex:6:xss_in_put_resp_content_type",
        "severity": "Unknown",
        "confidence": "Medium",
        "scanner": {
          "id": "sobelow",
          "name": "Sobelow"
        },
        "location": {
          "file": "lib/elixir_phoenix_web/controllers/xss_controller.ex",
          "start_line": 6
        },
        "identifiers": [
          {
            "type": "sobelow_rule_id",
            "name": "Sobelow Rule ID xss_in_put_resp_content_type",
            "value": "xss_in_put_resp_content_type"
          }
        ]
      },
      {
        "id": ":SKIP:",
        "category": "sast",
        "name": "Cross-Site Websocket Hijacking",
        "description": "Cross-Site Websocket Hijacking: Websocket connections are not bound by the same-origin policy. Connections that do not validate the origin may leak information to an attacker. More information can be found here: https://www.christian-schneider.net/CrossSiteWebSocketHijacking.html",
        "cve": "lib/elixir_phoenix_web/endpoint.ex:9:config_cross_site_websocket_hijacking",
        "severity": "Unknown",
        "confidence": "High",
        "scanner": {
          "id": "sobelow",
          "name": "Sobelow"
        },
        "location": {
          "file": "lib/elixir_phoenix_web/endpoint.ex",
          "start_line": 9
        },
        "identifiers": [
          {
            "type": "sobelow_rule_id",
            "name": "Sobelow Rule ID config_cross_site_websocket_hijacking",
            "value": "config_cross_site_websocket_hijacking"
          }
        ]
      },
      {
        "id": ":SKIP:",
        "category": "sast",
        "name": "Missing Content-Security-Policy",
        "description": "Missing Content-Security-Policy: Content-Security-Policy is an HTTP header that helps mitigate a number of attacks, including Cross-Site Scripting. Read more about CSP here: https://developer.mozilla.org/en-US/docs/Web/HTTP/CSP. Missing Content-Security-Policy is flagged by `sobelow` when a pipeline implements the `:put_secure_browser_headers` plug, but does not provide a Content-Security-Policy header in the custom headers map. Documentation on the `put_secure_browser_headers` plug function can be found here: https://hexdocs.pm/phoenix/Phoenix.Controller.html#put_secure_browser_headers/2",
        "cve": "lib/elixir_phoenix_web/router.ex:19:config_missing_content_security_policy",
        "severity": "Unknown",
        "confidence": "High",
        "scanner": {
          "id": "sobelow",
          "name": "Sobelow"
        },
        "location": {
          "file": "lib/elixir_phoenix_web/router.ex",
          "start_line": 19
        },
        "identifiers": [
          {
            "type": "sobelow_rule_id",
            "name": "Sobelow Rule ID config_missing_content_security_policy",
            "value": "config_missing_content_security_policy"
          }
        ]
      },
      {
        "id": ":SKIP:",
        "category": "sast",
        "name": "CSRF via Action Reuse",
        "description": "Cross-Site Request Forgery: In a Cross-Site Request Forgery (CSRF) attack, an untrusted application can cause a user's browser to submit requests or perform actions on the user's behalf. Read more about CSRF here: https://www.owasp.org/index.php/Cross-Site_Request_Forgery_(CSRF). This type of CSRF is flagged by `sobelow` when state-changing routes share an action with GET-based routes. For example: `get \"/users\", UserController, :new` and ` post \"/users\", UserController, :new`. In this instance, it may be possible to trigger the POST functionality with a GET request and query parameters.",
        "cve": "lib/elixir_phoenix_web/router.ex:40:config_csrf_via_action_reuse",
        "severity": "Unknown",
        "confidence": "High",
        "scanner": {
          "id": "sobelow",
          "name": "Sobelow"
        },
        "location": {
          "file": "lib/elixir_phoenix_web/router.ex",
          "start_line": 40
        },
        "identifiers": [
          {
            "type": "sobelow_rule_id",
            "name": "Sobelow Rule ID config_csrf_via_action_reuse",
            "value": "config_csrf_via_action_reuse"
          }
        ]
      },
      {
        "id": ":SKIP:",
        "category": "sast",
        "name": "Missing CSRF Protections",
        "description": "Cross-Site Request Forgery: In a Cross-Site Request Forgery (CSRF) attack, an untrusted application can cause a user's browser to submit requests or perform actions on the user's behalf. Read more about CSRF here: https://www.owasp.org/index.php/Cross-Site_Request_Forgery_(CSRF). Cross-Site Request Forgery is flagged by `sobelow` when a pipeline fetches a session, but does not implement the `:protect_from_forgery` plug.",
        "cve": "lib/elixir_phoenix_web/router.ex:4:config_missing_csrf_protections",
        "severity": "Unknown",
        "confidence": "High",
        "scanner": {
          "id": "sobelow",
          "name": "Sobelow"
        },
        "location": {
          "file": "lib/elixir_phoenix_web/router.ex",
          "start_line": 4
        },
        "identifiers": [
          {
            "type": "sobelow_rule_id",
            "name": "Sobelow Rule ID config_missing_csrf_protections",
            "value": "config_missing_csrf_protections"
          }
        ]
      },
      {
        "id": ":SKIP:",
        "category": "sast",
        "name": "Missing Secure Browser Headers",
        "description": "Missing Secure HTTP Headers: By default, Phoenix HTTP responses contain a number of secure HTTP headers that attempt to mitigate XSS, click-jacking, and content-sniffing attacks. Missing Secure HTTP Headers is flagged by `sobelow` when a pipeline accepts \"html\" requests, but does not implement the `:put_secure_browser_headers` plug.",
        "cve": "lib/elixir_phoenix_web/router.ex:53:config_missing_secure_browser_headers",
        "severity": "Unknown",
        "confidence": "High",
        "scanner": {
          "id": "sobelow",
          "name": "Sobelow"
        },
        "location": {
          "file": "lib/elixir_phoenix_web/router.ex",
          "start_line": 53
        },
        "identifiers": [
          {
            "type": "sobelow_rule_id",
            "name": "Sobelow Rule ID config_missing_secure_browser_headers",
            "value": "config_missing_secure_browser_headers"
          }
        ]
      },
      {
        "id": ":SKIP:",
        "category": "sast",
        "name": "XSS",
        "description": "Cross-Site Scripting: Cross-Site Scripting (XSS) vulnerabilities are a result of rendering untrusted input on a page without proper encoding. XSS may allow an attacker to perform actions on behalf of other users, steal session tokens, or access private data. Read more about XSS here: https://www.owasp.org/index.php/Cross-site_Scripting_(XSS)",
        "cve": "lib/elixir_phoenix_web/templates/page/index.html.eex:8:xss",
        "severity": "Unknown",
        "confidence": "Low",
        "scanner": {
          "id": "sobelow",
          "name": "Sobelow"
        },
        "location": {
          "file": "lib/elixir_phoenix_web/templates/page/index.html.eex",
          "start_line": 8
        },
        "identifiers": [
          {
            "type": "sobelow_rule_id",
            "name": "Sobelow Rule ID xss",
            "value": "xss"
          }
        ]
      }
    ],
    "scan": {
      "analyzer": {
        "id": "sobelow",
        "name": "Sobelow",
        "url": "https://gitlab.com/gitlab-org/security-products/analyzers/sobelow",
        "vendor": {
          "name": "GitLab"
        },
        "version": ":SKIP:"
      },
      "scanner": {
        "id": "sobelow",
        "name": "Sobelow",
        "url": "https://github.com/nccgroup/sobelow",
        "vendor": {
          "name": "GitLab"
        },
        "version": ":SKIP:"
      },
      "type": "sast",
      "start_time": ":SKIP:",
      "end_time": ":SKIP:",
      "status": "success"
    }
  }
  