{
  "version": "15.1.4",
  "vulnerabilities": [
    {
      "id": ":SKIP:",
      "category": "sast",
      "name": "Exposure of Sensitive Information to an Unauthorized Actor",
      "description": "Function bar detected\n",
      "cve": "semgrep_id:bar:9:9",
      "severity": "Critical",
      "scanner": {
        "id": "semgrep",
        "name": "Semgrep"
      },
      "location": {
        "file": "foo.go",
        "start_line": 9
      },
      "identifiers": [
        {
          "type": "semgrep_id",
          "name": "bar",
          "value": "bar"
        },
        {
          "type": "cwe",
          "name": "CWE-200",
          "value": "200",
          "url": "https://cwe.mitre.org/data/definitions/200.html"
        }
      ],
      "tracking": {
        "type": "source",
        "items": [
          {
            "file": "foo.go",
            "line_start": 9,
            "line_end": 9,
            "signatures": [
              {
                "algorithm": "scope_offset",
                "value": "foo.go|bar[0]:0"
              }
            ]
          }
        ]
      }
    },
    {
      "id": ":SKIP:",
      "category": "sast",
      "name": "Exposure of Sensitive Information to an Unauthorized Actor",
      "description": "Function baz detected\n",
      "cve": "semgrep_id:baz:7:7",
      "severity": "Critical",
      "scanner": {
        "id": "semgrep",
        "name": "Semgrep"
      },
      "location": {
        "file": "foo.go",
        "start_line": 7
      },
      "identifiers": [
        {
          "type": "semgrep_id",
          "name": "baz",
          "value": "baz"
        },
        {
          "type": "cwe",
          "name": "CWE-200",
          "value": "200",
          "url": "https://cwe.mitre.org/data/definitions/200.html"
        }
      ],
      "tracking": {
        "type": "source",
        "items": [
          {
            "file": "foo.go",
            "line_start": 7,
            "line_end": 7,
            "signatures": [
              {
                "algorithm": "scope_offset",
                "value": "foo.go|baz[0]:0"
              }
            ]
          }
        ]
      }
    },
    {
      "id": ":SKIP:",
      "category": "sast",
      "name": "Exposure of Sensitive Information to an Unauthorized Actor",
      "description": "Function foo detected\n",
      "cve": "semgrep_id:foo:11:18",
      "severity": "Critical",
      "scanner": {
        "id": "semgrep",
        "name": "Semgrep"
      },
      "location": {
        "file": "foo.go",
        "start_line": 11,
        "end_line": 18
      },
      "identifiers": [
        {
          "type": "semgrep_id",
          "name": "foo",
          "value": "foo"
        },
        {
          "type": "cwe",
          "name": "CWE-200",
          "value": "200",
          "url": "https://cwe.mitre.org/data/definitions/200.html"
        }
      ],
      "tracking": {
        "type": "source",
        "items": [
          {
            "file": "foo.go",
            "line_start": 11,
            "line_end": 11,
            "signatures": [
              {
                "algorithm": "scope_offset",
                "value": "foo.go|foo[0]:0"
              }
            ]
          }
        ]
      }
    },
    {
      "id": ":SKIP:",
      "category": "sast",
      "name": "Exposure of Sensitive Information to an Unauthorized Actor",
      "description": "Function bar detected\n",
      "cve": "semgrep_id:gitlab.bar:9:9",
      "severity": "Critical",
      "scanner": {
        "id": "semgrep",
        "name": "Semgrep"
      },
      "location": {
        "file": "foo.go",
        "start_line": 9
      },
      "identifiers": [
        {
          "type": "semgrep_id",
          "name": "gitlab.bar",
          "value": "gitlab.bar",
          "url": "https://semgrep.dev/r/gitlab.bar"
        },
        {
          "type": "cwe",
          "name": "CWE-200",
          "value": "200",
          "url": "https://cwe.mitre.org/data/definitions/200.html"
        }
      ],
      "tracking": {
        "type": "source",
        "items": [
          {
            "file": "foo.go",
            "line_start": 9,
            "line_end": 9,
            "signatures": [
              {
                "algorithm": "scope_offset",
                "value": "foo.go|bar[0]:0"
              }
            ]
          }
        ]
      }
    },
    {
      "id": ":SKIP:",
      "category": "sast",
      "name": "Semgrep Finding: return-nil-err",
      "description": "return nil err instead of nil value",
      "cve": "semgrep_id:return-nil-err:14:16",
      "severity": "Critical",
      "scanner": {
        "id": "semgrep",
        "name": "Semgrep"
      },
      "location": {
        "file": "foo.go",
        "start_line": 14,
        "end_line": 16
      },
      "identifiers": [
        {
          "type": "semgrep_id",
          "name": "return-nil-err",
          "value": "return-nil-err"
        }
      ],
      "tracking": {
        "type": "source",
        "items": [
          {
            "file": "foo.go",
            "line_start": 14,
            "line_end": 14,
            "signatures": [
              {
                "algorithm": "scope_offset",
                "value": "foo.go|foo[0]:3"
              }
            ]
          }
        ]
      }
    },
    {
      "id": ":SKIP:",
      "category": "sast",
      "name": "Semgrep Finding: return-nil",
      "description": "return nil instead of nil value",
      "cve": "semgrep_id:return-nil:14:16",
      "severity": "Critical",
      "scanner": {
        "id": "semgrep",
        "name": "Semgrep"
      },
      "location": {
        "file": "foo.go",
        "start_line": 14,
        "end_line": 16
      },
      "identifiers": [
        {
          "type": "semgrep_id",
          "name": "return-nil",
          "value": "return-nil"
        }
      ],
      "tracking": {
        "type": "source",
        "items": [
          {
            "file": "foo.go",
            "line_start": 14,
            "line_end": 14,
            "signatures": [
              {
                "algorithm": "scope_offset",
                "value": "foo.go|foo[0]:3"
              }
            ]
          }
        ]
      }
    },
    {
      "id": ":SKIP:",
      "category": "sast",
      "name": "Key Exchange without Entity Authentication",
      "description": "Audit the use of ssh.InsecureIgnoreHostKey\n",
      "cve": "semgrep_id:gitlab.gosec.G106-1:13:13",
      "severity": "Medium",
      "scanner": {
        "id": "semgrep",
        "name": "Semgrep"
      },
      "location": {
        "file": "foo.go",
        "start_line": 13
      },
      "identifiers": [
        {
          "type": "semgrep_id",
          "name": "gitlab.gosec.G106-1",
          "value": "gitlab.gosec.G106-1",
          "url": "https://semgrep.dev/r/gitlab.gosec.G106-1"
        },
        {
          "type": "cwe",
          "name": "CWE-322",
          "value": "322",
          "url": "https://cwe.mitre.org/data/definitions/322.html"
        }
      ],
      "tracking": {
        "type": "source",
        "items": [
          {
            "file": "foo.go",
            "line_start": 13,
            "line_end": 13,
            "signatures": [
              {
                "algorithm": "scope_offset",
                "value": "foo.go|foo[0]:2"
              }
            ]
          }
        ]
      }
    }
  ],
  "dependency_files": null,
  "scan": {
    "analyzer": {
      "id": "semgrep",
      "name": "Semgrep",
      "url": "https://gitlab.com/gitlab-org/security-products/analyzers/semgrep",
      "vendor": {
        "name": "GitLab"
      },
      "version": ":SKIP:"
    },
    "scanner": {
      "id": "semgrep",
      "name": "Semgrep",
      "url": "https://github.com/returntocorp/semgrep",
      "vendor": {
        "name": "GitLab"
      },
      "version": ":SKIP:"
    },
    "type": "sast",
    "start_time": ":SKIP:",
    "end_time": ":SKIP:",
    "status": "success"
  }
}
