{
  "version": "15.1.4",
  "vulnerabilities": [
    {
      "id": ":SKIP:",
      "category": "sast",
      "name": "Exposure of sensitive system information to an unauthorized control sphere",
      "description": "Spring Boot Actuator is fully enabled. This exposes sensitive endpoints\nsuch as /actuator/env, /actuator/logfile, /actuator/heapdump and others.\nIf the application lacks proper security measures (e.g., authentication and \nauthorization), sensitive data could be accessed, compromising the application and \nits infrastructure. This configuration poses a serious risk in production \nenvironments or public-facing deployments.\n\nTo mitigate the risks, take the following measures:\n  - Expose only the Actuator endpoints required for your use case\n  - For production environments, restrict exposure to non-sensitive endpoints \n  like `health` or `info`\n  - Ensure Actuator endpoints are protected with authentication and authorization \n  (e.g., via Spring Security)\n  - Use environment-specific configurations to limit exposure in production\n\nSecure Code Example:\nInstead of include: \"*\", list only the endpoints you need to expose:\n```\nmanagement.endpoints.web.exposure.include=\"health,info,metrics\"\n```\n\nReferences:\n- https://docs.spring.io/spring-boot/reference/actuator/endpoints.html#actuator.endpoints.exposing\n- https://medium.com/walmartglobaltech/perils-of-spring-boot-actuators-misconfiguration-185c43a0f785\n- https://blog.maass.xyz/spring-actuator-security-part-1-stealing-secrets-using-spring-actuators\n",
      "cve": "semgrep_id:properties_spring_rule-SpringActuatorFullyEnabled:3:3",
      "severity": "Medium",
      "scanner": {
        "id": "semgrep",
        "name": "Semgrep"
      },
      "location": {
        "file": "actuator.properties",
        "start_line": 3
      },
      "identifiers": [
        {
          "type": "semgrep_id",
          "name": "properties_spring_rule-SpringActuatorFullyEnabled",
          "value": "properties_spring_rule-SpringActuatorFullyEnabled"
        },
        {
          "type": "cwe",
          "name": "CWE-497",
          "value": "497",
          "url": "https://cwe.mitre.org/data/definitions/497.html"
        },
        {
          "type": "owasp",
          "name": "A01:2021 - Broken Access Control",
          "value": "A01:2021"
        },
        {
          "type": "owasp",
          "name": "A3:2017 - Sensitive Data Exposure",
          "value": "A3:2017"
        }
      ]
    }
  ],
  "scan": {
    "analyzer": {
      "id": "semgrep",
      "name": "Semgrep",
      "url": "https://gitlab.com/gitlab-org/security-products/analyzers/semgrep",
      "vendor": {
        "name": "GitLab"
      },
      "version": ":SKIP:"
    },
    "scanner": {
      "id": "semgrep",
      "name": "Semgrep",
      "url": "https://github.com/returntocorp/semgrep",
      "vendor": {
        "name": "GitLab"
      },
      "version": ":SKIP:"
    },
    "type": "sast",
    "start_time": ":SKIP:",
    "end_time": ":SKIP:",
    "status": "success"
  }
}
