module gitlab.com/gitlab-org/security-products/analyzers/semgrep/v5

go 1.23.0

toolchain go1.23.1

require (
	github.com/sirupsen/logrus v1.9.3
	github.com/stretchr/testify v1.10.0
	github.com/urfave/cli/v2 v2.27.5
	gitlab.com/gitlab-org/security-products/analyzers/command/v3 v3.1.0
	gitlab.com/gitlab-org/security-products/analyzers/common/v3 v3.4.0
	gitlab.com/gitlab-org/security-products/analyzers/report/v5 v5.7.0
	gitlab.com/gitlab-org/security-products/analyzers/ruleset/v3 v3.3.1
	gopkg.in/yaml.v2 v2.4.0
)

require (
	dario.cat/mergo v1.0.0 // indirect
	github.com/Microsoft/go-winio v0.6.1 // indirect
	github.com/ProtonMail/go-crypto v1.1.5 // indirect
	github.com/bmatcuk/doublestar v1.3.4 // indirect
	github.com/cloudflare/circl v1.6.0 // indirect
	github.com/cpuguy83/go-md2man/v2 v2.0.5 // indirect
	github.com/cyphar/filepath-securejoin v0.3.6 // indirect
	github.com/davecgh/go-spew v1.1.1 // indirect
	github.com/emirpasic/gods v1.18.1 // indirect
	github.com/go-git/gcfg v1.5.1-0.20230307220236-3a3c6141e376 // indirect
	github.com/go-git/go-billy/v5 v5.6.2 // indirect
	github.com/go-git/go-git/v5 v5.13.2 // indirect
	github.com/golang/groupcache v0.0.0-20210331224755-41bb18bfe9da // indirect
	github.com/jbenet/go-context v0.0.0-20150711004518-d14ea06fba99 // indirect
	github.com/kevinburke/ssh_config v1.2.0 // indirect
	github.com/otiai10/copy v1.11.0 // indirect
	github.com/pelletier/go-toml v1.9.5 // indirect
	github.com/pjbgf/sha1cd v0.3.2 // indirect
	github.com/pmezard/go-difflib v1.0.0 // indirect
	github.com/russross/blackfriday/v2 v2.1.0 // indirect
	github.com/sergi/go-diff v1.3.2-0.20230802210424-5b0b94c5c0d3 // indirect
	github.com/skeema/knownhosts v1.3.0 // indirect
	github.com/xanzy/ssh-agent v0.3.3 // indirect
	github.com/xrash/smetrics v0.0.0-20240521201337-686a1a2994c1 // indirect
	golang.org/x/crypto v0.34.0 // indirect
	golang.org/x/mod v0.17.0 // indirect
	golang.org/x/net v0.35.0 // indirect
	golang.org/x/sync v0.10.0 // indirect
	golang.org/x/sys v0.30.0 // indirect
	golang.org/x/tools v0.21.1-0.20240508182429-e35e4ccd0d2d // indirect
	gopkg.in/warnings.v0 v0.1.2 // indirect
	gopkg.in/yaml.v3 v3.0.1 // indirect
)
