{
  "version": "15.1.4",
  "vulnerabilities": [
    {
      "id": ":SKIP:",
      "category": "sast",
      "name": "Use of cryptographically weak Pseudo-Random Number Generator (PRNG)",
      "description": "Depending on the context, generating weak random numbers may expose cryptographic functions\nwhich rely on these numbers to be exploitable. When generating numbers for sensitive values\nsuch as tokens, nonces, and cryptographic keys, it is recommended that the\n`RandomNumberGenerator` class be used.\n\nExample `RandomNumberGenerator` usage:\n```\nInt32 randInt = RandomNumberGenerator.GetInt32(32000);\nbyte[] randomBytes = new byte[64];\nRandomNumberGenerator.Fill(randomBytes);\nConsole.WriteLine(\"Random Int32: {0}\", randInt);\nConsole.WriteLine(\"Random Bytes: {0}\", BitConverter.ToString(randomBytes).Replace(\"-\", \"\"));\n```\n\nFor more information see:\nhttps://learn.microsoft.com/en-us/dotnet/api/system.security.cryptography.randomnumbergenerator\n",
      "cve": "semgrep_id:security_code_scan.SCS0005-1:15:15",
      "severity": "Medium",
      "scanner": {
        "id": "semgrep",
        "name": "Semgrep"
      },
      "location": {
        "file": "ServiceB/Random.cs",
        "start_line": 15
      },
      "identifiers": [
        {
          "type": "semgrep_id",
          "name": "security_code_scan.SCS0005-1",
          "value": "security_code_scan.SCS0005-1"
        },
        {
          "type": "cwe",
          "name": "CWE-338",
          "value": "338",
          "url": "https://cwe.mitre.org/data/definitions/338.html"
        },
        {
          "type": "owasp",
          "name": "A02:2021 - Cryptographic Failures",
          "value": "A02:2021"
        },
        {
          "type": "owasp",
          "name": "A3:2017 - Sensitive Data Exposure",
          "value": "A3:2017"
        },
        {
          "type": "security_code_scan_rule_id",
          "name": "SCS0005",
          "value": "SCS0005"
        }
      ],
      "tracking": {
        "type": "source",
        "items": [
          {
            "file": "ServiceB/Random.cs",
            "line_start": 15,
            "line_end": 15,
            "signatures": [
              {
                "algorithm": "scope_offset",
                "value": "ServiceB/Random.cs|ServiceB[0]|GetRandom[0]|RandomNumber[0]:4"
              }
            ]
          }
        ]
      }
    }
  ],
  "dependency_files": null,
  "scan": {
    "analyzer": {
      "id": "semgrep",
      "name": "Semgrep",
      "url": "https://gitlab.com/gitlab-org/security-products/analyzers/semgrep",
      "vendor": {
        "name": "GitLab"
      },
      "version": ":SKIP:"
    },
    "scanner": {
      "id": "semgrep",
      "name": "Semgrep",
      "url": "https://github.com/returntocorp/semgrep",
      "vendor": {
        "name": "GitLab"
      },
      "version": ":SKIP:"
    },
    "type": "sast",
    "start_time": ":SKIP:",
    "end_time": ":SKIP:",
    "status": "success"
  }
}
