{
  "version": "15.1.4",
  "vulnerabilities": [
    {
      "id": ":SKIP:",
      "category": "sast",
      "name": "Deserialization of Untrusted Data",
      "description": "Avoid using `load()`. `PyYAML.load` can create arbitrary Python objects. A malicious actor could\nexploit this to run arbitrarycode. Use `safe\\_load()` instead. It is recommended to use\n`SafeLoader`\nwhen loading yaml.\n",
      "cve": "semgrep_id:bandit.B506:329:329",
      "severity": "Critical",
      "scanner": {
        "id": "semgrep",
        "name": "Semgrep"
      },
      "location": {
        "file": "app/app.py",
        "start_line": 329
      },
      "identifiers": [
        {
          "type": "semgrep_id",
          "name": "bandit.B506",
          "value": "bandit.B506"
        },
        {
          "type": "cwe",
          "name": "CWE-502",
          "value": "502",
          "url": "https://cwe.mitre.org/data/definitions/502.html"
        },
        {
          "type": "owasp",
          "name": "A8:2017 - Insecure Deserialization",
          "value": "A8:2017"
        }
      ],
      "tracking": {
        "type": "source",
        "items": [
          {
            "file": "app/app.py",
            "line_start": 329,
            "line_end": 329,
            "signatures": [
              {
                "algorithm": "scope_offset_compressed",
                "value": "app/app.py|yaml_hammer[0]:11"
              },
              {
                "algorithm": "scope_offset",
                "value": "app/app.py|yaml_hammer[0]:13"
              }
            ]
          }
        ]
      }
    }
  ],
  "dependency_files": null,
  "scan": {
    "analyzer": {
      "id": "semgrep",
      "name": "Semgrep",
      "url": "https://gitlab.com/gitlab-org/security-products/analyzers/semgrep",
      "vendor": {
        "name": "GitLab"
      },
      "version": ":SKIP:"
    },
    "scanner": {
      "id": "semgrep",
      "name": "Semgrep",
      "url": "https://github.com/returntocorp/semgrep",
      "vendor": {
        "name": "GitLab"
      },
      "version": ":SKIP:"
    },
    "type": "sast",
    "start_time": ":SKIP:",
    "end_time": ":SKIP:",
    "status": "success"
  }
}
