{
  "version": "15.0.7",
  "vulnerabilities": [
    {
      "id": "7dd61f937a682e9bf6ca97826cf4e328223efa10cae13621da20c2c7b646ddfa",
      "category": "sast",
      "name": "Weak random number generator.",
      "cve": "ServiceB/Random.cs:15:SCS0005",
      "severity": "High",
      "scanner": {
        "id": "security_code_scan",
        "name": "Security Code Scan"
      },
      "location": {
        "file": "ServiceB/Random.cs",
        "start_line": 15
      },
      "identifiers": [
        {
          "type": "security_code_scan_rule_id",
          "name": "SCS0005",
          "value": "SCS0005",
          "url": "https://security-code-scan.github.io/#SCS0005"
        }
      ]
    }
  ],
  "dependency_files": [],
  "scan": {
    "analyzer": {
      "id": "security_code_scan",
      "name": "Security Code Scan",
      "url": "https://gitlab.com/gitlab-org/security-products/analyzers/security-code-scan",
      "vendor": {
        "name": "GitLab"
      },
      "version": "3.10.3"
    },
    "scanner": {
      "id": "security_code_scan",
      "name": "Security Code Scan",
      "url": "https://security-code-scan.github.io",
      "vendor": {
        "name": "GitLab"
      },
      "version": "5.6.7"
    },
    "type": "sast",
    "start_time": "2024-06-12T09:39:29",
    "end_time": "2024-06-12T09:39:49",
    "status": "success"
  }
}
