{
  "version": "15.0.7",
  "vulnerabilities": [
    {
      "id": "6660815a183b9eee3038011231b97301acfaeae0bc4ce8c4b14f18e7651098c8",
      "category": "sast",
      "name": "Weak hashing function.",
      "cve": "WebGoat/Content/EncryptVSEncode.aspx.cs:102:SCS0006",
      "severity": "High",
      "scanner": {
        "id": "security_code_scan",
        "name": "Security Code Scan"
      },
      "location": {
        "file": "WebGoat/Content/EncryptVSEncode.aspx.cs",
        "start_line": 102
      },
      "identifiers": [
        {
          "type": "security_code_scan_rule_id",
          "name": "SCS0006",
          "value": "SCS0006",
          "url": "https://security-code-scan.github.io/#SCS0006"
        }
      ]
    },
    {
      "id": "9a26fef9519f6b4904bee0f9c23cba42c4b4427265f163a27fe8def1e0ee2676",
      "category": "sast",
      "name": "The cookie is missing 'Secure' flag.",
      "cve": "WebGoat/Content/ForgotPassword.aspx.cs:48:SCS0008",
      "severity": "High",
      "scanner": {
        "id": "security_code_scan",
        "name": "Security Code Scan"
      },
      "location": {
        "file": "WebGoat/Content/ForgotPassword.aspx.cs",
        "start_line": 48
      },
      "identifiers": [
        {
          "type": "security_code_scan_rule_id",
          "name": "SCS0008",
          "value": "SCS0008",
          "url": "https://security-code-scan.github.io/#SCS0008"
        }
      ]
    },
    {
      "id": "5f190e8cea8cbe56eef132e2a41690a353becd259deaae0cc17f1da99614437e",
      "category": "sast",
      "name": "The cookie is missing 'HttpOnly' flag.",
      "cve": "WebGoat/Content/ForgotPassword.aspx.cs:48:SCS0009",
      "severity": "High",
      "scanner": {
        "id": "security_code_scan",
        "name": "Security Code Scan"
      },
      "location": {
        "file": "WebGoat/Content/ForgotPassword.aspx.cs",
        "start_line": 48
      },
      "identifiers": [
        {
          "type": "security_code_scan_rule_id",
          "name": "SCS0009",
          "value": "SCS0009",
          "url": "https://security-code-scan.github.io/#SCS0009"
        }
      ]
    },
    {
      "id": "09b44967248463042a89f9aa0365e1e6b2aec6713a8483e17448d0e7aea074c2",
      "category": "sast",
      "name": "The cookie is missing 'Secure' flag.",
      "cve": "WebGoat/Content/HeaderInjection.aspx.cs:21:SCS0008",
      "severity": "High",
      "scanner": {
        "id": "security_code_scan",
        "name": "Security Code Scan"
      },
      "location": {
        "file": "WebGoat/Content/HeaderInjection.aspx.cs",
        "start_line": 21
      },
      "identifiers": [
        {
          "type": "security_code_scan_rule_id",
          "name": "SCS0008",
          "value": "SCS0008",
          "url": "https://security-code-scan.github.io/#SCS0008"
        }
      ]
    },
    {
      "id": "4303f89883bd8995de933721aff19457ffb390fc0d88601aca81ac647cb3fd6e",
      "category": "sast",
      "name": "The cookie is missing 'HttpOnly' flag.",
      "cve": "WebGoat/Content/HeaderInjection.aspx.cs:21:SCS0009",
      "severity": "High",
      "scanner": {
        "id": "security_code_scan",
        "name": "Security Code Scan"
      },
      "location": {
        "file": "WebGoat/Content/HeaderInjection.aspx.cs",
        "start_line": 21
      },
      "identifiers": [
        {
          "type": "security_code_scan_rule_id",
          "name": "SCS0009",
          "value": "SCS0009",
          "url": "https://security-code-scan.github.io/#SCS0009"
        }
      ]
    },
    {
      "id": "e06d29a4b1470c9422234b60b485c05b3df411a7f35227d881417e06257e2453",
      "category": "sast",
      "name": "Potential Path Traversal vulnerability was found where 'path' in 'FileStream.FileStream(string path, FileMode mode, FileAccess access, FileShare share)' may be tainted by user-controlled data from 'NameValueCollection HttpRequest.QueryString' in method 'v",
      "cve": "WebGoat/Content/PathManipulation.aspx.cs:53:SCS0018",
      "severity": "High",
      "scanner": {
        "id": "security_code_scan",
        "name": "Security Code Scan"
      },
      "location": {
        "file": "WebGoat/Content/PathManipulation.aspx.cs",
        "start_line": 53
      },
      "identifiers": [
        {
          "type": "security_code_scan_rule_id",
          "name": "SCS0018",
          "value": "SCS0018",
          "url": "https://security-code-scan.github.io/#SCS0018"
        }
      ]
    },
    {
      "id": "37d79cd4664ab4d7ae518492c5c43c8a2fbffdbe8038d75160b59cafe97e0fff",
      "category": "sast",
      "name": "Potential Path Traversal vulnerability was found where 'filename' in 'void FileUpload.SaveAs(string filename)' may be tainted by user-controlled data from 'string FileUpload.FileName' in method 'void UploadPathManipulation.btnUpload_Click(object sender, E",
      "cve": "WebGoat/Content/UploadPathManipulation.aspx.cs:25:SCS0018",
      "severity": "High",
      "scanner": {
        "id": "security_code_scan",
        "name": "Security Code Scan"
      },
      "location": {
        "file": "WebGoat/Content/UploadPathManipulation.aspx.cs",
        "start_line": 25
      },
      "identifiers": [
        {
          "type": "security_code_scan_rule_id",
          "name": "SCS0018",
          "value": "SCS0018",
          "url": "https://security-code-scan.github.io/#SCS0018"
        }
      ]
    },
    {
      "id": "6221a740afc5c504463a8a3b766fffef1da9a138db6986e15fb1a776078adcd3",
      "category": "sast",
      "name": "Potential XML eXternal Entity (XXE) vulnerability.",
      "cve": "WebGoat/Content/XMLInjection.aspx.cs:51:SCS0007",
      "severity": "High",
      "scanner": {
        "id": "security_code_scan",
        "name": "Security Code Scan"
      },
      "location": {
        "file": "WebGoat/Content/XMLInjection.aspx.cs",
        "start_line": 51
      },
      "identifiers": [
        {
          "type": "security_code_scan_rule_id",
          "name": "SCS0007",
          "value": "SCS0007",
          "url": "https://security-code-scan.github.io/#SCS0007"
        }
      ]
    },
    {
      "id": "179b61b68f10e609edb936d0570a02a084e296b80a357b193db679364f8eeb73",
      "category": "sast",
      "name": "Potential XML eXternal Entity (XXE) vulnerability.",
      "cve": "WebGoat/Content/XPathInjection.aspx.cs:26:SCS0007",
      "severity": "High",
      "scanner": {
        "id": "security_code_scan",
        "name": "Security Code Scan"
      },
      "location": {
        "file": "WebGoat/Content/XPathInjection.aspx.cs",
        "start_line": 26
      },
      "identifiers": [
        {
          "type": "security_code_scan_rule_id",
          "name": "SCS0007",
          "value": "SCS0007",
          "url": "https://security-code-scan.github.io/#SCS0007"
        }
      ]
    },
    {
      "id": "6f15b7243f824070f7aaaf43c619e516e3c6acc34ef8370e8b888a0c07423e50",
      "category": "sast",
      "name": "The cookie is missing 'Secure' flag.",
      "cve": "WebGoat/Default.aspx.cs:29:SCS0008",
      "severity": "High",
      "scanner": {
        "id": "security_code_scan",
        "name": "Security Code Scan"
      },
      "location": {
        "file": "WebGoat/Default.aspx.cs",
        "start_line": 29
      },
      "identifiers": [
        {
          "type": "security_code_scan_rule_id",
          "name": "SCS0008",
          "value": "SCS0008",
          "url": "https://security-code-scan.github.io/#SCS0008"
        }
      ]
    },
    {
      "id": "3aa0538affcbb29652ee78cf224b5eac4cf5c8db76e2f55ba379536dc901e7ec",
      "category": "sast",
      "name": "The cookie is missing 'HttpOnly' flag.",
      "cve": "WebGoat/Default.aspx.cs:29:SCS0009",
      "severity": "High",
      "scanner": {
        "id": "security_code_scan",
        "name": "Security Code Scan"
      },
      "location": {
        "file": "WebGoat/Default.aspx.cs",
        "start_line": 29
      },
      "identifiers": [
        {
          "type": "security_code_scan_rule_id",
          "name": "SCS0009",
          "value": "SCS0009",
          "url": "https://security-code-scan.github.io/#SCS0009"
        }
      ]
    },
    {
      "id": "381bdb3be9716dc761d85aeb9ad8bf4779d81b3e1e0fbd9a6263a6605095b91e",
      "category": "sast",
      "name": "The cookie is missing 'Secure' flag.",
      "cve": "WebGoat/WebGoatCoins/CustomerLogin.aspx.cs:65:SCS0008",
      "severity": "High",
      "scanner": {
        "id": "security_code_scan",
        "name": "Security Code Scan"
      },
      "location": {
        "file": "WebGoat/WebGoatCoins/CustomerLogin.aspx.cs",
        "start_line": 65
      },
      "identifiers": [
        {
          "type": "security_code_scan_rule_id",
          "name": "SCS0008",
          "value": "SCS0008",
          "url": "https://security-code-scan.github.io/#SCS0008"
        }
      ]
    },
    {
      "id": "0b3b221858749c3719651d946e417ec126bad31c64a225bb0680e3d6dc9c79dc",
      "category": "sast",
      "name": "The cookie is missing 'HttpOnly' flag.",
      "cve": "WebGoat/WebGoatCoins/CustomerLogin.aspx.cs:65:SCS0009",
      "severity": "High",
      "scanner": {
        "id": "security_code_scan",
        "name": "Security Code Scan"
      },
      "location": {
        "file": "WebGoat/WebGoatCoins/CustomerLogin.aspx.cs",
        "start_line": 65
      },
      "identifiers": [
        {
          "type": "security_code_scan_rule_id",
          "name": "SCS0009",
          "value": "SCS0009",
          "url": "https://security-code-scan.github.io/#SCS0009"
        }
      ]
    },
    {
      "id": "273e7136e88680efc60dd463c6ad9a63486e8bc69696f7525b0e20a13610e6a2",
      "category": "sast",
      "name": "Potential Open Redirect vulnerability was found where 'url' in 'void HttpResponse.Redirect(string url)' may be tainted by user-controlled data from 'NameValueCollection HttpRequest.QueryString' in method 'void CustomerLogin.ButtonLogOn_Click(object sender",
      "cve": "WebGoat/WebGoatCoins/CustomerLogin.aspx.cs:72:SCS0027",
      "severity": "High",
      "scanner": {
        "id": "security_code_scan",
        "name": "Security Code Scan"
      },
      "location": {
        "file": "WebGoat/WebGoatCoins/CustomerLogin.aspx.cs",
        "start_line": 72
      },
      "identifiers": [
        {
          "type": "security_code_scan_rule_id",
          "name": "SCS0027",
          "value": "SCS0027",
          "url": "https://security-code-scan.github.io/#SCS0027"
        }
      ]
    },
    {
      "id": "c170e575a9ae9579c59c7187d570d85703b02c9a3b9d0074e1e4d16cc8fae55e",
      "category": "sast",
      "name": "The cookie is missing 'Secure' flag.",
      "cve": "WebGoat/WebGoatCoins/ForgotPassword.aspx.cs:49:SCS0008",
      "severity": "High",
      "scanner": {
        "id": "security_code_scan",
        "name": "Security Code Scan"
      },
      "location": {
        "file": "WebGoat/WebGoatCoins/ForgotPassword.aspx.cs",
        "start_line": 49
      },
      "identifiers": [
        {
          "type": "security_code_scan_rule_id",
          "name": "SCS0008",
          "value": "SCS0008",
          "url": "https://security-code-scan.github.io/#SCS0008"
        }
      ]
    },
    {
      "id": "35118ee3d308e3ee70d569c3696d3d9946dec647e64b61f03a30b65d5006ac30",
      "category": "sast",
      "name": "The cookie is missing 'HttpOnly' flag.",
      "cve": "WebGoat/WebGoatCoins/ForgotPassword.aspx.cs:49:SCS0009",
      "severity": "High",
      "scanner": {
        "id": "security_code_scan",
        "name": "Security Code Scan"
      },
      "location": {
        "file": "WebGoat/WebGoatCoins/ForgotPassword.aspx.cs",
        "start_line": 49
      },
      "identifiers": [
        {
          "type": "security_code_scan_rule_id",
          "name": "SCS0009",
          "value": "SCS0009",
          "url": "https://security-code-scan.github.io/#SCS0009"
        }
      ]
    },
    {
      "id": "d9abdcee8ea70bb7019d52852e606a3628a7e5cbfac9edd737b362a4feeb6305",
      "category": "sast",
      "name": "Potential Path Traversal vulnerability was found where 'filename' in 'void FileUpload.SaveAs(string filename)' may be tainted by user-controlled data from 'string FileUpload.FileName' in method 'void MainPage.btnUpload_Click(object sender, EventArgs e)'.",
      "cve": "WebGoat/WebGoatCoins/MainPage.aspx.cs:59:SCS0018",
      "severity": "High",
      "scanner": {
        "id": "security_code_scan",
        "name": "Security Code Scan"
      },
      "location": {
        "file": "WebGoat/WebGoatCoins/MainPage.aspx.cs",
        "start_line": 59
      },
      "identifiers": [
        {
          "type": "security_code_scan_rule_id",
          "name": "SCS0018",
          "value": "SCS0018",
          "url": "https://security-code-scan.github.io/#SCS0018"
        }
      ]
    },
    {
      "id": "31e9dcd7cf98bcfb6dcc3da153baee3c41838cb83afa4fe43899975b1e8edea5",
      "category": "sast",
      "name": "Potential Cross-Site Scripting (XSS) vulnerability was found where 'Text' in 'TableCell' may be tainted by user-controlled data from 'string TextBox.Text' in method 'void EncryptVSEncode.btnGO_Click(object sender, EventArgs e)'.",
      "cve": "WebGoat/Content/EncryptVSEncode.aspx.cs:67:SCS0029",
      "severity": "Medium",
      "scanner": {
        "id": "security_code_scan",
        "name": "Security Code Scan"
      },
      "location": {
        "file": "WebGoat/Content/EncryptVSEncode.aspx.cs",
        "start_line": 67
      },
      "identifiers": [
        {
          "type": "security_code_scan_rule_id",
          "name": "SCS0029",
          "value": "SCS0029",
          "url": "https://security-code-scan.github.io/#SCS0029"
        }
      ]
    },
    {
      "id": "6fa9cfc9e8fefafce437b4121dbfc88b77fa91a64ec86ae0e61f265b45c7de2e",
      "category": "sast",
      "name": "Potential Cross-Site Scripting (XSS) vulnerability was found where 'Text' in 'Literal' may be tainted by user-controlled data from 'string TextBox.Text' in method 'void ForgotPassword.ButtonCheckEmail_Click(object sender, EventArgs e)'.",
      "cve": "WebGoat/Content/ForgotPassword.aspx.cs:37:SCS0029",
      "severity": "Medium",
      "scanner": {
        "id": "security_code_scan",
        "name": "Security Code Scan"
      },
      "location": {
        "file": "WebGoat/Content/ForgotPassword.aspx.cs",
        "start_line": 37
      },
      "identifiers": [
        {
          "type": "security_code_scan_rule_id",
          "name": "SCS0029",
          "value": "SCS0029",
          "url": "https://security-code-scan.github.io/#SCS0029"
        }
      ]
    },
    {
      "id": "a18319d789fafaae275748c3098b7f55aaf08370b28ceecba149f7d7b3a156c7",
      "category": "sast",
      "name": "Potential Cross-Site Scripting (XSS) vulnerability was found where 'Text' in 'Literal' may be tainted by user-controlled data from 'string TextBox.Text' in method 'void ForgotPassword.ButtonRecoverPassword_Click(object sender, EventArgs e)'.",
      "cve": "WebGoat/Content/ForgotPassword.aspx.cs:66:SCS0029",
      "severity": "Medium",
      "scanner": {
        "id": "security_code_scan",
        "name": "Security Code Scan"
      },
      "location": {
        "file": "WebGoat/Content/ForgotPassword.aspx.cs",
        "start_line": 66
      },
      "identifiers": [
        {
          "type": "security_code_scan_rule_id",
          "name": "SCS0029",
          "value": "SCS0029",
          "url": "https://security-code-scan.github.io/#SCS0029"
        }
      ]
    },
    {
      "id": "899216a2baeac1ac23b1cda325ba84a0da2c86a6ca4baa0ff1b6106b1db378c7",
      "category": "sast",
      "name": "Potential Cross-Site Scripting (XSS) vulnerability was found where 'Text' in 'Label' may be tainted by user-controlled data from 'NameValueCollection HttpRequest.Headers' in method 'void HeaderInjection.Page_Load(object sender, EventArgs e)'.",
      "cve": "WebGoat/Content/HeaderInjection.aspx.cs:33:SCS0029",
      "severity": "Medium",
      "scanner": {
        "id": "security_code_scan",
        "name": "Security Code Scan"
      },
      "location": {
        "file": "WebGoat/Content/HeaderInjection.aspx.cs",
        "start_line": 33
      },
      "identifiers": [
        {
          "type": "security_code_scan_rule_id",
          "name": "SCS0029",
          "value": "SCS0029",
          "url": "https://security-code-scan.github.io/#SCS0029"
        }
      ]
    },
    {
      "id": "41ca405a1cc388698dc6109135703f30d96bcb4703aa150657c4027d8c5e244c",
      "category": "sast",
      "name": "Potential Cross-Site Scripting (XSS) vulnerability was found where 'Text' in 'Label' may be tainted by user-controlled data from 'string TextBox.Text' in method 'void MessageDigest.btnDigest_Click(object sender, EventArgs args)'.",
      "cve": "WebGoat/Content/MessageDigest.aspx.cs:26:SCS0029",
      "severity": "Medium",
      "scanner": {
        "id": "security_code_scan",
        "name": "Security Code Scan"
      },
      "location": {
        "file": "WebGoat/Content/MessageDigest.aspx.cs",
        "start_line": 26
      },
      "identifiers": [
        {
          "type": "security_code_scan_rule_id",
          "name": "SCS0029",
          "value": "SCS0029",
          "url": "https://security-code-scan.github.io/#SCS0029"
        }
      ]
    },
    {
      "id": "84688df66306f1e5809011c7b86549b28c911ac6d203eef99c0314007a399287",
      "category": "sast",
      "name": "Potential Cross-Site Scripting (XSS) vulnerability was found where 'Text' in 'Label' may be tainted by user-controlled data from 'NameValueCollection HttpRequest.QueryString' in method 'void PathManipulation.Page_Load(object sender, EventArgs e)'.",
      "cve": "WebGoat/Content/PathManipulation.aspx.cs:43:SCS0029",
      "severity": "Medium",
      "scanner": {
        "id": "security_code_scan",
        "name": "Security Code Scan"
      },
      "location": {
        "file": "WebGoat/Content/PathManipulation.aspx.cs",
        "start_line": 43
      },
      "identifiers": [
        {
          "type": "security_code_scan_rule_id",
          "name": "SCS0029",
          "value": "SCS0029",
          "url": "https://security-code-scan.github.io/#SCS0029"
        }
      ]
    },
    {
      "id": "71fad28fa40e7ab8f9290814cb9ccc75622f6d18db1e434eb2a83d297495cc92",
      "category": "sast",
      "name": "Potential Cross-Site Scripting (XSS) vulnerability was found where 'value' in 'void HttpResponse.AddHeader(string name, string value)' may be tainted by user-controlled data from 'NameValueCollection HttpRequest.QueryString' in method 'void PathManipulati",
      "cve": "WebGoat/Content/PathManipulation.aspx.cs:79:SCS0029",
      "severity": "Medium",
      "scanner": {
        "id": "security_code_scan",
        "name": "Security Code Scan"
      },
      "location": {
        "file": "WebGoat/Content/PathManipulation.aspx.cs",
        "start_line": 79
      },
      "identifiers": [
        {
          "type": "security_code_scan_rule_id",
          "name": "SCS0029",
          "value": "SCS0029",
          "url": "https://security-code-scan.github.io/#SCS0029"
        }
      ]
    },
    {
      "id": "366cd4fb537dc272336373dbedefb90c87cb89fd6f4ac401ba630b2c3411c23d",
      "category": "sast",
      "name": "Potential Cross-Site Scripting (XSS) vulnerability was found where 'buffer' in 'void HttpResponse.BinaryWrite(byte[] buffer)' may be tainted by user-controlled data from 'NameValueCollection HttpRequest.QueryString' in method 'void PathManipulation.Page_L",
      "cve": "WebGoat/Content/PathManipulation.aspx.cs:88:SCS0029",
      "severity": "Medium",
      "scanner": {
        "id": "security_code_scan",
        "name": "Security Code Scan"
      },
      "location": {
        "file": "WebGoat/Content/PathManipulation.aspx.cs",
        "start_line": 88
      },
      "identifiers": [
        {
          "type": "security_code_scan_rule_id",
          "name": "SCS0029",
          "value": "SCS0029",
          "url": "https://security-code-scan.github.io/#SCS0029"
        }
      ]
    },
    {
      "id": "547b4f0296ea2ed0543d6ca918ea191d3a9393dcf6f14286a3d6512f4a17c900",
      "category": "sast",
      "name": "Potential Cross-Site Scripting (XSS) vulnerability was found where 'Text' in 'Label' may be tainted by user-controlled data from 'string HttpRequest.this[string key]' in method 'void ReflectedXSS.Page_Load(object sender, EventArgs e)'.",
      "cve": "WebGoat/Content/ReflectedXSS.aspx.cs:26:SCS0029",
      "severity": "Medium",
      "scanner": {
        "id": "security_code_scan",
        "name": "Security Code Scan"
      },
      "location": {
        "file": "WebGoat/Content/ReflectedXSS.aspx.cs",
        "start_line": 26
      },
      "identifiers": [
        {
          "type": "security_code_scan_rule_id",
          "name": "SCS0029",
          "value": "SCS0029",
          "url": "https://security-code-scan.github.io/#SCS0029"
        }
      ]
    },
    {
      "id": "edf68af1807a9544b00eac93ea076001feef4b0ba2fa561b9e85f5237870ce46",
      "category": "sast",
      "name": "Potential Cross-Site Scripting (XSS) vulnerability was found where 'Text' in 'TextBox' may be tainted by user-controlled data from 'string TextBox.Text' in method 'void StoredXSS.btnSave_Click(object sender, EventArgs e)'.",
      "cve": "WebGoat/Content/StoredXSS.aspx.cs:31:SCS0029",
      "severity": "Medium",
      "scanner": {
        "id": "security_code_scan",
        "name": "Security Code Scan"
      },
      "location": {
        "file": "WebGoat/Content/StoredXSS.aspx.cs",
        "start_line": 31
      },
      "identifiers": [
        {
          "type": "security_code_scan_rule_id",
          "name": "SCS0029",
          "value": "SCS0029",
          "url": "https://security-code-scan.github.io/#SCS0029"
        }
      ]
    },
    {
      "id": "c39532304a2c8729f67c20266087b028133af52c03cd4263a795b9e0404b1b80",
      "category": "sast",
      "name": "Potential Cross-Site Scripting (XSS) vulnerability was found where 'Text' in 'Label' may be tainted by user-controlled data from 'string FileUpload.FileName' in method 'void UploadPathManipulation.btnUpload_Click(object sender, EventArgs e)'.",
      "cve": "WebGoat/Content/UploadPathManipulation.aspx.cs:26:SCS0029",
      "severity": "Medium",
      "scanner": {
        "id": "security_code_scan",
        "name": "Security Code Scan"
      },
      "location": {
        "file": "WebGoat/Content/UploadPathManipulation.aspx.cs",
        "start_line": 26
      },
      "identifiers": [
        {
          "type": "security_code_scan_rule_id",
          "name": "SCS0029",
          "value": "SCS0029",
          "url": "https://security-code-scan.github.io/#SCS0029"
        }
      ]
    },
    {
      "id": "869d9b63896a9432c4b28a5bc2667b803333b7db4d17ee2b092e767992415781",
      "category": "sast",
      "name": "Potential XPath injection vulnerability was found where 'xpath' in 'XmlNodeList XmlNode.SelectNodes(string xpath)' may be tainted by user-controlled data from 'NameValueCollection HttpRequest.QueryString' in method 'void XPathInjection.Page_Load(object se",
      "cve": "WebGoat/Content/XPathInjection.aspx.cs:28:SCS0003",
      "severity": "Medium",
      "scanner": {
        "id": "security_code_scan",
        "name": "Security Code Scan"
      },
      "location": {
        "file": "WebGoat/Content/XPathInjection.aspx.cs",
        "start_line": 28
      },
      "identifiers": [
        {
          "type": "security_code_scan_rule_id",
          "name": "SCS0003",
          "value": "SCS0003",
          "url": "https://security-code-scan.github.io/#SCS0003"
        }
      ]
    },
    {
      "id": "5e58b71f617e48afd58da98ad47fedff49323bebf323c9f04202778953586287",
      "category": "sast",
      "name": "Potential Cross-Site Scripting (XSS) vulnerability was found where 'Text' in 'Label' may be tainted by user-controlled data from 'string TextBox.Text' in method 'void ProxySetup.btnReverse_Click(object sender, EventArgs e)'.",
      "cve": "WebGoat/ProxySetup.aspx.cs:17:SCS0029",
      "severity": "Medium",
      "scanner": {
        "id": "security_code_scan",
        "name": "Security Code Scan"
      },
      "location": {
        "file": "WebGoat/ProxySetup.aspx.cs",
        "start_line": 17
      },
      "identifiers": [
        {
          "type": "security_code_scan_rule_id",
          "name": "SCS0029",
          "value": "SCS0029",
          "url": "https://security-code-scan.github.io/#SCS0029"
        }
      ]
    },
    {
      "id": "b8650ee8a1efe157219b75f4b0ae94ccd1f7c5e8fb617060816900548b437ee8",
      "category": "sast",
      "name": "Potential Cross-Site Scripting (XSS) vulnerability was found where 's' in 'void HttpResponse.Write(string s)' may be tainted by user-controlled data from 'string HttpRequest.this[string key]' in method 'void Autocomplete.ProcessRequest(HttpContext context",
      "cve": "WebGoat/WebGoatCoins/Autocomplete.ashx.cs:33:SCS0029",
      "severity": "Medium",
      "scanner": {
        "id": "security_code_scan",
        "name": "Security Code Scan"
      },
      "location": {
        "file": "WebGoat/WebGoatCoins/Autocomplete.ashx.cs",
        "start_line": 33
      },
      "identifiers": [
        {
          "type": "security_code_scan_rule_id",
          "name": "SCS0029",
          "value": "SCS0029",
          "url": "https://security-code-scan.github.io/#SCS0029"
        }
      ]
    },
    {
      "id": "a5691cbcb1c849bf38bbcbec281940b84bcf64b9549b1de663ac9c523d2932d3",
      "category": "sast",
      "name": "Potential Cross-Site Scripting (XSS) vulnerability was found where 'Text' in 'Literal' may be tainted by user-controlled data from 'string TextBox.Text' in method 'void ChangePassword.ButtonChangePassword_Click(object sender, EventArgs e)'.",
      "cve": "WebGoat/WebGoatCoins/ChangePassword.aspx.cs:33:SCS0029",
      "severity": "Medium",
      "scanner": {
        "id": "security_code_scan",
        "name": "Security Code Scan"
      },
      "location": {
        "file": "WebGoat/WebGoatCoins/ChangePassword.aspx.cs",
        "start_line": 33
      },
      "identifiers": [
        {
          "type": "security_code_scan_rule_id",
          "name": "SCS0029",
          "value": "SCS0029",
          "url": "https://security-code-scan.github.io/#SCS0029"
        }
      ]
    },
    {
      "id": "8f6fc76c4ca27650b4f27f3a83bdd811368ba787d3dcc46a105e24fdc2bd26f3",
      "category": "sast",
      "name": "Potential Cross-Site Scripting (XSS) vulnerability was found where 'Text' in 'Literal' may be tainted by user-controlled data from 'string TextBox.Text' in method 'void ForgotPassword.ButtonCheckEmail_Click(object sender, EventArgs e)'.",
      "cve": "WebGoat/WebGoatCoins/ForgotPassword.aspx.cs:38:SCS0029",
      "severity": "Medium",
      "scanner": {
        "id": "security_code_scan",
        "name": "Security Code Scan"
      },
      "location": {
        "file": "WebGoat/WebGoatCoins/ForgotPassword.aspx.cs",
        "start_line": 38
      },
      "identifiers": [
        {
          "type": "security_code_scan_rule_id",
          "name": "SCS0029",
          "value": "SCS0029",
          "url": "https://security-code-scan.github.io/#SCS0029"
        }
      ]
    },
    {
      "id": "0a600fdad4a04200fb5d37e115780eadcce26611b61c611d737e0db334ff93d2",
      "category": "sast",
      "name": "Potential Cross-Site Scripting (XSS) vulnerability was found where 'Text' in 'Literal' may be tainted by user-controlled data from 'string TextBox.Text' in method 'void ForgotPassword.ButtonRecoverPassword_Click(object sender, EventArgs e)'.",
      "cve": "WebGoat/WebGoatCoins/ForgotPassword.aspx.cs:67:SCS0029",
      "severity": "Medium",
      "scanner": {
        "id": "security_code_scan",
        "name": "Security Code Scan"
      },
      "location": {
        "file": "WebGoat/WebGoatCoins/ForgotPassword.aspx.cs",
        "start_line": 67
      },
      "identifiers": [
        {
          "type": "security_code_scan_rule_id",
          "name": "SCS0029",
          "value": "SCS0029",
          "url": "https://security-code-scan.github.io/#SCS0029"
        }
      ]
    },
    {
      "id": "e7edbda5299435fc413c9c1510333e699d35bddb8f1c6fbe0548a28ad5042652",
      "category": "sast",
      "name": "Potential Cross-Site Scripting (XSS) vulnerability was found where 'ImageUrl' in 'Image' may be tainted by user-controlled data from 'HttpCookieCollection HttpRequest.Cookies' in method 'void MainPage.Page_Load(object sender, EventArgs e)'.",
      "cve": "WebGoat/WebGoatCoins/MainPage.aspx.cs:32:SCS0029",
      "severity": "Medium",
      "scanner": {
        "id": "security_code_scan",
        "name": "Security Code Scan"
      },
      "location": {
        "file": "WebGoat/WebGoatCoins/MainPage.aspx.cs",
        "start_line": 32
      },
      "identifiers": [
        {
          "type": "security_code_scan_rule_id",
          "name": "SCS0029",
          "value": "SCS0029",
          "url": "https://security-code-scan.github.io/#SCS0029"
        }
      ]
    },
    {
      "id": "b0bf5202e1c6e6e46725fc034cf6e78c754f54672b2a45c2f69d7f5adb9ad833",
      "category": "sast",
      "name": "Potential Cross-Site Scripting (XSS) vulnerability was found where 'ID' in 'Control' may be tainted by user-controlled data from 'HttpCookieCollection HttpRequest.Cookies' in method 'void MainPage.Page_Load(object sender, EventArgs e)'.",
      "cve": "WebGoat/WebGoatCoins/MainPage.aspx.cs:37:SCS0029",
      "severity": "Medium",
      "scanner": {
        "id": "security_code_scan",
        "name": "Security Code Scan"
      },
      "location": {
        "file": "WebGoat/WebGoatCoins/MainPage.aspx.cs",
        "start_line": 37
      },
      "identifiers": [
        {
          "type": "security_code_scan_rule_id",
          "name": "SCS0029",
          "value": "SCS0029",
          "url": "https://security-code-scan.github.io/#SCS0029"
        }
      ]
    },
    {
      "id": "4ac01326f98f0dc0473b0cc46140f1198919c99e645833396bd9c82c9f5e403f",
      "category": "sast",
      "name": "Potential Cross-Site Scripting (XSS) vulnerability was found where 'Text' in 'TableCell' may be tainted by user-controlled data from 'HttpCookieCollection HttpRequest.Cookies' in method 'void MainPage.Page_Load(object sender, EventArgs e)'.",
      "cve": "WebGoat/WebGoatCoins/MainPage.aspx.cs:41:SCS0029",
      "severity": "Medium",
      "scanner": {
        "id": "security_code_scan",
        "name": "Security Code Scan"
      },
      "location": {
        "file": "WebGoat/WebGoatCoins/MainPage.aspx.cs",
        "start_line": 41
      },
      "identifiers": [
        {
          "type": "security_code_scan_rule_id",
          "name": "SCS0029",
          "value": "SCS0029",
          "url": "https://security-code-scan.github.io/#SCS0029"
        }
      ]
    },
    {
      "id": "4c1e61b1476adbcea431e36ae7f5390c920a43071f7659f9800c615911f847ff",
      "category": "sast",
      "name": "Potential Cross-Site Scripting (XSS) vulnerability was found where 'Text' in 'TableCell' may be tainted by user-controlled data from 'HttpCookieCollection HttpRequest.Cookies' in method 'void MainPage.Page_Load(object sender, EventArgs e)'.",
      "cve": "WebGoat/WebGoatCoins/MainPage.aspx.cs:42:SCS0029",
      "severity": "Medium",
      "scanner": {
        "id": "security_code_scan",
        "name": "Security Code Scan"
      },
      "location": {
        "file": "WebGoat/WebGoatCoins/MainPage.aspx.cs",
        "start_line": 42
      },
      "identifiers": [
        {
          "type": "security_code_scan_rule_id",
          "name": "SCS0029",
          "value": "SCS0029",
          "url": "https://security-code-scan.github.io/#SCS0029"
        }
      ]
    },
    {
      "id": "e8e11b3a48da30678bad80583b92db121f3f9808647e4a8baeae8de7f5381ffe",
      "category": "sast",
      "name": "Potential Cross-Site Scripting (XSS) vulnerability was found where 'value' in 'void HttpResponse.AppendHeader(string name, string value)' may be tainted by user-controlled data from 'string HttpRequest.this[string key]' in method 'void Orders.Page_Load(ob",
      "cve": "WebGoat/WebGoatCoins/Orders.aspx.cs:100:SCS0029",
      "severity": "Medium",
      "scanner": {
        "id": "security_code_scan",
        "name": "Security Code Scan"
      },
      "location": {
        "file": "WebGoat/WebGoatCoins/Orders.aspx.cs",
        "start_line": 100
      },
      "identifiers": [
        {
          "type": "security_code_scan_rule_id",
          "name": "SCS0029",
          "value": "SCS0029",
          "url": "https://security-code-scan.github.io/#SCS0029"
        }
      ]
    },
    {
      "id": "2ecf8348f13414c976ea46ba0d46e2bb155a970c2305541dc2ae7b0b9e8cc81a",
      "category": "sast",
      "name": "Potential Cross-Site Scripting (XSS) vulnerability was found where 'filename' in 'void HttpResponse.TransmitFile(string filename)' may be tainted by user-controlled data from 'string HttpRequest.this[string key]' in method 'void Orders.Page_Load(object se",
      "cve": "WebGoat/WebGoatCoins/Orders.aspx.cs:101:SCS0029",
      "severity": "Medium",
      "scanner": {
        "id": "security_code_scan",
        "name": "Security Code Scan"
      },
      "location": {
        "file": "WebGoat/WebGoatCoins/Orders.aspx.cs",
        "start_line": 101
      },
      "identifiers": [
        {
          "type": "security_code_scan_rule_id",
          "name": "SCS0029",
          "value": "SCS0029",
          "url": "https://security-code-scan.github.io/#SCS0029"
        }
      ]
    },
    {
      "id": "4e415f49cb1740adbcf8a1e2a5d1dd70fdfa2c7ad9a92e0991ef4af3a220dc9d",
      "category": "sast",
      "name": "Potential Cross-Site Scripting (XSS) vulnerability was found where 'NavigateUrl' in 'HyperLink' may be tainted by user-controlled data from 'string HttpRequest.RawUrl' in method 'void Orders.Page_Load(object sender, EventArgs e)'.",
      "cve": "WebGoat/WebGoatCoins/Orders.aspx.cs:77:SCS0029",
      "severity": "Medium",
      "scanner": {
        "id": "security_code_scan",
        "name": "Security Code Scan"
      },
      "location": {
        "file": "WebGoat/WebGoatCoins/Orders.aspx.cs",
        "start_line": 77
      },
      "identifiers": [
        {
          "type": "security_code_scan_rule_id",
          "name": "SCS0029",
          "value": "SCS0029",
          "url": "https://security-code-scan.github.io/#SCS0029"
        }
      ]
    },
    {
      "id": "a7fe9624f33baaa11d614bb597a6e264e34cb16740d7f04596502bc03a912e23",
      "category": "sast",
      "name": "Potential Cross-Site Scripting (XSS) vulnerability was found where 'Text' in 'Literal' may be tainted by user-controlled data from 'string HttpRequest.this[string key]' in method 'void Orders.Page_Load(object sender, EventArgs e)'.",
      "cve": "WebGoat/WebGoatCoins/Orders.aspx.cs:83:SCS0029",
      "severity": "Medium",
      "scanner": {
        "id": "security_code_scan",
        "name": "Security Code Scan"
      },
      "location": {
        "file": "WebGoat/WebGoatCoins/Orders.aspx.cs",
        "start_line": 83
      },
      "identifiers": [
        {
          "type": "security_code_scan_rule_id",
          "name": "SCS0029",
          "value": "SCS0029",
          "url": "https://security-code-scan.github.io/#SCS0029"
        }
      ]
    },
    {
      "id": "27309a90704fe17a5b8e188119a37cd7889715dbdf3ad64c1d4a009b02484f2f",
      "category": "sast",
      "name": "Potential Cross-Site Scripting (XSS) vulnerability was found where 'Text' in 'Label' may be tainted by user-controlled data from 'string HttpRequest.this[string key]' in method 'void Orders.Page_Load(object sender, EventArgs e)'.",
      "cve": "WebGoat/WebGoatCoins/Orders.aspx.cs:92:SCS0029",
      "severity": "Medium",
      "scanner": {
        "id": "security_code_scan",
        "name": "Security Code Scan"
      },
      "location": {
        "file": "WebGoat/WebGoatCoins/Orders.aspx.cs",
        "start_line": 92
      },
      "identifiers": [
        {
          "type": "security_code_scan_rule_id",
          "name": "SCS0029",
          "value": "SCS0029",
          "url": "https://security-code-scan.github.io/#SCS0029"
        }
      ]
    },
    {
      "id": "c626b28b41cb325a5dfa37e0dfe6eb907af23d5ef318e04f1a43307743ceb131",
      "category": "sast",
      "name": "Potential Cross-Site Scripting (XSS) vulnerability was found where 'ContentType' in 'HttpResponse' may be tainted by user-controlled data from 'string HttpRequest.this[string key]' in method 'void Orders.Page_Load(object sender, EventArgs e)'.",
      "cve": "WebGoat/WebGoatCoins/Orders.aspx.cs:99:SCS0029",
      "severity": "Medium",
      "scanner": {
        "id": "security_code_scan",
        "name": "Security Code Scan"
      },
      "location": {
        "file": "WebGoat/WebGoatCoins/Orders.aspx.cs",
        "start_line": 99
      },
      "identifiers": [
        {
          "type": "security_code_scan_rule_id",
          "name": "SCS0029",
          "value": "SCS0029",
          "url": "https://security-code-scan.github.io/#SCS0029"
        }
      ]
    },
    {
      "id": "f6abb203a7abbd45bea5fd367b948d8c87064d4f3936fc0943271010d3848fce",
      "category": "sast",
      "name": "Potential Cross-Site Scripting (XSS) vulnerability was found where 'Text' in 'TextBox' may be tainted by user-controlled data from 'string TextBox.Text' in method 'void ProductDetails.btnSave_Click(object sender, EventArgs e)'.",
      "cve": "WebGoat/WebGoatCoins/ProductDetails.aspx.cs:42:SCS0029",
      "severity": "Medium",
      "scanner": {
        "id": "security_code_scan",
        "name": "Security Code Scan"
      },
      "location": {
        "file": "WebGoat/WebGoatCoins/ProductDetails.aspx.cs",
        "start_line": 42
      },
      "identifiers": [
        {
          "type": "security_code_scan_rule_id",
          "name": "SCS0029",
          "value": "SCS0029",
          "url": "https://security-code-scan.github.io/#SCS0029"
        }
      ]
    },
    {
      "id": "c522f7681466f3c7440f112bdc9c30694f2deb3f201e02e2e126ad61f939eef9",
      "category": "sast",
      "name": "Potential Cross-Site Scripting (XSS) vulnerability was found where 'Text' in 'TextBox' may be tainted by user-controlled data from 'string HiddenField.Value' in method 'void ProductDetails.btnSave_Click(object sender, EventArgs e)'.",
      "cve": "WebGoat/WebGoatCoins/ProductDetails.aspx.cs:42:SCS0029",
      "severity": "Medium",
      "scanner": {
        "id": "security_code_scan",
        "name": "Security Code Scan"
      },
      "location": {
        "file": "WebGoat/WebGoatCoins/ProductDetails.aspx.cs",
        "start_line": 42
      },
      "identifiers": [
        {
          "type": "security_code_scan_rule_id",
          "name": "SCS0029",
          "value": "SCS0029",
          "url": "https://security-code-scan.github.io/#SCS0029"
        }
      ]
    },
    {
      "id": "70e04b6ae7f275464b74f0348d19cbd2be4d2b984ff86d03fd4f52cb1298f1f9",
      "category": "sast",
      "name": "Potential Cross-Site Scripting (XSS) vulnerability was found where 'Text' in 'TextBox' may be tainted by user-controlled data from 'HttpCookieCollection HttpRequest.Cookies' in method 'void ProductDetails.LoadComments()'.",
      "cve": "WebGoat/WebGoatCoins/ProductDetails.aspx.cs:92:SCS0029",
      "severity": "Medium",
      "scanner": {
        "id": "security_code_scan",
        "name": "Security Code Scan"
      },
      "location": {
        "file": "WebGoat/WebGoatCoins/ProductDetails.aspx.cs",
        "start_line": 92
      },
      "identifiers": [
        {
          "type": "security_code_scan_rule_id",
          "name": "SCS0029",
          "value": "SCS0029",
          "url": "https://security-code-scan.github.io/#SCS0029"
        }
      ]
    }
  ],
  "dependency_files": [],
  "scan": {
    "analyzer": {
      "id": "security_code_scan",
      "name": "Security Code Scan",
      "url": "https://gitlab.com/gitlab-org/security-products/analyzers/security-code-scan",
      "vendor": {
        "name": "GitLab"
      },
      "version": "3.10.0"
    },
    "scanner": {
      "id": "security_code_scan",
      "name": "Security Code Scan",
      "url": "https://security-code-scan.github.io",
      "vendor": {
        "name": "GitLab"
      },
      "version": "5.6.7"
    },
    "type": "sast",
    "start_time": "2023-12-20T21:08:54",
    "end_time": "2023-12-20T21:09:05",
    "status": "success"
  }
}
