{
    "type": "service_account",
    "private_key_id": "abc",
    "private_key": "-----BEGIN PRIVATE KEY-----\nMIIEvgIBADANBgkqhkiG9w0BAQEFAASCBKgwggSkAgEAAoIBAQDY3E8o1NEFcjMM\nHW/5ZfFJw29/8NEqpViNjQIx95Xx5KDtJ+nWn9+OW0uqsSqKlKGhAdAo+Q6bjx2c\nuXVsXTu7XrZUY5Kltvj94DvUa1wjNXs606r/RxWTJ58bfdC+gLLxBfGnB6CwK0YQ\nxnfpjNbkUfVVzO0MQD7UP0Hl5ZcY0Puvxd/yHuONQn/rIAieTHH1pqgW+zrH/y3c\n59IGThC9PPtugI9ea8RSnVj3PWz1bX2UkCDpy9IRh9LzJLaYYX9RUd7++dULUlat\nAaXBh1U6emUDzhrIsgApjDVtimOPbmQWmX1S60mqQikRpVYZ8u+NDD+LNw+/Eovn\nxCj2Y3z1AgMBAAECggEAWDBzoqO1IvVXjBA2lqId10T6hXmN3j1ifyH+aAqK+FVl\nGjyWjDj0xWQcJ9ync7bQ6fSeTeNGzP0M6kzDU1+w6FgyZqwdmXWI2VmEizRjwk+/\n/uLQUcL7I55Dxn7KUoZs/rZPmQDxmGLoue60Gg6z3yLzVcKiDc7cnhzhdBgDc8vd\nQorNAlqGPRnm3EqKQ6VQp6fyQmCAxrr45kspRXNLddat3AMsuqImDkqGKBmF3Q1y\nxWGe81LphUiRqvqbyUlh6cdSZ8pLBpc9m0c3qWPKs9paqBIvgUPlvOZMqec6x4S6\nChbdkkTRLnbsRr0Yg/nDeEPlkhRBhasXpxpMUBgPywKBgQDs2axNkFjbU94uXvd5\nznUhDVxPFBuxyUHtsJNqW4p/ujLNimGet5E/YthCnQeC2P3Ym7c3fiz68amM6hiA\nOnW7HYPZ+jKFnefpAtjyOOs46AkftEg07T9XjwWNPt8+8l0DYawPoJgbM5iE0L2O\nx8TU1Vs4mXc+ql9F90GzI0x3VwKBgQDqZOOqWw3hTnNT07Ixqnmd3dugV9S7eW6o\nU9OoUgJB4rYTpG+yFqNqbRT8bkx37iKBMEReppqonOqGm4wtuRR6LSLlgcIU9Iwx\nyfH12UWqVmFSHsgZFqM/cK3wGev38h1WBIOx3/djKn7BdlKVh8kWyx6uC8bmV+E6\nOoK0vJD6kwKBgHAySOnROBZlqzkiKW8c+uU2VATtzJSydrWm0J4wUPJifNBa/hVW\ndcqmAzXC9xznt5AVa3wxHBOfyKaE+ig8CSsjNyNZ3vbmr0X04FoV1m91k2TeXNod\njMTobkPThaNm4eLJMN2SQJuaHGTGERWC0l3T18t+/zrDMDCPiSLX1NAvAoGBAN1T\nVLJYdjvIMxf1bm59VYcepbK7HLHFkRq6xMJMZbtG0ryraZjUzYvB4q4VjHk2UDiC\nlhx13tXWDZH7MJtABzjyg+AI7XWSEQs2cBXACos0M4Myc6lU+eL+iA+OuoUOhmrh\nqmT8YYGu76/IBWUSqWuvcpHPpwl7871i4Ga/I3qnAoGBANNkKAcMoeAbJQK7a/Rn\nwPEJB+dPgNDIaboAsh1nZhVhN5cvdvCWuEYgOGCPQLYQF0zmTLcM+sVxOYgfy8mV\nfbNgPgsP5xmu6dw2COBKdtozw0HrWSRjACd1N4yGu75+wPCcX/gQarcjRcXXZeEa\nNtBLSfcqPULqD+h7br9lEJio\n-----END PRIVATE KEY-----\n",
    "client_email": "123-abc@developer.gserviceaccount.com",
    "client_id": "123-abc.apps.googleusercontent.com",
    "auth_uri": "https://accounts.google.com/o/oauth2/auth",
    "token_uri": "http://localhost:8080/token",
    "GitLab-Comment": "This realistic test file is sourced from an Apache 2.0-licensed Google project https://github.com/google/oauth2l/blob/2105d6b0f3781e4ef97e1dd9c513f636dd721982/integration/fixtures/fake-service-account.json."
  }
