{
  "version": "15.0.7",
  "vulnerabilities": [
    {
      "id": ":SKIP:",
      "category": "sast",
      "name": "express_xss",
      "description": "Untrusted User Input in Response will result in Reflected Cross Site Scripting Vulnerability.",
      "cve": "index.js:28:express_xss:CWE-79",
      "severity": "High",
      "scanner": {
        "id": "nodejs-scan",
        "name": "NodeJsScan"
      },
      "location": {
        "file": "index.js",
        "start_line": 28
      },
      "identifiers": [
        {
          "type": "njsscan_rule_type",
          "name": "express_xss",
          "value": "Untrusted User Input in Response will result in Reflected Cross Site Scripting Vulnerability."
        },
        {
          "type": "cwe",
          "name": "CWE-79",
          "value": "express_xss"
        }
      ]
    },
    {
      "id": ":SKIP:",
      "category": "sast",
      "name": "express_xss",
      "description": "Untrusted User Input in Response will result in Reflected Cross Site Scripting Vulnerability.",
      "cve": "index.js:32:express_xss:CWE-79",
      "severity": "High",
      "scanner": {
        "id": "nodejs-scan",
        "name": "NodeJsScan"
      },
      "location": {
        "file": "index.js",
        "start_line": 32
      },
      "identifiers": [
        {
          "type": "njsscan_rule_type",
          "name": "express_xss",
          "value": "Untrusted User Input in Response will result in Reflected Cross Site Scripting Vulnerability."
        },
        {
          "type": "cwe",
          "name": "CWE-79",
          "value": "express_xss"
        }
      ]
    },
    {
      "id": ":SKIP:",
      "category": "sast",
      "name": "express_open_redirect",
      "description": "Untrusted user input in redirect() can result in Open Redirect vulnerability.",
      "cve": "index.js:51:express_open_redirect:CWE-601",
      "severity": "High",
      "scanner": {
        "id": "nodejs-scan",
        "name": "NodeJsScan"
      },
      "location": {
        "file": "index.js",
        "start_line": 51
      },
      "identifiers": [
        {
          "type": "njsscan_rule_type",
          "name": "express_open_redirect",
          "value": "Untrusted user input in redirect() can result in Open Redirect vulnerability."
        },
        {
          "type": "cwe",
          "name": "CWE-601",
          "value": "express_open_redirect"
        }
      ]
    },
    {
      "id": ":SKIP:",
      "category": "sast",
      "name": "pug_jade_template",
      "description": "The Pug.js/Jade.js template has an unescaped variable. Untrusted user input passed to this variable results in Cross Site Scripting (XSS).",
      "cve": "pug.pug:1:pug_jade_template:CWE-79",
      "severity": "High",
      "scanner": {
        "id": "nodejs-scan",
        "name": "NodeJsScan"
      },
      "location": {
        "file": "pug.pug",
        "start_line": 1
      },
      "identifiers": [
        {
          "type": "njsscan_rule_type",
          "name": "pug_jade_template",
          "value": "The Pug.js/Jade.js template has an unescaped variable. Untrusted user input passed to this variable results in Cross Site Scripting (XSS)."
        },
        {
          "type": "cwe",
          "name": "CWE-79",
          "value": "pug_jade_template"
        }
      ]
    },
    {
      "id": ":SKIP:",
      "category": "sast",
      "name": "node_insecure_random_generator",
      "description": "crypto.pseudoRandomBytes()/Math.random() is a cryptographically weak random number generator.",
      "cve": "index.js:42:node_insecure_random_generator:CWE-327",
      "severity": "Medium",
      "scanner": {
        "id": "nodejs-scan",
        "name": "NodeJsScan"
      },
      "location": {
        "file": "index.js",
        "start_line": 42
      },
      "identifiers": [
        {
          "type": "njsscan_rule_type",
          "name": "node_insecure_random_generator",
          "value": "crypto.pseudoRandomBytes()/Math.random() is a cryptographically weak random number generator."
        },
        {
          "type": "cwe",
          "name": "CWE-327",
          "value": "node_insecure_random_generator"
        }
      ]
    }
  ],
  "scan": {
    "analyzer": {
      "id": "nodejs-scan",
      "name": "NodeJsScan",
      "url": "https://gitlab.com/gitlab-org/security-products/analyzers/nodejs-scan",
      "vendor": {
        "name": "GitLab"
      },
      "version": ":SKIP:"
    },
    "scanner": {
      "id": "njsscan",
      "name": "njsscan",
      "url": "https://github.com/ajinabraham/njsscan",
      "vendor": {
        "name": "GitLab"
      },
      "version": ":SKIP:"
    },
    "type": "sast",
    "start_time": ":SKIP:",
    "end_time": ":SKIP:",
    "status": "success"
  }
}
