{
  "version": "15.0.7",
  "vulnerabilities": [
    {
      "id": "8c561a09341d52e7b6acb770ddb95f316f67de6dd043ed7d0db42055cf27cd5e",
      "category": "sast",
      "name": "android_webview_ignore_ssl",
      "description": "Insecure WebView Implementation. WebView ignores SSL Certificate errors and accept any SSL Certificate. This application is vulnerable to MITM attacks",
      "severity": "High",
      "scanner": {
        "id": "mobsf",
        "name": "MobSF"
      },
      "location": {
        "file": "myRepo/app/src/main/java/opensecurity/webviewignoressl/MainActivity.java",
        "start_line": 46
      },
      "identifiers": [
        {
          "type": "mobsf_rule_id",
          "name": "MobSF Rule ID android_webview_ignore_ssl",
          "value": "android_webview_ignore_ssl"
        }
      ]
    },
    {
      "id": "46bb1cdd8c4e7bdf0ce42afe9f88f0c183818113d8dc18b7364d317bdb5f3b83",
      "category": "sast",
      "name": "android_webview_ignore_ssl",
      "description": "Insecure WebView Implementation. WebView ignores SSL Certificate errors and accept any SSL Certificate. This application is vulnerable to MITM attacks",
      "severity": "High",
      "scanner": {
        "id": "mobsf",
        "name": "MobSF"
      },
      "location": {
        "file": "myRepo/app/src/main/java/opensecurity/webviewignoressl/MainActivity.java",
        "start_line": 50
      },
      "identifiers": [
        {
          "type": "mobsf_rule_id",
          "name": "MobSF Rule ID android_webview_ignore_ssl",
          "value": "android_webview_ignore_ssl"
        }
      ]
    }
  ],
  "scan": {
    "analyzer": {
      "id": "mobsf",
      "name": "MobSF",
      "url": "https://gitlab.com/gitlab-org/security-products/analyzers/mobsf",
      "vendor": {
        "name": "GitLab"
      },
      "version": "4.5.5"
    },
    "scanner": {
      "id": "mobsf",
      "name": "MobSF",
      "url": "https://github.com/MobSF/Mobile-Security-Framework-MobSF",
      "vendor": {
        "name": "GitLab"
      },
      "version": "3.6.0-gitlab.1"
    },
    "type": "sast",
    "start_time": "2023-11-16T13:19:11",
    "end_time": "2023-11-16T13:19:14",
    "status": "success"
  }
}
