{
    "version": "15.1.4",
    "vulnerabilities": [
        {
            "id": "904371e0ff40fc675ab4c1bddfd61f7f9cc226edc1ed80e0fd958db43e34f6ae",
            "category": "sast",
            "name": "S3 Bucket ACL Allows Read Or Write to All Users",
            "description": "S3 bucket with public READ/WRITE access",
            "cve": "kics_id:38c5ee0d-7f22-4260-ab72-5073048df100:82:0",
            "severity": "Critical",
            "scanner": {
                "id": "kics",
                "name": "kics"
            },
            "location": {
                "file": "s3_buckets.tf",
                "start_line": 82
            },
            "identifiers": [
                {
                    "type": "kics_id",
                    "name": "S3 Bucket ACL Allows Read Or Write to All Users",
                    "value": "38c5ee0d-7f22-4260-ab72-5073048df100",
                    "url": "https://registry.terraform.io/providers/hashicorp/aws/latest/docs/resources/s3_bucket"
                }
            ]
        },
        {
            "id": "335fc9bbda6260c567e3e740f5861d6ae98fc702599ada14a2c1623de54be272",
            "category": "sast",
            "name": "S3 Bucket ACL Allows Read Or Write to All Users",
            "description": "S3 bucket with public READ/WRITE access",
            "cve": "kics_id:38c5ee0d-7f22-4260-ab72-5073048df100:55:0",
            "severity": "Critical",
            "scanner": {
                "id": "kics",
                "name": "kics"
            },
            "location": {
                "file": "s3_buckets.tf",
                "start_line": 55
            },
            "identifiers": [
                {
                    "type": "kics_id",
                    "name": "S3 Bucket ACL Allows Read Or Write to All Users",
                    "value": "38c5ee0d-7f22-4260-ab72-5073048df100",
                    "url": "https://registry.terraform.io/providers/hashicorp/aws/latest/docs/resources/s3_bucket"
                }
            ]
        },
        {
            "id": "a65004c38df7d229ce1068091a4d15d0508fedd516be120476af673b4a060495",
            "category": "sast",
            "name": "S3 Bucket SSE Disabled",
            "description": "If algorithm is AES256 then the master key is null, empty or undefined, otherwise the master key is required",
            "cve": "kics_id:6726dcc0-5ff5-459d-b473-a780bef7665c:71:0",
            "severity": "Critical",
            "scanner": {
                "id": "kics",
                "name": "kics"
            },
            "location": {
                "file": "s3_buckets.tf",
                "start_line": 71
            },
            "identifiers": [
                {
                    "type": "kics_id",
                    "name": "S3 Bucket SSE Disabled",
                    "value": "6726dcc0-5ff5-459d-b473-a780bef7665c",
                    "url": "https://registry.terraform.io/providers/hashicorp/aws/latest/docs/resources/s3_bucket#server_side_encryption_configuration"
                }
            ]
        },
        {
            "id": "b419e81e3fc18b724c02b00163a50d288b38f5740e23f68790c8814ccde3238e",
            "category": "sast",
            "name": "S3 Bucket SSE Disabled",
            "description": "If algorithm is AES256 then the master key is null, empty or undefined, otherwise the master key is required",
            "cve": "kics_id:6726dcc0-5ff5-459d-b473-a780bef7665c:44:0",
            "severity": "Critical",
            "scanner": {
                "id": "kics",
                "name": "kics"
            },
            "location": {
                "file": "s3_buckets.tf",
                "start_line": 44
            },
            "identifiers": [
                {
                    "type": "kics_id",
                    "name": "S3 Bucket SSE Disabled",
                    "value": "6726dcc0-5ff5-459d-b473-a780bef7665c",
                    "url": "https://registry.terraform.io/providers/hashicorp/aws/latest/docs/resources/s3_bucket#server_side_encryption_configuration"
                }
            ]
        },
        {
            "id": "7af5273812f2a6a75d51c8513e481618ff5e0600ee33efa88aa3390eeeb76cb8",
            "category": "sast",
            "name": "S3 Bucket Without Enabled MFA Delete",
            "description": "Once MFA Delete is enabled on your sensitive and classified S3 bucket it requires the user to have two forms of authentication.\n",
            "cve": "kics_id:c5b31ab9-0f26-4a49-b8aa-4cc064392f4d:71:0",
            "severity": "Critical",
            "scanner": {
                "id": "kics",
                "name": "kics"
            },
            "location": {
                "file": "s3_buckets.tf",
                "start_line": 71
            },
            "identifiers": [
                {
                    "type": "kics_id",
                    "name": "S3 Bucket Without Enabled MFA Delete",
                    "value": "c5b31ab9-0f26-4a49-b8aa-4cc064392f4d",
                    "url": "https://registry.terraform.io/providers/hashicorp/aws/latest/docs/resources/s3_bucket#mfa_delete"
                }
            ]
        },
        {
            "id": "e4bc89120cc8af503994fe60a6a0d50b2e13584baaa35b71412d4c9f386ff265",
            "category": "sast",
            "name": "S3 Bucket Without Enabled MFA Delete",
            "description": "Once MFA Delete is enabled on your sensitive and classified S3 bucket it requires the user to have two forms of authentication.\n",
            "cve": "kics_id:c5b31ab9-0f26-4a49-b8aa-4cc064392f4d:80:0",
            "severity": "Critical",
            "scanner": {
                "id": "kics",
                "name": "kics"
            },
            "location": {
                "file": "s3_buckets.tf",
                "start_line": 80
            },
            "identifiers": [
                {
                    "type": "kics_id",
                    "name": "S3 Bucket Without Enabled MFA Delete",
                    "value": "c5b31ab9-0f26-4a49-b8aa-4cc064392f4d",
                    "url": "https://registry.terraform.io/providers/hashicorp/aws/latest/docs/resources/s3_bucket#mfa_delete"
                }
            ]
        },
        {
            "id": "cd378136cde4b94e1b06e4a0ae47f7797e202ec775772313bc3de482c8425db7",
            "category": "sast",
            "name": "S3 Bucket Without Enabled MFA Delete",
            "description": "Once MFA Delete is enabled on your sensitive and classified S3 bucket it requires the user to have two forms of authentication.\n",
            "cve": "kics_id:c5b31ab9-0f26-4a49-b8aa-4cc064392f4d:15:0",
            "severity": "Critical",
            "scanner": {
                "id": "kics",
                "name": "kics"
            },
            "location": {
                "file": "s3_buckets.tf",
                "start_line": 15
            },
            "identifiers": [
                {
                    "type": "kics_id",
                    "name": "S3 Bucket Without Enabled MFA Delete",
                    "value": "c5b31ab9-0f26-4a49-b8aa-4cc064392f4d",
                    "url": "https://registry.terraform.io/providers/hashicorp/aws/latest/docs/resources/s3_bucket#mfa_delete"
                }
            ]
        },
        {
            "id": "9d0ed9940cd908cb84fff555ae7569979cc3bbcd03671a53fda5559a9cfb7c93",
            "category": "sast",
            "name": "S3 Bucket Without Enabled MFA Delete",
            "description": "Once MFA Delete is enabled on your sensitive and classified S3 bucket it requires the user to have two forms of authentication.\n",
            "cve": "kics_id:c5b31ab9-0f26-4a49-b8aa-4cc064392f4d:32:0",
            "severity": "Critical",
            "scanner": {
                "id": "kics",
                "name": "kics"
            },
            "location": {
                "file": "s3_buckets.tf",
                "start_line": 32
            },
            "identifiers": [
                {
                    "type": "kics_id",
                    "name": "S3 Bucket Without Enabled MFA Delete",
                    "value": "c5b31ab9-0f26-4a49-b8aa-4cc064392f4d",
                    "url": "https://registry.terraform.io/providers/hashicorp/aws/latest/docs/resources/s3_bucket#mfa_delete"
                }
            ]
        },
        {
            "id": "13fa261048c95a4a6c1267fa33d140aa1078f94bcddd4d55cdae25cfd2bbf953",
            "category": "sast",
            "name": "S3 Bucket Without Enabled MFA Delete",
            "description": "Once MFA Delete is enabled on your sensitive and classified S3 bucket it requires the user to have two forms of authentication.\n",
            "cve": "kics_id:c5b31ab9-0f26-4a49-b8aa-4cc064392f4d:5:0",
            "severity": "Critical",
            "scanner": {
                "id": "kics",
                "name": "kics"
            },
            "location": {
                "file": "modules/acme_bucket/main.tf",
                "start_line": 5
            },
            "identifiers": [
                {
                    "type": "kics_id",
                    "name": "S3 Bucket Without Enabled MFA Delete",
                    "value": "c5b31ab9-0f26-4a49-b8aa-4cc064392f4d",
                    "url": "https://registry.terraform.io/providers/hashicorp/aws/latest/docs/resources/s3_bucket#mfa_delete"
                }
            ]
        },
        {
            "id": "fd510417a0b2a4215749f362a0ae1f8e1bfbaadd8cfaf98a2254625c108528b4",
            "category": "sast",
            "name": "S3 Bucket Without Enabled MFA Delete",
            "description": "Once MFA Delete is enabled on your sensitive and classified S3 bucket it requires the user to have two forms of authentication.\n",
            "cve": "kics_id:c5b31ab9-0f26-4a49-b8aa-4cc064392f4d:53:0",
            "severity": "Critical",
            "scanner": {
                "id": "kics",
                "name": "kics"
            },
            "location": {
                "file": "s3_buckets.tf",
                "start_line": 53
            },
            "identifiers": [
                {
                    "type": "kics_id",
                    "name": "S3 Bucket Without Enabled MFA Delete",
                    "value": "c5b31ab9-0f26-4a49-b8aa-4cc064392f4d",
                    "url": "https://registry.terraform.io/providers/hashicorp/aws/latest/docs/resources/s3_bucket#mfa_delete"
                }
            ]
        },
        {
            "id": "fd39412a0bb7be0d08efe3ebae809e0fb8055131241b1c18731b71b60433fa73",
            "category": "sast",
            "name": "S3 Bucket Without Enabled MFA Delete",
            "description": "Once MFA Delete is enabled on your sensitive and classified S3 bucket it requires the user to have two forms of authentication.\n",
            "cve": "kics_id:c5b31ab9-0f26-4a49-b8aa-4cc064392f4d:44:0",
            "severity": "Critical",
            "scanner": {
                "id": "kics",
                "name": "kics"
            },
            "location": {
                "file": "s3_buckets.tf",
                "start_line": 44
            },
            "identifiers": [
                {
                    "type": "kics_id",
                    "name": "S3 Bucket Without Enabled MFA Delete",
                    "value": "c5b31ab9-0f26-4a49-b8aa-4cc064392f4d",
                    "url": "https://registry.terraform.io/providers/hashicorp/aws/latest/docs/resources/s3_bucket#mfa_delete"
                }
            ]
        },
        {
            "id": "a2e4385c22f2649669b08bedbb850fa519a0500415155ceb7d08ced11291c5be",
            "category": "sast",
            "name": "S3 Bucket Without Versioning",
            "description": "S3 bucket should have versioning enabled",
            "cve": "kics_id:568a4d22-3517-44a6-a7ad-6a7eed88722c:44:0",
            "severity": "Medium",
            "scanner": {
                "id": "kics",
                "name": "kics"
            },
            "location": {
                "file": "s3_buckets.tf",
                "start_line": 44
            },
            "identifiers": [
                {
                    "type": "kics_id",
                    "name": "S3 Bucket Without Versioning",
                    "value": "568a4d22-3517-44a6-a7ad-6a7eed88722c",
                    "url": "https://registry.terraform.io/providers/hashicorp/aws/latest/docs/resources/s3_bucket#versioning"
                }
            ]
        },
        {
            "id": "deb684def4eca0a956fc6df4991dcf5d9d8e69be742b2347d6ef769575676f31",
            "category": "sast",
            "name": "S3 Bucket Without Versioning",
            "description": "S3 bucket should have versioning enabled",
            "cve": "kics_id:568a4d22-3517-44a6-a7ad-6a7eed88722c:15:0",
            "severity": "Medium",
            "scanner": {
                "id": "kics",
                "name": "kics"
            },
            "location": {
                "file": "s3_buckets.tf",
                "start_line": 15
            },
            "identifiers": [
                {
                    "type": "kics_id",
                    "name": "S3 Bucket Without Versioning",
                    "value": "568a4d22-3517-44a6-a7ad-6a7eed88722c",
                    "url": "https://registry.terraform.io/providers/hashicorp/aws/latest/docs/resources/s3_bucket#versioning"
                }
            ]
        },
        {
            "id": "01c41488ff6c55c0a727dd1df9ae9cbceb4e198b5a3749cced3cb040b6f85593",
            "category": "sast",
            "name": "S3 Bucket Without Versioning",
            "description": "S3 bucket should have versioning enabled",
            "cve": "kics_id:568a4d22-3517-44a6-a7ad-6a7eed88722c:80:0",
            "severity": "Medium",
            "scanner": {
                "id": "kics",
                "name": "kics"
            },
            "location": {
                "file": "s3_buckets.tf",
                "start_line": 80
            },
            "identifiers": [
                {
                    "type": "kics_id",
                    "name": "S3 Bucket Without Versioning",
                    "value": "568a4d22-3517-44a6-a7ad-6a7eed88722c",
                    "url": "https://registry.terraform.io/providers/hashicorp/aws/latest/docs/resources/s3_bucket#versioning"
                }
            ]
        },
        {
            "id": "187e3ee1c3acd74772914cb5d4f0f0bc16d9c0423cdeb6bb8b40f0251096ba4f",
            "category": "sast",
            "name": "S3 Bucket Without Versioning",
            "description": "S3 bucket should have versioning enabled",
            "cve": "kics_id:568a4d22-3517-44a6-a7ad-6a7eed88722c:71:0",
            "severity": "Medium",
            "scanner": {
                "id": "kics",
                "name": "kics"
            },
            "location": {
                "file": "s3_buckets.tf",
                "start_line": 71
            },
            "identifiers": [
                {
                    "type": "kics_id",
                    "name": "S3 Bucket Without Versioning",
                    "value": "568a4d22-3517-44a6-a7ad-6a7eed88722c",
                    "url": "https://registry.terraform.io/providers/hashicorp/aws/latest/docs/resources/s3_bucket#versioning"
                }
            ]
        },
        {
            "id": "d8a4cea2cfc278a36978b0bd4953f933c8393d104a31c55611ec8524cca44df8",
            "category": "sast",
            "name": "S3 Bucket Without Versioning",
            "description": "S3 bucket should have versioning enabled",
            "cve": "kics_id:568a4d22-3517-44a6-a7ad-6a7eed88722c:32:0",
            "severity": "Medium",
            "scanner": {
                "id": "kics",
                "name": "kics"
            },
            "location": {
                "file": "s3_buckets.tf",
                "start_line": 32
            },
            "identifiers": [
                {
                    "type": "kics_id",
                    "name": "S3 Bucket Without Versioning",
                    "value": "568a4d22-3517-44a6-a7ad-6a7eed88722c",
                    "url": "https://registry.terraform.io/providers/hashicorp/aws/latest/docs/resources/s3_bucket#versioning"
                }
            ]
        },
        {
            "id": "5c2f3e2129008acc3c1e6131e63657d5ae5decad28f035089d4f640252643ccc",
            "category": "sast",
            "name": "S3 Bucket Without Versioning",
            "description": "S3 bucket should have versioning enabled",
            "cve": "kics_id:568a4d22-3517-44a6-a7ad-6a7eed88722c:5:0",
            "severity": "Medium",
            "scanner": {
                "id": "kics",
                "name": "kics"
            },
            "location": {
                "file": "modules/acme_bucket/main.tf",
                "start_line": 5
            },
            "identifiers": [
                {
                    "type": "kics_id",
                    "name": "S3 Bucket Without Versioning",
                    "value": "568a4d22-3517-44a6-a7ad-6a7eed88722c",
                    "url": "https://registry.terraform.io/providers/hashicorp/aws/latest/docs/resources/s3_bucket#versioning"
                }
            ]
        },
        {
            "id": "236948b1a989447038146380bdf42019dcad901e99d55f0e5235ac2b8f588713",
            "category": "sast",
            "name": "S3 Bucket Without Versioning",
            "description": "S3 bucket should have versioning enabled",
            "cve": "kics_id:568a4d22-3517-44a6-a7ad-6a7eed88722c:53:0",
            "severity": "Medium",
            "scanner": {
                "id": "kics",
                "name": "kics"
            },
            "location": {
                "file": "s3_buckets.tf",
                "start_line": 53
            },
            "identifiers": [
                {
                    "type": "kics_id",
                    "name": "S3 Bucket Without Versioning",
                    "value": "568a4d22-3517-44a6-a7ad-6a7eed88722c",
                    "url": "https://registry.terraform.io/providers/hashicorp/aws/latest/docs/resources/s3_bucket#versioning"
                }
            ]
        },
        {
            "id": "6743c0836416f1f667a9ddf06790b4fbba50ed3b8a32bcdf0fa2b53414aa72ba",
            "category": "sast",
            "name": "S3 Bucket Logging Disabled",
            "description": "S3 bucket without logging",
            "cve": "kics_id:f861041c-8c9f-4156-acfc-5e6e524f5884:32:0",
            "severity": "Info",
            "scanner": {
                "id": "kics",
                "name": "kics"
            },
            "location": {
                "file": "s3_buckets.tf",
                "start_line": 32
            },
            "identifiers": [
                {
                    "type": "kics_id",
                    "name": "S3 Bucket Logging Disabled",
                    "value": "f861041c-8c9f-4156-acfc-5e6e524f5884",
                    "url": "https://registry.terraform.io/providers/hashicorp/aws/latest/docs/resources/s3_bucket"
                }
            ]
        },
        {
            "id": "00914cb838c86f6fd8b60c175ddb57b7e100a275ba34514e32f6b18c033df88b",
            "category": "sast",
            "name": "Name Is Not Snake Case",
            "description": "All names should follow snake case pattern.",
            "cve": "kics_id:1e434b25-8763-4b00-a5ca-ca03b7abbb66:15:0",
            "severity": "Info",
            "scanner": {
                "id": "kics",
                "name": "kics"
            },
            "location": {
                "file": "s3_buckets.tf",
                "start_line": 15
            },
            "identifiers": [
                {
                    "type": "kics_id",
                    "name": "Name Is Not Snake Case",
                    "value": "1e434b25-8763-4b00-a5ca-ca03b7abbb66",
                    "url": "https://www.terraform.io/docs/extend/best-practices/naming.html#naming"
                }
            ]
        },
        {
            "id": "1067d93d9bcb1d00d20d597a1c6c165132791a0ddb495f400eebda1abee32336",
            "category": "sast",
            "name": "Name Is Not Snake Case",
            "description": "All names should follow snake case pattern.",
            "cve": "kics_id:1e434b25-8763-4b00-a5ca-ca03b7abbb66:80:0",
            "severity": "Info",
            "scanner": {
                "id": "kics",
                "name": "kics"
            },
            "location": {
                "file": "s3_buckets.tf",
                "start_line": 80
            },
            "identifiers": [
                {
                    "type": "kics_id",
                    "name": "Name Is Not Snake Case",
                    "value": "1e434b25-8763-4b00-a5ca-ca03b7abbb66",
                    "url": "https://www.terraform.io/docs/extend/best-practices/naming.html#naming"
                }
            ]
        },
        {
            "id": "8f8a8124e0a692db730941a74b9edcd79b0c107835ad672c5ca0bcd6764aaf40",
            "category": "sast",
            "name": "Name Is Not Snake Case",
            "description": "All names should follow snake case pattern.",
            "cve": "kics_id:1e434b25-8763-4b00-a5ca-ca03b7abbb66:71:0",
            "severity": "Info",
            "scanner": {
                "id": "kics",
                "name": "kics"
            },
            "location": {
                "file": "s3_buckets.tf",
                "start_line": 71
            },
            "identifiers": [
                {
                    "type": "kics_id",
                    "name": "Name Is Not Snake Case",
                    "value": "1e434b25-8763-4b00-a5ca-ca03b7abbb66",
                    "url": "https://www.terraform.io/docs/extend/best-practices/naming.html#naming"
                }
            ]
        },
        {
            "id": "3a040429eb1172d5a0b2daabfb7779b48f305e5de4572b520d191ddca06f823b",
            "category": "sast",
            "name": "Name Is Not Snake Case",
            "description": "All names should follow snake case pattern.",
            "cve": "kics_id:1e434b25-8763-4b00-a5ca-ca03b7abbb66:53:0",
            "severity": "Info",
            "scanner": {
                "id": "kics",
                "name": "kics"
            },
            "location": {
                "file": "s3_buckets.tf",
                "start_line": 53
            },
            "identifiers": [
                {
                    "type": "kics_id",
                    "name": "Name Is Not Snake Case",
                    "value": "1e434b25-8763-4b00-a5ca-ca03b7abbb66",
                    "url": "https://www.terraform.io/docs/extend/best-practices/naming.html#naming"
                }
            ]
        },
        {
            "id": "bae2d2561def1b25875335b1ac6c92241f47bedba19cb6626bc6a122d49e5072",
            "category": "sast",
            "name": "Name Is Not Snake Case",
            "description": "All names should follow snake case pattern.",
            "cve": "kics_id:1e434b25-8763-4b00-a5ca-ca03b7abbb66:44:0",
            "severity": "Info",
            "scanner": {
                "id": "kics",
                "name": "kics"
            },
            "location": {
                "file": "s3_buckets.tf",
                "start_line": 44
            },
            "identifiers": [
                {
                    "type": "kics_id",
                    "name": "Name Is Not Snake Case",
                    "value": "1e434b25-8763-4b00-a5ca-ca03b7abbb66",
                    "url": "https://www.terraform.io/docs/extend/best-practices/naming.html#naming"
                }
            ]
        },
        {
            "id": "2497e242c659b7a56ebc261701913c3b1c53862218699f4179f8dbf35a56af23",
            "category": "sast",
            "name": "Name Is Not Snake Case",
            "description": "All names should follow snake case pattern.",
            "cve": "kics_id:1e434b25-8763-4b00-a5ca-ca03b7abbb66:32:0",
            "severity": "Info",
            "scanner": {
                "id": "kics",
                "name": "kics"
            },
            "location": {
                "file": "s3_buckets.tf",
                "start_line": 32
            },
            "identifiers": [
                {
                    "type": "kics_id",
                    "name": "Name Is Not Snake Case",
                    "value": "1e434b25-8763-4b00-a5ca-ca03b7abbb66",
                    "url": "https://www.terraform.io/docs/extend/best-practices/naming.html#naming"
                }
            ]
        },
        {
            "id": "ddb438721cedcb60608b8da454f4e6ec0b61d3d1ce2ca2ebcb3653ecde24ee53",
            "category": "sast",
            "name": "Output Without Description",
            "description": "All outputs should contain a valid description.",
            "cve": "kics_id:59312e8a-a64e-41e7-a252-618533dd1ea8:1:0",
            "severity": "Info",
            "scanner": {
                "id": "kics",
                "name": "kics"
            },
            "location": {
                "file": "modules/acme_bucket/outputs.tf",
                "start_line": 1
            },
            "identifiers": [
                {
                    "type": "kics_id",
                    "name": "Output Without Description",
                    "value": "59312e8a-a64e-41e7-a252-618533dd1ea8",
                    "url": "https://www.terraform.io/docs/language/values/outputs.html#description-output-value-documentation"
                }
            ]
        },
        {
            "id": "e71bddb22517749e6cb3f12eea7966ea0d5ae99e081458189e06987c228b5f13",
            "category": "sast",
            "name": "Resource Not Using Tags",
            "description": "AWS services resource tags are an essential part of managing components",
            "cve": "kics_id:e38a8e0a-b88b-4902-b3fe-b0fcb17d5c10:44:0",
            "severity": "Info",
            "scanner": {
                "id": "kics",
                "name": "kics"
            },
            "location": {
                "file": "s3_buckets.tf",
                "start_line": 44
            },
            "identifiers": [
                {
                    "type": "kics_id",
                    "name": "Resource Not Using Tags",
                    "value": "e38a8e0a-b88b-4902-b3fe-b0fcb17d5c10",
                    "url": "https://registry.terraform.io/providers/hashicorp/aws/latest/docs/guides/resource-tagging"
                }
            ]
        },
        {
            "id": "91a9567c395973d769ed52788b44281bca26d6a3c31a4a80b3795ca87e5b66fe",
            "category": "sast",
            "name": "Resource Not Using Tags",
            "description": "AWS services resource tags are an essential part of managing components",
            "cve": "kics_id:e38a8e0a-b88b-4902-b3fe-b0fcb17d5c10:71:0",
            "severity": "Info",
            "scanner": {
                "id": "kics",
                "name": "kics"
            },
            "location": {
                "file": "s3_buckets.tf",
                "start_line": 71
            },
            "identifiers": [
                {
                    "type": "kics_id",
                    "name": "Resource Not Using Tags",
                    "value": "e38a8e0a-b88b-4902-b3fe-b0fcb17d5c10",
                    "url": "https://registry.terraform.io/providers/hashicorp/aws/latest/docs/guides/resource-tagging"
                }
            ]
        },
        {
            "id": "70b003b6fc7474f7334b977d2100906be45dfc08de1d707d872a9e2f5627c8d0",
            "category": "sast",
            "name": "Resource Not Using Tags",
            "description": "AWS services resource tags are an essential part of managing components",
            "cve": "kics_id:e38a8e0a-b88b-4902-b3fe-b0fcb17d5c10:80:0",
            "severity": "Info",
            "scanner": {
                "id": "kics",
                "name": "kics"
            },
            "location": {
                "file": "s3_buckets.tf",
                "start_line": 80
            },
            "identifiers": [
                {
                    "type": "kics_id",
                    "name": "Resource Not Using Tags",
                    "value": "e38a8e0a-b88b-4902-b3fe-b0fcb17d5c10",
                    "url": "https://registry.terraform.io/providers/hashicorp/aws/latest/docs/guides/resource-tagging"
                }
            ]
        },
        {
            "id": "3eb05acb29fe08b3c9e5ebeafce08e19a8be9b370e8b35ee1a57f269fd711d0c",
            "category": "sast",
            "name": "Resource Not Using Tags",
            "description": "AWS services resource tags are an essential part of managing components",
            "cve": "kics_id:e38a8e0a-b88b-4902-b3fe-b0fcb17d5c10:5:0",
            "severity": "Info",
            "scanner": {
                "id": "kics",
                "name": "kics"
            },
            "location": {
                "file": "modules/acme_bucket/main.tf",
                "start_line": 5
            },
            "identifiers": [
                {
                    "type": "kics_id",
                    "name": "Resource Not Using Tags",
                    "value": "e38a8e0a-b88b-4902-b3fe-b0fcb17d5c10",
                    "url": "https://registry.terraform.io/providers/hashicorp/aws/latest/docs/guides/resource-tagging"
                }
            ]
        },
        {
            "id": "cbd7ce8e70981635680fa71922eebdae2248f7986c6a1ebb07ab2d608229aa6e",
            "category": "sast",
            "name": "Resource Not Using Tags",
            "description": "AWS services resource tags are an essential part of managing components",
            "cve": "kics_id:e38a8e0a-b88b-4902-b3fe-b0fcb17d5c10:32:0",
            "severity": "Info",
            "scanner": {
                "id": "kics",
                "name": "kics"
            },
            "location": {
                "file": "s3_buckets.tf",
                "start_line": 32
            },
            "identifiers": [
                {
                    "type": "kics_id",
                    "name": "Resource Not Using Tags",
                    "value": "e38a8e0a-b88b-4902-b3fe-b0fcb17d5c10",
                    "url": "https://registry.terraform.io/providers/hashicorp/aws/latest/docs/guides/resource-tagging"
                }
            ]
        },
        {
            "id": "a66f195c2817c1d76b1a4e91656bc71857273ea796b1f0666323e99d85bc80cc",
            "category": "sast",
            "name": "Resource Not Using Tags",
            "description": "AWS services resource tags are an essential part of managing components",
            "cve": "kics_id:e38a8e0a-b88b-4902-b3fe-b0fcb17d5c10:53:0",
            "severity": "Info",
            "scanner": {
                "id": "kics",
                "name": "kics"
            },
            "location": {
                "file": "s3_buckets.tf",
                "start_line": 53
            },
            "identifiers": [
                {
                    "type": "kics_id",
                    "name": "Resource Not Using Tags",
                    "value": "e38a8e0a-b88b-4902-b3fe-b0fcb17d5c10",
                    "url": "https://registry.terraform.io/providers/hashicorp/aws/latest/docs/guides/resource-tagging"
                }
            ]
        },
        {
            "id": "e863bfc50a149452d5112aa0fe44cb3a3637c0269441df36550faa1fb3cd492c",
            "category": "sast",
            "name": "Resource Not Using Tags",
            "description": "AWS services resource tags are an essential part of managing components",
            "cve": "kics_id:e38a8e0a-b88b-4902-b3fe-b0fcb17d5c10:15:0",
            "severity": "Info",
            "scanner": {
                "id": "kics",
                "name": "kics"
            },
            "location": {
                "file": "s3_buckets.tf",
                "start_line": 15
            },
            "identifiers": [
                {
                    "type": "kics_id",
                    "name": "Resource Not Using Tags",
                    "value": "e38a8e0a-b88b-4902-b3fe-b0fcb17d5c10",
                    "url": "https://registry.terraform.io/providers/hashicorp/aws/latest/docs/guides/resource-tagging"
                }
            ]
        },
        {
            "id": "47c5afe357f1973ba6031de4c21e7329e1eca0374a790c3fd145f17119f9fa26",
            "category": "sast",
            "name": "Variable Without Type",
            "description": "All variables should contain a valid type.",
            "cve": "kics_id:fc5109bf-01fd-49fb-8bde-4492b543c34a:1:0",
            "severity": "Info",
            "scanner": {
                "id": "kics",
                "name": "kics"
            },
            "location": {
                "file": "variables.tf",
                "start_line": 1
            },
            "identifiers": [
                {
                    "type": "kics_id",
                    "name": "Variable Without Type",
                    "value": "fc5109bf-01fd-49fb-8bde-4492b543c34a",
                    "url": "https://www.terraform.io/docs/language/values/variables.html#input-variable-documentation"
                }
            ]
        },
        {
            "id": "6af8d72f48922acdb1f3eedc4cea57d045b6aff1720030a31911d0c1ac4b594b",
            "category": "sast",
            "name": "Variable Without Type",
            "description": "All variables should contain a valid type.",
            "cve": "kics_id:fc5109bf-01fd-49fb-8bde-4492b543c34a:10:0",
            "severity": "Info",
            "scanner": {
                "id": "kics",
                "name": "kics"
            },
            "location": {
                "file": "modules/acme_bucket/variables.tf",
                "start_line": 10
            },
            "identifiers": [
                {
                    "type": "kics_id",
                    "name": "Variable Without Type",
                    "value": "fc5109bf-01fd-49fb-8bde-4492b543c34a",
                    "url": "https://www.terraform.io/docs/language/values/variables.html#input-variable-documentation"
                }
            ]
        },
        {
            "id": "f8f97be11a9417699756f5db0c7da7500211cbf571907d0f0e38b06f24138dfa",
            "category": "sast",
            "name": "Variable Without Type",
            "description": "All variables should contain a valid type.",
            "cve": "kics_id:fc5109bf-01fd-49fb-8bde-4492b543c34a:1:0",
            "severity": "Info",
            "scanner": {
                "id": "kics",
                "name": "kics"
            },
            "location": {
                "file": "modules/acme_bucket/variables.tf",
                "start_line": 1
            },
            "identifiers": [
                {
                    "type": "kics_id",
                    "name": "Variable Without Type",
                    "value": "fc5109bf-01fd-49fb-8bde-4492b543c34a",
                    "url": "https://www.terraform.io/docs/language/values/variables.html#input-variable-documentation"
                }
            ]
        },
        {
            "id": "290de333e2c17c52ef247f42738c11630c48703b3f4b3d5e33833435b8180cd8",
            "category": "sast",
            "name": "Variable Without Type",
            "description": "All variables should contain a valid type.",
            "cve": "kics_id:fc5109bf-01fd-49fb-8bde-4492b543c34a:5:0",
            "severity": "Info",
            "scanner": {
                "id": "kics",
                "name": "kics"
            },
            "location": {
                "file": "modules/acme_bucket/variables.tf",
                "start_line": 5
            },
            "identifiers": [
                {
                    "type": "kics_id",
                    "name": "Variable Without Type",
                    "value": "fc5109bf-01fd-49fb-8bde-4492b543c34a",
                    "url": "https://www.terraform.io/docs/language/values/variables.html#input-variable-documentation"
                }
            ]
        }
    ],
    "scan": {
        "analyzer": {
            "id": "",
            "name": "",
            "vendor": {
                "name": ""
            },
            "version": ""
        },
        "scanner": {
            "id": "",
            "name": "",
            "vendor": {
                "name": ""
            },
            "version": ""
        },
        "primary_identifiers": [
            {
                "type": "kics_id",
                "name": "Name Is Not Snake Case",
                "value": "1e434b25-8763-4b00-a5ca-ca03b7abbb66",
                "url": "https://www.terraform.io/docs/extend/best-practices/naming.html#naming"
            },
            {
                "type": "kics_id",
                "name": "S3 Bucket ACL Allows Read Or Write to All Users",
                "value": "38c5ee0d-7f22-4260-ab72-5073048df100",
                "url": "https://registry.terraform.io/providers/hashicorp/aws/latest/docs/resources/s3_bucket"
            },
            {
                "type": "kics_id",
                "name": "S3 Bucket Without Versioning",
                "value": "568a4d22-3517-44a6-a7ad-6a7eed88722c",
                "url": "https://registry.terraform.io/providers/hashicorp/aws/latest/docs/resources/s3_bucket#versioning"
            },
            {
                "type": "kics_id",
                "name": "Output Without Description",
                "value": "59312e8a-a64e-41e7-a252-618533dd1ea8",
                "url": "https://www.terraform.io/docs/language/values/outputs.html#description-output-value-documentation"
            },
            {
                "type": "kics_id",
                "name": "S3 Bucket SSE Disabled",
                "value": "6726dcc0-5ff5-459d-b473-a780bef7665c",
                "url": "https://registry.terraform.io/providers/hashicorp/aws/latest/docs/resources/s3_bucket#server_side_encryption_configuration"
            },
            {
                "type": "kics_id",
                "name": "S3 Bucket Without Enabled MFA Delete",
                "value": "c5b31ab9-0f26-4a49-b8aa-4cc064392f4d",
                "url": "https://registry.terraform.io/providers/hashicorp/aws/latest/docs/resources/s3_bucket#mfa_delete"
            },
            {
                "type": "kics_id",
                "name": "Resource Not Using Tags",
                "value": "e38a8e0a-b88b-4902-b3fe-b0fcb17d5c10",
                "url": "https://registry.terraform.io/providers/hashicorp/aws/latest/docs/guides/resource-tagging"
            },
            {
                "type": "kics_id",
                "name": "S3 Bucket Logging Disabled",
                "value": "f861041c-8c9f-4156-acfc-5e6e524f5884",
                "url": "https://registry.terraform.io/providers/hashicorp/aws/latest/docs/resources/s3_bucket"
            },
            {
                "type": "kics_id",
                "name": "Variable Without Type",
                "value": "fc5109bf-01fd-49fb-8bde-4492b543c34a",
                "url": "https://www.terraform.io/docs/language/values/variables.html#input-variable-documentation"
            }
        ],
        "type": ""
    }
}