{
  "version": "15.0.7",
  "vulnerabilities": [
    {
      "id": ":SKIP:",
      "category": "sast",
      "message": "Does not check for buffer overflows when copying to destination [MS-banned] (CWE-120).",
      "cve": "src/hello.cpp:331c04062c4fe0c7c486f66f59e82ad146ab33cdd76ae757ca41f392d568cbd0:CWE-120",
      "severity": "Low",
      "solution": "Consider using snprintf, strcpy_s, or strlcpy (warning: strncpy easily misused).",
      "scanner": {
        "id": "flawfinder",
        "name": "Flawfinder"
      },
      "location": {
        "file": "src/hello.cpp",
        "start_line": 7
      },
      "identifiers": [
        {
          "type": "flawfinder_func_name",
          "name": "Flawfinder - strcpy",
          "value": "strcpy"
        },
        {
          "type": "cwe",
          "name": "CWE-120",
          "value": "120",
          "url": "https://cwe.mitre.org/data/definitions/120.html"
        }
      ],
      "tracking": {
        "type": "source",
        "items": [
          {
            "file": "src/hello.cpp",
            "line_start": 7,
            "line_end": 7,
            "signatures": [
              {
                "algorithm": "scope_offset",
                "value": "src/hello.cpp|hello()[0]:2"
              }
            ]
          }
        ]
      }
    },
    {
      "id": ":SKIP:",
      "category": "sast",
      "message": "Statically-sized arrays can be improperly restricted, leading to potential overflows or other issues (CWE-119!/CWE-120).",
      "cve": "src/hello.cpp:c8c6dd0afdae6814194cf0930b719f757ab7b379cf8f261e7f4f9f2f323a818a:CWE-119!/CWE-120",
      "severity": "Low",
      "solution": "Perform bounds checking, use functions that limit length, or ensure that the size is larger than the maximum possible length.",
      "scanner": {
        "id": "flawfinder",
        "name": "Flawfinder"
      },
      "location": {
        "file": "src/hello.cpp",
        "start_line": 6
      },
      "identifiers": [
        {
          "type": "flawfinder_func_name",
          "name": "Flawfinder - char",
          "value": "char"
        },
        {
          "type": "cwe",
          "name": "CWE-119",
          "value": "119",
          "url": "https://cwe.mitre.org/data/definitions/119.html"
        },
        {
          "type": "cwe",
          "name": "CWE-120",
          "value": "120",
          "url": "https://cwe.mitre.org/data/definitions/120.html"
        }
      ],
      "tracking": {
        "type": "source",
        "items": [
          {
            "file": "src/hello.cpp",
            "line_start": 6,
            "line_end": 6,
            "signatures": [
              {
                "algorithm": "scope_offset",
                "value": "src/hello.cpp|hello()[0]:1"
              }
            ]
          }
        ]
      }
    }
  ],
  "dependency_files": null,
  "scan": {
    "analyzer": {
      "id": "flawfinder",
      "name": "Flawfinder",
      "url": "https://gitlab.com/gitlab-org/security-products/analyzers/flawfinder",
      "vendor": {
        "name": "GitLab"
      },
      "version": ":SKIP:"
    },
    "scanner": {
      "id": "flawfinder",
      "name": "Flawfinder",
      "url": "https://www.dwheeler.com/flawfinder",
      "vendor": {
        "name": "GitLab"
      },
      "version": ":SKIP:"
    },
    "type": "sast",
    "start_time": ":SKIP:",
    "end_time": ":SKIP:",
    "status": "success"
  }
}
