
{
  "version": "14.0.0",
  "vulnerabilities": [
    {
      "category": "dependency_scanning",
      "name": "Prototype pollution attack",
      "message": "Prototype pollution attack in extend",
      "cve": "package.json:extend:hackerone:381185",
      "severity": "Critical",
      "scanner": {
        "id": "retire.js",
        "name": "Retire.js"
      },
      "location": {
        "file": "package.json",
        "dependency": {
          "package": {
            "name": "extend"
          },
          "version": "3.0.1"
        }
      },
      "identifiers": [
        {
          "type": "hackerone",
          "name": "HACKERONE-381185",
          "value": "381185",
          "url": "https://hackerone.com/reports/381185"
        }
      ],
      "links": [
        {
          "url": "https://hackerone.com/reports/381185"
        }
      ]
    },
    {
      "category": "dependency_scanning",
      "name": "growl_command-injection",
      "message": "growl_command-injection in growl",
      "cve": "package.json:growl:npm:146",
      "severity": "High",
      "scanner": {
        "id": "retire.js",
        "name": "Retire.js"
      },
      "location": {
        "file": "package.json",
        "dependency": {
          "package": {
            "name": "growl"
          },
          "version": "1.9.2"
        }
      },
      "identifiers": [
        {
          "type": "npm",
          "name": "NPM-146",
          "value": "146",
          "url": "https://www.npmjs.com/advisories/146"
        }
      ],
      "links": [
        {
          "url": "https://nodesecurity.io/advisories/146"
        }
      ]
    },
    {
      "category": "dependency_scanning",
      "name": "A prototype pollution vulnerability in handlebars is exploitable if an attacker can control the template",
      "message": "A prototype pollution vulnerability in handlebars is exploitable if an attacker can control the template in handlebars.js",
      "cve": "package.json:handlebars.js:retire.js:baf1b2b5f9a7c1dc0fb152365126e6c3",
      "severity": "High",
      "scanner": {
        "id": "retire.js",
        "name": "Retire.js"
      },
      "location": {
        "file": "package.json",
        "dependency": {
          "package": {
            "name": "handlebars.js"
          },
          "version": "4.0.11"
        }
      },
      "identifiers": [
        {
          "type": "retire.js",
          "name": "RETIRE-JS-baf1b2b5f9a7c1dc0fb152365126e6c3",
          "value": "baf1b2b5f9a7c1dc0fb152365126e6c3",
          "url": "https://snyk.io/vuln/SNYK-JS-HANDLEBARS-174183"
        }
      ],
      "links": [
        {
          "url": "https://snyk.io/vuln/SNYK-JS-HANDLEBARS-174183"
        },
        {
          "url": "https://github.com/wycats/handlebars.js/issues/1495"
        },
        {
          "url": "https://github.com/wycats/handlebars.js/commit/cd38583216dce3252831916323202749431c773e"
        }
      ]
    },
    {
      "category": "dependency_scanning",
      "name": "A prototype pollution vulnerability in handlebars is exploitable if an attacker can control the template",
      "message": "A prototype pollution vulnerability in handlebars is exploitable if an attacker can control the template in handlebars.js",
      "cve": "package.json:handlebars.js:retire.js:baf1b2b5f9a7c1dc0fb152365126e6c3",
      "severity": "High",
      "scanner": {
        "id": "retire.js",
        "name": "Retire.js"
      },
      "location": {
        "file": "package.json",
        "dependency": {
          "package": {
            "name": "handlebars.js"
          },
          "version": "4.0.11"
        }
      },
      "identifiers": [
        {
          "type": "retire.js",
          "name": "RETIRE-JS-baf1b2b5f9a7c1dc0fb152365126e6c3",
          "value": "baf1b2b5f9a7c1dc0fb152365126e6c3",
          "url": "https://snyk.io/vuln/SNYK-JS-HANDLEBARS-174183"
        }
      ],
      "links": [
        {
          "url": "https://snyk.io/vuln/SNYK-JS-HANDLEBARS-174183"
        },
        {
          "url": "https://github.com/wycats/handlebars.js/issues/1495"
        },
        {
          "url": "https://github.com/wycats/handlebars.js/commit/cd38583216dce3252831916323202749431c773e"
        }
      ]
    },
    {
      "category": "dependency_scanning",
      "name": "A prototype pollution vulnerability in handlebars is exploitable if an attacker can control the template",
      "message": "A prototype pollution vulnerability in handlebars is exploitable if an attacker can control the template in handlebars.js",
      "cve": "package.json:handlebars.js:retire.js:baf1b2b5f9a7c1dc0fb152365126e6c3",
      "severity": "High",
      "scanner": {
        "id": "retire.js",
        "name": "Retire.js"
      },
      "location": {
        "file": "package.json",
        "dependency": {
          "package": {
            "name": "handlebars.js"
          },
          "version": "4.0.11"
        }
      },
      "identifiers": [
        {
          "type": "retire.js",
          "name": "RETIRE-JS-baf1b2b5f9a7c1dc0fb152365126e6c3",
          "value": "baf1b2b5f9a7c1dc0fb152365126e6c3",
          "url": "https://snyk.io/vuln/SNYK-JS-HANDLEBARS-174183"
        }
      ],
      "links": [
        {
          "url": "https://snyk.io/vuln/SNYK-JS-HANDLEBARS-174183"
        },
        {
          "url": "https://github.com/wycats/handlebars.js/issues/1495"
        },
        {
          "url": "https://github.com/wycats/handlebars.js/commit/cd38583216dce3252831916323202749431c773e"
        }
      ]
    },
    {
      "category": "dependency_scanning",
      "name": "A prototype pollution vulnerability in handlebars is exploitable if an attacker can control the template",
      "message": "A prototype pollution vulnerability in handlebars is exploitable if an attacker can control the template in handlebars.js",
      "cve": "package.json:handlebars.js:retire.js:baf1b2b5f9a7c1dc0fb152365126e6c3",
      "severity": "High",
      "scanner": {
        "id": "retire.js",
        "name": "Retire.js"
      },
      "location": {
        "file": "package.json",
        "dependency": {
          "package": {
            "name": "handlebars.js"
          },
          "version": "4.0.11"
        }
      },
      "identifiers": [
        {
          "type": "retire.js",
          "name": "RETIRE-JS-baf1b2b5f9a7c1dc0fb152365126e6c3",
          "value": "baf1b2b5f9a7c1dc0fb152365126e6c3",
          "url": "https://snyk.io/vuln/SNYK-JS-HANDLEBARS-174183"
        }
      ],
      "links": [
        {
          "url": "https://snyk.io/vuln/SNYK-JS-HANDLEBARS-174183"
        },
        {
          "url": "https://github.com/wycats/handlebars.js/issues/1495"
        },
        {
          "url": "https://github.com/wycats/handlebars.js/commit/cd38583216dce3252831916323202749431c773e"
        }
      ]
    },
    {
      "category": "dependency_scanning",
      "name": "A prototype pollution vulnerability in handlebars is exploitable if an attacker can control the template",
      "message": "A prototype pollution vulnerability in handlebars is exploitable if an attacker can control the template in handlebars.js",
      "cve": "package.json:handlebars.js:retire.js:baf1b2b5f9a7c1dc0fb152365126e6c3",
      "severity": "High",
      "scanner": {
        "id": "retire.js",
        "name": "Retire.js"
      },
      "location": {
        "file": "package.json",
        "dependency": {
          "package": {
            "name": "handlebars.js"
          },
          "version": "4.0.11"
        }
      },
      "identifiers": [
        {
          "type": "retire.js",
          "name": "RETIRE-JS-baf1b2b5f9a7c1dc0fb152365126e6c3",
          "value": "baf1b2b5f9a7c1dc0fb152365126e6c3",
          "url": "https://snyk.io/vuln/SNYK-JS-HANDLEBARS-174183"
        }
      ],
      "links": [
        {
          "url": "https://snyk.io/vuln/SNYK-JS-HANDLEBARS-174183"
        },
        {
          "url": "https://github.com/wycats/handlebars.js/issues/1495"
        },
        {
          "url": "https://github.com/wycats/handlebars.js/commit/cd38583216dce3252831916323202749431c773e"
        }
      ]
    },
    {
      "category": "dependency_scanning",
      "name": "A prototype pollution vulnerability in handlebars is exploitable if an attacker can control the template",
      "message": "A prototype pollution vulnerability in handlebars is exploitable if an attacker can control the template in handlebars.js",
      "cve": "package.json:handlebars.js:retire.js:baf1b2b5f9a7c1dc0fb152365126e6c3",
      "severity": "High",
      "scanner": {
        "id": "retire.js",
        "name": "Retire.js"
      },
      "location": {
        "file": "package.json",
        "dependency": {
          "package": {
            "name": "handlebars.js"
          },
          "version": "4.0.11"
        }
      },
      "identifiers": [
        {
          "type": "retire.js",
          "name": "RETIRE-JS-baf1b2b5f9a7c1dc0fb152365126e6c3",
          "value": "baf1b2b5f9a7c1dc0fb152365126e6c3",
          "url": "https://snyk.io/vuln/SNYK-JS-HANDLEBARS-174183"
        }
      ],
      "links": [
        {
          "url": "https://snyk.io/vuln/SNYK-JS-HANDLEBARS-174183"
        },
        {
          "url": "https://github.com/wycats/handlebars.js/issues/1495"
        },
        {
          "url": "https://github.com/wycats/handlebars.js/commit/cd38583216dce3252831916323202749431c773e"
        }
      ]
    },
    {
      "category": "dependency_scanning",
      "name": "A prototype pollution vulnerability in handlebars is exploitable if an attacker can control the template",
      "message": "A prototype pollution vulnerability in handlebars is exploitable if an attacker can control the template in handlebars.js",
      "cve": "package.json:handlebars.js:retire.js:baf1b2b5f9a7c1dc0fb152365126e6c3",
      "severity": "High",
      "scanner": {
        "id": "retire.js",
        "name": "Retire.js"
      },
      "location": {
        "file": "package.json",
        "dependency": {
          "package": {
            "name": "handlebars.js"
          },
          "version": "4.0.11"
        }
      },
      "identifiers": [
        {
          "type": "retire.js",
          "name": "RETIRE-JS-baf1b2b5f9a7c1dc0fb152365126e6c3",
          "value": "baf1b2b5f9a7c1dc0fb152365126e6c3",
          "url": "https://snyk.io/vuln/SNYK-JS-HANDLEBARS-174183"
        }
      ],
      "links": [
        {
          "url": "https://snyk.io/vuln/SNYK-JS-HANDLEBARS-174183"
        },
        {
          "url": "https://github.com/wycats/handlebars.js/issues/1495"
        },
        {
          "url": "https://github.com/wycats/handlebars.js/commit/cd38583216dce3252831916323202749431c773e"
        }
      ]
    },
    {
      "category": "dependency_scanning",
      "name": "A prototype pollution vulnerability in handlebars is exploitable if an attacker can control the template",
      "message": "A prototype pollution vulnerability in handlebars is exploitable if an attacker can control the template in handlebars.js",
      "cve": "package.json:handlebars.js:retire.js:baf1b2b5f9a7c1dc0fb152365126e6c3",
      "severity": "High",
      "scanner": {
        "id": "retire.js",
        "name": "Retire.js"
      },
      "location": {
        "file": "package.json",
        "dependency": {
          "package": {
            "name": "handlebars.js"
          },
          "version": "4.0.11"
        }
      },
      "identifiers": [
        {
          "type": "retire.js",
          "name": "RETIRE-JS-baf1b2b5f9a7c1dc0fb152365126e6c3",
          "value": "baf1b2b5f9a7c1dc0fb152365126e6c3",
          "url": "https://snyk.io/vuln/SNYK-JS-HANDLEBARS-174183"
        }
      ],
      "links": [
        {
          "url": "https://snyk.io/vuln/SNYK-JS-HANDLEBARS-174183"
        },
        {
          "url": "https://github.com/wycats/handlebars.js/issues/1495"
        },
        {
          "url": "https://github.com/wycats/handlebars.js/commit/cd38583216dce3252831916323202749431c773e"
        }
      ]
    },
    {
      "category": "dependency_scanning",
      "name": "A prototype pollution vulnerability in handlebars is exploitable if an attacker can control the template",
      "message": "A prototype pollution vulnerability in handlebars is exploitable if an attacker can control the template in handlebars.js",
      "cve": "package.json:handlebars.js:retire.js:baf1b2b5f9a7c1dc0fb152365126e6c3",
      "severity": "High",
      "scanner": {
        "id": "retire.js",
        "name": "Retire.js"
      },
      "location": {
        "file": "package.json",
        "dependency": {
          "package": {
            "name": "handlebars.js"
          },
          "version": "4.0.11"
        }
      },
      "identifiers": [
        {
          "type": "retire.js",
          "name": "RETIRE-JS-baf1b2b5f9a7c1dc0fb152365126e6c3",
          "value": "baf1b2b5f9a7c1dc0fb152365126e6c3",
          "url": "https://snyk.io/vuln/SNYK-JS-HANDLEBARS-174183"
        }
      ],
      "links": [
        {
          "url": "https://snyk.io/vuln/SNYK-JS-HANDLEBARS-174183"
        },
        {
          "url": "https://github.com/wycats/handlebars.js/issues/1495"
        },
        {
          "url": "https://github.com/wycats/handlebars.js/commit/cd38583216dce3252831916323202749431c773e"
        }
      ]
    },
    {
      "category": "dependency_scanning",
      "name": "A prototype pollution vulnerability in handlebars is exploitable if an attacker can control the template",
      "message": "A prototype pollution vulnerability in handlebars is exploitable if an attacker can control the template in handlebars.js",
      "cve": "package.json:handlebars.js:retire.js:baf1b2b5f9a7c1dc0fb152365126e6c3",
      "severity": "High",
      "scanner": {
        "id": "retire.js",
        "name": "Retire.js"
      },
      "location": {
        "file": "package.json",
        "dependency": {
          "package": {
            "name": "handlebars.js"
          },
          "version": "4.0.11"
        }
      },
      "identifiers": [
        {
          "type": "retire.js",
          "name": "RETIRE-JS-baf1b2b5f9a7c1dc0fb152365126e6c3",
          "value": "baf1b2b5f9a7c1dc0fb152365126e6c3",
          "url": "https://snyk.io/vuln/SNYK-JS-HANDLEBARS-174183"
        }
      ],
      "links": [
        {
          "url": "https://snyk.io/vuln/SNYK-JS-HANDLEBARS-174183"
        },
        {
          "url": "https://github.com/wycats/handlebars.js/issues/1495"
        },
        {
          "url": "https://github.com/wycats/handlebars.js/commit/cd38583216dce3252831916323202749431c773e"
        }
      ]
    },
    {
      "category": "dependency_scanning",
      "name": "A prototype pollution vulnerability in handlebars is exploitable if an attacker can control the template",
      "message": "A prototype pollution vulnerability in handlebars is exploitable if an attacker can control the template in handlebars.js",
      "cve": "package.json:handlebars.js:retire.js:baf1b2b5f9a7c1dc0fb152365126e6c3",
      "severity": "High",
      "scanner": {
        "id": "retire.js",
        "name": "Retire.js"
      },
      "location": {
        "file": "package.json",
        "dependency": {
          "package": {
            "name": "handlebars.js"
          },
          "version": "4.0.11"
        }
      },
      "identifiers": [
        {
          "type": "retire.js",
          "name": "RETIRE-JS-baf1b2b5f9a7c1dc0fb152365126e6c3",
          "value": "baf1b2b5f9a7c1dc0fb152365126e6c3",
          "url": "https://snyk.io/vuln/SNYK-JS-HANDLEBARS-174183"
        }
      ],
      "links": [
        {
          "url": "https://snyk.io/vuln/SNYK-JS-HANDLEBARS-174183"
        },
        {
          "url": "https://github.com/wycats/handlebars.js/issues/1495"
        },
        {
          "url": "https://github.com/wycats/handlebars.js/commit/cd38583216dce3252831916323202749431c773e"
        }
      ]
    },
    {
      "category": "dependency_scanning",
      "name": "A prototype pollution vulnerability in handlebars is exploitable if an attacker can control the template",
      "message": "A prototype pollution vulnerability in handlebars is exploitable if an attacker can control the template in handlebars.js",
      "cve": "package.json:handlebars.js:retire.js:baf1b2b5f9a7c1dc0fb152365126e6c3",
      "severity": "High",
      "scanner": {
        "id": "retire.js",
        "name": "Retire.js"
      },
      "location": {
        "file": "package.json",
        "dependency": {
          "package": {
            "name": "handlebars.js"
          },
          "version": "4.0.11"
        }
      },
      "identifiers": [
        {
          "type": "retire.js",
          "name": "RETIRE-JS-baf1b2b5f9a7c1dc0fb152365126e6c3",
          "value": "baf1b2b5f9a7c1dc0fb152365126e6c3",
          "url": "https://snyk.io/vuln/SNYK-JS-HANDLEBARS-174183"
        }
      ],
      "links": [
        {
          "url": "https://snyk.io/vuln/SNYK-JS-HANDLEBARS-174183"
        },
        {
          "url": "https://github.com/wycats/handlebars.js/issues/1495"
        },
        {
          "url": "https://github.com/wycats/handlebars.js/commit/cd38583216dce3252831916323202749431c773e"
        }
      ]
    },
    {
      "category": "dependency_scanning",
      "name": "A prototype pollution vulnerability in handlebars is exploitable if an attacker can control the template",
      "message": "A prototype pollution vulnerability in handlebars is exploitable if an attacker can control the template in handlebars.js",
      "cve": "package.json:handlebars.js:retire.js:baf1b2b5f9a7c1dc0fb152365126e6c3",
      "severity": "High",
      "scanner": {
        "id": "retire.js",
        "name": "Retire.js"
      },
      "location": {
        "file": "package.json",
        "dependency": {
          "package": {
            "name": "handlebars.js"
          },
          "version": "4.0.11"
        }
      },
      "identifiers": [
        {
          "type": "retire.js",
          "name": "RETIRE-JS-baf1b2b5f9a7c1dc0fb152365126e6c3",
          "value": "baf1b2b5f9a7c1dc0fb152365126e6c3",
          "url": "https://snyk.io/vuln/SNYK-JS-HANDLEBARS-174183"
        }
      ],
      "links": [
        {
          "url": "https://snyk.io/vuln/SNYK-JS-HANDLEBARS-174183"
        },
        {
          "url": "https://github.com/wycats/handlebars.js/issues/1495"
        },
        {
          "url": "https://github.com/wycats/handlebars.js/commit/cd38583216dce3252831916323202749431c773e"
        }
      ]
    },
    {
      "category": "dependency_scanning",
      "name": "A prototype pollution vulnerability in handlebars is exploitable if an attacker can control the template",
      "message": "A prototype pollution vulnerability in handlebars is exploitable if an attacker can control the template in handlebars.js",
      "cve": "package.json:handlebars.js:retire.js:baf1b2b5f9a7c1dc0fb152365126e6c3",
      "severity": "High",
      "scanner": {
        "id": "retire.js",
        "name": "Retire.js"
      },
      "location": {
        "file": "package.json",
        "dependency": {
          "package": {
            "name": "handlebars.js"
          },
          "version": "4.0.11"
        }
      },
      "identifiers": [
        {
          "type": "retire.js",
          "name": "RETIRE-JS-baf1b2b5f9a7c1dc0fb152365126e6c3",
          "value": "baf1b2b5f9a7c1dc0fb152365126e6c3",
          "url": "https://snyk.io/vuln/SNYK-JS-HANDLEBARS-174183"
        }
      ],
      "links": [
        {
          "url": "https://snyk.io/vuln/SNYK-JS-HANDLEBARS-174183"
        },
        {
          "url": "https://github.com/wycats/handlebars.js/issues/1495"
        },
        {
          "url": "https://github.com/wycats/handlebars.js/commit/cd38583216dce3252831916323202749431c773e"
        }
      ]
    },
    {
      "category": "dependency_scanning",
      "name": "A prototype pollution vulnerability in handlebars is exploitable if an attacker can control the template",
      "message": "A prototype pollution vulnerability in handlebars is exploitable if an attacker can control the template in handlebars.js",
      "cve": "package.json:handlebars.js:retire.js:baf1b2b5f9a7c1dc0fb152365126e6c3",
      "severity": "High",
      "scanner": {
        "id": "retire.js",
        "name": "Retire.js"
      },
      "location": {
        "file": "package.json",
        "dependency": {
          "package": {
            "name": "handlebars.js"
          },
          "version": "4.0.11"
        }
      },
      "identifiers": [
        {
          "type": "retire.js",
          "name": "RETIRE-JS-baf1b2b5f9a7c1dc0fb152365126e6c3",
          "value": "baf1b2b5f9a7c1dc0fb152365126e6c3",
          "url": "https://snyk.io/vuln/SNYK-JS-HANDLEBARS-174183"
        }
      ],
      "links": [
        {
          "url": "https://snyk.io/vuln/SNYK-JS-HANDLEBARS-174183"
        },
        {
          "url": "https://github.com/wycats/handlebars.js/issues/1495"
        },
        {
          "url": "https://github.com/wycats/handlebars.js/commit/cd38583216dce3252831916323202749431c773e"
        }
      ]
    },
    {
      "category": "dependency_scanning",
      "name": "A prototype pollution vulnerability in handlebars is exploitable if an attacker can control the template",
      "message": "A prototype pollution vulnerability in handlebars is exploitable if an attacker can control the template in handlebars.js",
      "cve": "package.json:handlebars.js:retire.js:baf1b2b5f9a7c1dc0fb152365126e6c3",
      "severity": "High",
      "scanner": {
        "id": "retire.js",
        "name": "Retire.js"
      },
      "location": {
        "file": "package.json",
        "dependency": {
          "package": {
            "name": "handlebars.js"
          },
          "version": "4.0.11"
        }
      },
      "identifiers": [
        {
          "type": "retire.js",
          "name": "RETIRE-JS-baf1b2b5f9a7c1dc0fb152365126e6c3",
          "value": "baf1b2b5f9a7c1dc0fb152365126e6c3",
          "url": "https://snyk.io/vuln/SNYK-JS-HANDLEBARS-174183"
        }
      ],
      "links": [
        {
          "url": "https://snyk.io/vuln/SNYK-JS-HANDLEBARS-174183"
        },
        {
          "url": "https://github.com/wycats/handlebars.js/issues/1495"
        },
        {
          "url": "https://github.com/wycats/handlebars.js/commit/cd38583216dce3252831916323202749431c773e"
        }
      ]
    },
    {
      "category": "dependency_scanning",
      "name": "A prototype pollution vulnerability in handlebars is exploitable if an attacker can control the template",
      "message": "A prototype pollution vulnerability in handlebars is exploitable if an attacker can control the template in handlebars.js",
      "cve": "package.json:handlebars.js:retire.js:d033c1b823e1f594d47d1a913f6d3cc7",
      "severity": "High",
      "scanner": {
        "id": "retire.js",
        "name": "Retire.js"
      },
      "location": {
        "file": "package.json",
        "dependency": {
          "package": {
            "name": "handlebars.js"
          },
          "version": "4.0.11"
        }
      },
      "identifiers": [
        {
          "type": "retire.js",
          "name": "RETIRE-JS-d033c1b823e1f594d47d1a913f6d3cc7",
          "value": "d033c1b823e1f594d47d1a913f6d3cc7",
          "url": "https://snyk.io/vuln/SNYK-JS-HANDLEBARS-173692"
        }
      ],
      "links": [
        {
          "url": "https://snyk.io/vuln/SNYK-JS-HANDLEBARS-173692"
        },
        {
          "url": "https://github.com/wycats/handlebars.js/commit/7372d4e9dffc9d70c09671aa28b9392a1577fd86"
        }
      ]
    },
    {
      "category": "dependency_scanning",
      "name": "A prototype pollution vulnerability in handlebars is exploitable if an attacker can control the template",
      "message": "A prototype pollution vulnerability in handlebars is exploitable if an attacker can control the template in handlebars.js",
      "cve": "package.json:handlebars.js:retire.js:d033c1b823e1f594d47d1a913f6d3cc7",
      "severity": "High",
      "scanner": {
        "id": "retire.js",
        "name": "Retire.js"
      },
      "location": {
        "file": "package.json",
        "dependency": {
          "package": {
            "name": "handlebars.js"
          },
          "version": "4.0.11"
        }
      },
      "identifiers": [
        {
          "type": "retire.js",
          "name": "RETIRE-JS-d033c1b823e1f594d47d1a913f6d3cc7",
          "value": "d033c1b823e1f594d47d1a913f6d3cc7",
          "url": "https://snyk.io/vuln/SNYK-JS-HANDLEBARS-173692"
        }
      ],
      "links": [
        {
          "url": "https://snyk.io/vuln/SNYK-JS-HANDLEBARS-173692"
        },
        {
          "url": "https://github.com/wycats/handlebars.js/commit/7372d4e9dffc9d70c09671aa28b9392a1577fd86"
        }
      ]
    },
    {
      "category": "dependency_scanning",
      "name": "A prototype pollution vulnerability in handlebars is exploitable if an attacker can control the template",
      "message": "A prototype pollution vulnerability in handlebars is exploitable if an attacker can control the template in handlebars.js",
      "cve": "package.json:handlebars.js:retire.js:d033c1b823e1f594d47d1a913f6d3cc7",
      "severity": "High",
      "scanner": {
        "id": "retire.js",
        "name": "Retire.js"
      },
      "location": {
        "file": "package.json",
        "dependency": {
          "package": {
            "name": "handlebars.js"
          },
          "version": "4.0.11"
        }
      },
      "identifiers": [
        {
          "type": "retire.js",
          "name": "RETIRE-JS-d033c1b823e1f594d47d1a913f6d3cc7",
          "value": "d033c1b823e1f594d47d1a913f6d3cc7",
          "url": "https://snyk.io/vuln/SNYK-JS-HANDLEBARS-173692"
        }
      ],
      "links": [
        {
          "url": "https://snyk.io/vuln/SNYK-JS-HANDLEBARS-173692"
        },
        {
          "url": "https://github.com/wycats/handlebars.js/commit/7372d4e9dffc9d70c09671aa28b9392a1577fd86"
        }
      ]
    },
    {
      "category": "dependency_scanning",
      "name": "A prototype pollution vulnerability in handlebars is exploitable if an attacker can control the template",
      "message": "A prototype pollution vulnerability in handlebars is exploitable if an attacker can control the template in handlebars.js",
      "cve": "package.json:handlebars.js:retire.js:d033c1b823e1f594d47d1a913f6d3cc7",
      "severity": "High",
      "scanner": {
        "id": "retire.js",
        "name": "Retire.js"
      },
      "location": {
        "file": "package.json",
        "dependency": {
          "package": {
            "name": "handlebars.js"
          },
          "version": "4.0.11"
        }
      },
      "identifiers": [
        {
          "type": "retire.js",
          "name": "RETIRE-JS-d033c1b823e1f594d47d1a913f6d3cc7",
          "value": "d033c1b823e1f594d47d1a913f6d3cc7",
          "url": "https://snyk.io/vuln/SNYK-JS-HANDLEBARS-173692"
        }
      ],
      "links": [
        {
          "url": "https://snyk.io/vuln/SNYK-JS-HANDLEBARS-173692"
        },
        {
          "url": "https://github.com/wycats/handlebars.js/commit/7372d4e9dffc9d70c09671aa28b9392a1577fd86"
        }
      ]
    },
    {
      "category": "dependency_scanning",
      "name": "A prototype pollution vulnerability in handlebars is exploitable if an attacker can control the template",
      "message": "A prototype pollution vulnerability in handlebars is exploitable if an attacker can control the template in handlebars.js",
      "cve": "package.json:handlebars.js:retire.js:d033c1b823e1f594d47d1a913f6d3cc7",
      "severity": "High",
      "scanner": {
        "id": "retire.js",
        "name": "Retire.js"
      },
      "location": {
        "file": "package.json",
        "dependency": {
          "package": {
            "name": "handlebars.js"
          },
          "version": "4.0.11"
        }
      },
      "identifiers": [
        {
          "type": "retire.js",
          "name": "RETIRE-JS-d033c1b823e1f594d47d1a913f6d3cc7",
          "value": "d033c1b823e1f594d47d1a913f6d3cc7",
          "url": "https://snyk.io/vuln/SNYK-JS-HANDLEBARS-173692"
        }
      ],
      "links": [
        {
          "url": "https://snyk.io/vuln/SNYK-JS-HANDLEBARS-173692"
        },
        {
          "url": "https://github.com/wycats/handlebars.js/commit/7372d4e9dffc9d70c09671aa28b9392a1577fd86"
        }
      ]
    },
    {
      "category": "dependency_scanning",
      "name": "A prototype pollution vulnerability in handlebars is exploitable if an attacker can control the template",
      "message": "A prototype pollution vulnerability in handlebars is exploitable if an attacker can control the template in handlebars.js",
      "cve": "package.json:handlebars.js:retire.js:d033c1b823e1f594d47d1a913f6d3cc7",
      "severity": "High",
      "scanner": {
        "id": "retire.js",
        "name": "Retire.js"
      },
      "location": {
        "file": "package.json",
        "dependency": {
          "package": {
            "name": "handlebars.js"
          },
          "version": "4.0.11"
        }
      },
      "identifiers": [
        {
          "type": "retire.js",
          "name": "RETIRE-JS-d033c1b823e1f594d47d1a913f6d3cc7",
          "value": "d033c1b823e1f594d47d1a913f6d3cc7",
          "url": "https://snyk.io/vuln/SNYK-JS-HANDLEBARS-173692"
        }
      ],
      "links": [
        {
          "url": "https://snyk.io/vuln/SNYK-JS-HANDLEBARS-173692"
        },
        {
          "url": "https://github.com/wycats/handlebars.js/commit/7372d4e9dffc9d70c09671aa28b9392a1577fd86"
        }
      ]
    },
    {
      "category": "dependency_scanning",
      "name": "A prototype pollution vulnerability in handlebars is exploitable if an attacker can control the template",
      "message": "A prototype pollution vulnerability in handlebars is exploitable if an attacker can control the template in handlebars.js",
      "cve": "package.json:handlebars.js:retire.js:d033c1b823e1f594d47d1a913f6d3cc7",
      "severity": "High",
      "scanner": {
        "id": "retire.js",
        "name": "Retire.js"
      },
      "location": {
        "file": "package.json",
        "dependency": {
          "package": {
            "name": "handlebars.js"
          },
          "version": "4.0.11"
        }
      },
      "identifiers": [
        {
          "type": "retire.js",
          "name": "RETIRE-JS-d033c1b823e1f594d47d1a913f6d3cc7",
          "value": "d033c1b823e1f594d47d1a913f6d3cc7",
          "url": "https://snyk.io/vuln/SNYK-JS-HANDLEBARS-173692"
        }
      ],
      "links": [
        {
          "url": "https://snyk.io/vuln/SNYK-JS-HANDLEBARS-173692"
        },
        {
          "url": "https://github.com/wycats/handlebars.js/commit/7372d4e9dffc9d70c09671aa28b9392a1577fd86"
        }
      ]
    },
    {
      "category": "dependency_scanning",
      "name": "A prototype pollution vulnerability in handlebars is exploitable if an attacker can control the template",
      "message": "A prototype pollution vulnerability in handlebars is exploitable if an attacker can control the template in handlebars.js",
      "cve": "package.json:handlebars.js:retire.js:d033c1b823e1f594d47d1a913f6d3cc7",
      "severity": "High",
      "scanner": {
        "id": "retire.js",
        "name": "Retire.js"
      },
      "location": {
        "file": "package.json",
        "dependency": {
          "package": {
            "name": "handlebars.js"
          },
          "version": "4.0.11"
        }
      },
      "identifiers": [
        {
          "type": "retire.js",
          "name": "RETIRE-JS-d033c1b823e1f594d47d1a913f6d3cc7",
          "value": "d033c1b823e1f594d47d1a913f6d3cc7",
          "url": "https://snyk.io/vuln/SNYK-JS-HANDLEBARS-173692"
        }
      ],
      "links": [
        {
          "url": "https://snyk.io/vuln/SNYK-JS-HANDLEBARS-173692"
        },
        {
          "url": "https://github.com/wycats/handlebars.js/commit/7372d4e9dffc9d70c09671aa28b9392a1577fd86"
        }
      ]
    },
    {
      "category": "dependency_scanning",
      "name": "A prototype pollution vulnerability in handlebars is exploitable if an attacker can control the template",
      "message": "A prototype pollution vulnerability in handlebars is exploitable if an attacker can control the template in handlebars.js",
      "cve": "package.json:handlebars.js:retire.js:d033c1b823e1f594d47d1a913f6d3cc7",
      "severity": "High",
      "scanner": {
        "id": "retire.js",
        "name": "Retire.js"
      },
      "location": {
        "file": "package.json",
        "dependency": {
          "package": {
            "name": "handlebars.js"
          },
          "version": "4.0.11"
        }
      },
      "identifiers": [
        {
          "type": "retire.js",
          "name": "RETIRE-JS-d033c1b823e1f594d47d1a913f6d3cc7",
          "value": "d033c1b823e1f594d47d1a913f6d3cc7",
          "url": "https://snyk.io/vuln/SNYK-JS-HANDLEBARS-173692"
        }
      ],
      "links": [
        {
          "url": "https://snyk.io/vuln/SNYK-JS-HANDLEBARS-173692"
        },
        {
          "url": "https://github.com/wycats/handlebars.js/commit/7372d4e9dffc9d70c09671aa28b9392a1577fd86"
        }
      ]
    },
    {
      "category": "dependency_scanning",
      "name": "A prototype pollution vulnerability in handlebars is exploitable if an attacker can control the template",
      "message": "A prototype pollution vulnerability in handlebars is exploitable if an attacker can control the template in handlebars.js",
      "cve": "package.json:handlebars.js:retire.js:d033c1b823e1f594d47d1a913f6d3cc7",
      "severity": "High",
      "scanner": {
        "id": "retire.js",
        "name": "Retire.js"
      },
      "location": {
        "file": "package.json",
        "dependency": {
          "package": {
            "name": "handlebars.js"
          },
          "version": "4.0.11"
        }
      },
      "identifiers": [
        {
          "type": "retire.js",
          "name": "RETIRE-JS-d033c1b823e1f594d47d1a913f6d3cc7",
          "value": "d033c1b823e1f594d47d1a913f6d3cc7",
          "url": "https://snyk.io/vuln/SNYK-JS-HANDLEBARS-173692"
        }
      ],
      "links": [
        {
          "url": "https://snyk.io/vuln/SNYK-JS-HANDLEBARS-173692"
        },
        {
          "url": "https://github.com/wycats/handlebars.js/commit/7372d4e9dffc9d70c09671aa28b9392a1577fd86"
        }
      ]
    },
    {
      "category": "dependency_scanning",
      "name": "A prototype pollution vulnerability in handlebars is exploitable if an attacker can control the template",
      "message": "A prototype pollution vulnerability in handlebars is exploitable if an attacker can control the template in handlebars.js",
      "cve": "package.json:handlebars.js:retire.js:d033c1b823e1f594d47d1a913f6d3cc7",
      "severity": "High",
      "scanner": {
        "id": "retire.js",
        "name": "Retire.js"
      },
      "location": {
        "file": "package.json",
        "dependency": {
          "package": {
            "name": "handlebars.js"
          },
          "version": "4.0.11"
        }
      },
      "identifiers": [
        {
          "type": "retire.js",
          "name": "RETIRE-JS-d033c1b823e1f594d47d1a913f6d3cc7",
          "value": "d033c1b823e1f594d47d1a913f6d3cc7",
          "url": "https://snyk.io/vuln/SNYK-JS-HANDLEBARS-173692"
        }
      ],
      "links": [
        {
          "url": "https://snyk.io/vuln/SNYK-JS-HANDLEBARS-173692"
        },
        {
          "url": "https://github.com/wycats/handlebars.js/commit/7372d4e9dffc9d70c09671aa28b9392a1577fd86"
        }
      ]
    },
    {
      "category": "dependency_scanning",
      "name": "A prototype pollution vulnerability in handlebars is exploitable if an attacker can control the template",
      "message": "A prototype pollution vulnerability in handlebars is exploitable if an attacker can control the template in handlebars.js",
      "cve": "package.json:handlebars.js:retire.js:d033c1b823e1f594d47d1a913f6d3cc7",
      "severity": "High",
      "scanner": {
        "id": "retire.js",
        "name": "Retire.js"
      },
      "location": {
        "file": "package.json",
        "dependency": {
          "package": {
            "name": "handlebars.js"
          },
          "version": "4.0.11"
        }
      },
      "identifiers": [
        {
          "type": "retire.js",
          "name": "RETIRE-JS-d033c1b823e1f594d47d1a913f6d3cc7",
          "value": "d033c1b823e1f594d47d1a913f6d3cc7",
          "url": "https://snyk.io/vuln/SNYK-JS-HANDLEBARS-173692"
        }
      ],
      "links": [
        {
          "url": "https://snyk.io/vuln/SNYK-JS-HANDLEBARS-173692"
        },
        {
          "url": "https://github.com/wycats/handlebars.js/commit/7372d4e9dffc9d70c09671aa28b9392a1577fd86"
        }
      ]
    },
    {
      "category": "dependency_scanning",
      "name": "A prototype pollution vulnerability in handlebars is exploitable if an attacker can control the template",
      "message": "A prototype pollution vulnerability in handlebars is exploitable if an attacker can control the template in handlebars.js",
      "cve": "package.json:handlebars.js:retire.js:d033c1b823e1f594d47d1a913f6d3cc7",
      "severity": "High",
      "scanner": {
        "id": "retire.js",
        "name": "Retire.js"
      },
      "location": {
        "file": "package.json",
        "dependency": {
          "package": {
            "name": "handlebars.js"
          },
          "version": "4.0.11"
        }
      },
      "identifiers": [
        {
          "type": "retire.js",
          "name": "RETIRE-JS-d033c1b823e1f594d47d1a913f6d3cc7",
          "value": "d033c1b823e1f594d47d1a913f6d3cc7",
          "url": "https://snyk.io/vuln/SNYK-JS-HANDLEBARS-173692"
        }
      ],
      "links": [
        {
          "url": "https://snyk.io/vuln/SNYK-JS-HANDLEBARS-173692"
        },
        {
          "url": "https://github.com/wycats/handlebars.js/commit/7372d4e9dffc9d70c09671aa28b9392a1577fd86"
        }
      ]
    },
    {
      "category": "dependency_scanning",
      "name": "A prototype pollution vulnerability in handlebars is exploitable if an attacker can control the template",
      "message": "A prototype pollution vulnerability in handlebars is exploitable if an attacker can control the template in handlebars.js",
      "cve": "package.json:handlebars.js:retire.js:d033c1b823e1f594d47d1a913f6d3cc7",
      "severity": "High",
      "scanner": {
        "id": "retire.js",
        "name": "Retire.js"
      },
      "location": {
        "file": "package.json",
        "dependency": {
          "package": {
            "name": "handlebars.js"
          },
          "version": "4.0.11"
        }
      },
      "identifiers": [
        {
          "type": "retire.js",
          "name": "RETIRE-JS-d033c1b823e1f594d47d1a913f6d3cc7",
          "value": "d033c1b823e1f594d47d1a913f6d3cc7",
          "url": "https://snyk.io/vuln/SNYK-JS-HANDLEBARS-173692"
        }
      ],
      "links": [
        {
          "url": "https://snyk.io/vuln/SNYK-JS-HANDLEBARS-173692"
        },
        {
          "url": "https://github.com/wycats/handlebars.js/commit/7372d4e9dffc9d70c09671aa28b9392a1577fd86"
        }
      ]
    },
    {
      "category": "dependency_scanning",
      "name": "A prototype pollution vulnerability in handlebars is exploitable if an attacker can control the template",
      "message": "A prototype pollution vulnerability in handlebars is exploitable if an attacker can control the template in handlebars.js",
      "cve": "package.json:handlebars.js:retire.js:d033c1b823e1f594d47d1a913f6d3cc7",
      "severity": "High",
      "scanner": {
        "id": "retire.js",
        "name": "Retire.js"
      },
      "location": {
        "file": "package.json",
        "dependency": {
          "package": {
            "name": "handlebars.js"
          },
          "version": "4.0.11"
        }
      },
      "identifiers": [
        {
          "type": "retire.js",
          "name": "RETIRE-JS-d033c1b823e1f594d47d1a913f6d3cc7",
          "value": "d033c1b823e1f594d47d1a913f6d3cc7",
          "url": "https://snyk.io/vuln/SNYK-JS-HANDLEBARS-173692"
        }
      ],
      "links": [
        {
          "url": "https://snyk.io/vuln/SNYK-JS-HANDLEBARS-173692"
        },
        {
          "url": "https://github.com/wycats/handlebars.js/commit/7372d4e9dffc9d70c09671aa28b9392a1577fd86"
        }
      ]
    },
    {
      "category": "dependency_scanning",
      "name": "A prototype pollution vulnerability in handlebars is exploitable if an attacker can control the template",
      "message": "A prototype pollution vulnerability in handlebars is exploitable if an attacker can control the template in handlebars.js",
      "cve": "package.json:handlebars.js:retire.js:d033c1b823e1f594d47d1a913f6d3cc7",
      "severity": "High",
      "scanner": {
        "id": "retire.js",
        "name": "Retire.js"
      },
      "location": {
        "file": "package.json",
        "dependency": {
          "package": {
            "name": "handlebars.js"
          },
          "version": "4.0.11"
        }
      },
      "identifiers": [
        {
          "type": "retire.js",
          "name": "RETIRE-JS-d033c1b823e1f594d47d1a913f6d3cc7",
          "value": "d033c1b823e1f594d47d1a913f6d3cc7",
          "url": "https://snyk.io/vuln/SNYK-JS-HANDLEBARS-173692"
        }
      ],
      "links": [
        {
          "url": "https://snyk.io/vuln/SNYK-JS-HANDLEBARS-173692"
        },
        {
          "url": "https://github.com/wycats/handlebars.js/commit/7372d4e9dffc9d70c09671aa28b9392a1577fd86"
        }
      ]
    },
    {
      "category": "dependency_scanning",
      "name": "A prototype pollution vulnerability in handlebars may lead to remote code execution if an attacker can control the template",
      "message": "A prototype pollution vulnerability in handlebars may lead to remote code execution if an attacker can control the template in handlebars",
      "cve": "package.json:handlebars:retire.js:baf1b2b5f9a7c1dc0fb152365126e6c3",
      "severity": "High",
      "scanner": {
        "id": "retire.js",
        "name": "Retire.js"
      },
      "location": {
        "file": "package.json",
        "dependency": {
          "package": {
            "name": "handlebars"
          },
          "version": "4.0.11"
        }
      },
      "identifiers": [
        {
          "type": "retire.js",
          "name": "RETIRE-JS-baf1b2b5f9a7c1dc0fb152365126e6c3",
          "value": "baf1b2b5f9a7c1dc0fb152365126e6c3",
          "url": "https://snyk.io/vuln/SNYK-JS-HANDLEBARS-174183"
        }
      ],
      "links": [
        {
          "url": "https://snyk.io/vuln/SNYK-JS-HANDLEBARS-174183"
        },
        {
          "url": "https://github.com/wycats/handlebars.js/issues/1495"
        },
        {
          "url": "https://github.com/wycats/handlebars.js/commit/cd38583216dce3252831916323202749431c773e"
        }
      ]
    },
    {
      "category": "dependency_scanning",
      "name": "A prototype pollution vulnerability in handlebars may lead to remote code execution if an attacker can control the template",
      "message": "A prototype pollution vulnerability in handlebars may lead to remote code execution if an attacker can control the template in handlebars",
      "cve": "package.json:handlebars:retire.js:d033c1b823e1f594d47d1a913f6d3cc7",
      "severity": "High",
      "scanner": {
        "id": "retire.js",
        "name": "Retire.js"
      },
      "location": {
        "file": "package.json",
        "dependency": {
          "package": {
            "name": "handlebars"
          },
          "version": "4.0.11"
        }
      },
      "identifiers": [
        {
          "type": "retire.js",
          "name": "RETIRE-JS-d033c1b823e1f594d47d1a913f6d3cc7",
          "value": "d033c1b823e1f594d47d1a913f6d3cc7",
          "url": "https://snyk.io/vuln/SNYK-JS-HANDLEBARS-173692"
        }
      ],
      "links": [
        {
          "url": "https://snyk.io/vuln/SNYK-JS-HANDLEBARS-173692"
        },
        {
          "url": "https://github.com/wycats/handlebars.js/commit/7372d4e9dffc9d70c09671aa28b9392a1577fd86"
        }
      ]
    },
    {
      "category": "dependency_scanning",
      "name": "Some fake vulnerability added for testing purposes",
      "message": "Some fake vulnerability added for testing purposes in is-obj",
      "cve": "package.json:is-obj:npm:13",
      "severity": "High",
      "scanner": {
        "id": "retire.js",
        "name": "Retire.js"
      },
      "location": {
        "file": "package.json",
        "dependency": {
          "package": {
            "name": "is-obj"
          },
          "version": "1.0.1"
        }
      },
      "identifiers": [
        {
          "type": "npm",
          "name": "NPM-13",
          "value": "13",
          "url": "https://www.npmjs.com/advisories/13"
        }
      ],
      "links": [
        {
          "url": "https://nodesecurity.io/advisories/13"
        }
      ]
    },
    {
      "category": "dependency_scanning",
      "name": "Prototype pollution attack",
      "message": "Prototype pollution attack in mixin-deep",
      "cve": "package.json:mixin-deep:cve:CVE-2019-10746",
      "severity": "High",
      "scanner": {
        "id": "retire.js",
        "name": "Retire.js"
      },
      "location": {
        "file": "package.json",
        "dependency": {
          "package": {
            "name": "mixin-deep"
          },
          "version": "1.3.1"
        }
      },
      "identifiers": [
        {
          "type": "cve",
          "name": "CVE-2019-10746",
          "value": "CVE-2019-10746",
          "url": "https://cve.mitre.org/cgi-bin/cvename.cgi?name=CVE-2019-10746"
        }
      ],
      "links": [
        {
          "url": "https://snyk.io/vuln/SNYK-JS-MIXINDEEP-450212"
        }
      ]
    },
    {
      "category": "dependency_scanning",
      "name": "Prototype pollution",
      "message": "Prototype pollution in handlebars.js",
      "cve": "package.json:handlebars.js:retire.js:9f6d4c3f022b430abb4c56ad119db0f0",
      "severity": "Medium",
      "scanner": {
        "id": "retire.js",
        "name": "Retire.js"
      },
      "location": {
        "file": "package.json",
        "dependency": {
          "package": {
            "name": "handlebars.js"
          },
          "version": "4.0.11"
        }
      },
      "identifiers": [
        {
          "type": "retire.js",
          "name": "RETIRE-JS-9f6d4c3f022b430abb4c56ad119db0f0",
          "value": "9f6d4c3f022b430abb4c56ad119db0f0",
          "url": "https://github.com/wycats/handlebars.js/blob/master/release-notes.md#v453---november-18th-2019"
        }
      ],
      "links": [
        {
          "url": "https://github.com/wycats/handlebars.js/blob/master/release-notes.md#v453---november-18th-2019"
        }
      ]
    },
    {
      "category": "dependency_scanning",
      "name": "Prototype pollution",
      "message": "Prototype pollution in handlebars.js",
      "cve": "package.json:handlebars.js:retire.js:9f6d4c3f022b430abb4c56ad119db0f0",
      "severity": "Medium",
      "scanner": {
        "id": "retire.js",
        "name": "Retire.js"
      },
      "location": {
        "file": "package.json",
        "dependency": {
          "package": {
            "name": "handlebars.js"
          },
          "version": "4.0.11"
        }
      },
      "identifiers": [
        {
          "type": "retire.js",
          "name": "RETIRE-JS-9f6d4c3f022b430abb4c56ad119db0f0",
          "value": "9f6d4c3f022b430abb4c56ad119db0f0",
          "url": "https://github.com/wycats/handlebars.js/blob/master/release-notes.md#v453---november-18th-2019"
        }
      ],
      "links": [
        {
          "url": "https://github.com/wycats/handlebars.js/blob/master/release-notes.md#v453---november-18th-2019"
        }
      ]
    },
    {
      "category": "dependency_scanning",
      "name": "Prototype pollution",
      "message": "Prototype pollution in handlebars.js",
      "cve": "package.json:handlebars.js:retire.js:9f6d4c3f022b430abb4c56ad119db0f0",
      "severity": "Medium",
      "scanner": {
        "id": "retire.js",
        "name": "Retire.js"
      },
      "location": {
        "file": "package.json",
        "dependency": {
          "package": {
            "name": "handlebars.js"
          },
          "version": "4.0.11"
        }
      },
      "identifiers": [
        {
          "type": "retire.js",
          "name": "RETIRE-JS-9f6d4c3f022b430abb4c56ad119db0f0",
          "value": "9f6d4c3f022b430abb4c56ad119db0f0",
          "url": "https://github.com/wycats/handlebars.js/blob/master/release-notes.md#v453---november-18th-2019"
        }
      ],
      "links": [
        {
          "url": "https://github.com/wycats/handlebars.js/blob/master/release-notes.md#v453---november-18th-2019"
        }
      ]
    },
    {
      "category": "dependency_scanning",
      "name": "Prototype pollution",
      "message": "Prototype pollution in handlebars.js",
      "cve": "package.json:handlebars.js:retire.js:9f6d4c3f022b430abb4c56ad119db0f0",
      "severity": "Medium",
      "scanner": {
        "id": "retire.js",
        "name": "Retire.js"
      },
      "location": {
        "file": "package.json",
        "dependency": {
          "package": {
            "name": "handlebars.js"
          },
          "version": "4.0.11"
        }
      },
      "identifiers": [
        {
          "type": "retire.js",
          "name": "RETIRE-JS-9f6d4c3f022b430abb4c56ad119db0f0",
          "value": "9f6d4c3f022b430abb4c56ad119db0f0",
          "url": "https://github.com/wycats/handlebars.js/blob/master/release-notes.md#v453---november-18th-2019"
        }
      ],
      "links": [
        {
          "url": "https://github.com/wycats/handlebars.js/blob/master/release-notes.md#v453---november-18th-2019"
        }
      ]
    },
    {
      "category": "dependency_scanning",
      "name": "Prototype pollution",
      "message": "Prototype pollution in handlebars.js",
      "cve": "package.json:handlebars.js:retire.js:9f6d4c3f022b430abb4c56ad119db0f0",
      "severity": "Medium",
      "scanner": {
        "id": "retire.js",
        "name": "Retire.js"
      },
      "location": {
        "file": "package.json",
        "dependency": {
          "package": {
            "name": "handlebars.js"
          },
          "version": "4.0.11"
        }
      },
      "identifiers": [
        {
          "type": "retire.js",
          "name": "RETIRE-JS-9f6d4c3f022b430abb4c56ad119db0f0",
          "value": "9f6d4c3f022b430abb4c56ad119db0f0",
          "url": "https://github.com/wycats/handlebars.js/blob/master/release-notes.md#v453---november-18th-2019"
        }
      ],
      "links": [
        {
          "url": "https://github.com/wycats/handlebars.js/blob/master/release-notes.md#v453---november-18th-2019"
        }
      ]
    },
    {
      "category": "dependency_scanning",
      "name": "Prototype pollution",
      "message": "Prototype pollution in handlebars.js",
      "cve": "package.json:handlebars.js:retire.js:9f6d4c3f022b430abb4c56ad119db0f0",
      "severity": "Medium",
      "scanner": {
        "id": "retire.js",
        "name": "Retire.js"
      },
      "location": {
        "file": "package.json",
        "dependency": {
          "package": {
            "name": "handlebars.js"
          },
          "version": "4.0.11"
        }
      },
      "identifiers": [
        {
          "type": "retire.js",
          "name": "RETIRE-JS-9f6d4c3f022b430abb4c56ad119db0f0",
          "value": "9f6d4c3f022b430abb4c56ad119db0f0",
          "url": "https://github.com/wycats/handlebars.js/blob/master/release-notes.md#v453---november-18th-2019"
        }
      ],
      "links": [
        {
          "url": "https://github.com/wycats/handlebars.js/blob/master/release-notes.md#v453---november-18th-2019"
        }
      ]
    },
    {
      "category": "dependency_scanning",
      "name": "Prototype pollution",
      "message": "Prototype pollution in handlebars.js",
      "cve": "package.json:handlebars.js:retire.js:9f6d4c3f022b430abb4c56ad119db0f0",
      "severity": "Medium",
      "scanner": {
        "id": "retire.js",
        "name": "Retire.js"
      },
      "location": {
        "file": "package.json",
        "dependency": {
          "package": {
            "name": "handlebars.js"
          },
          "version": "4.0.11"
        }
      },
      "identifiers": [
        {
          "type": "retire.js",
          "name": "RETIRE-JS-9f6d4c3f022b430abb4c56ad119db0f0",
          "value": "9f6d4c3f022b430abb4c56ad119db0f0",
          "url": "https://github.com/wycats/handlebars.js/blob/master/release-notes.md#v453---november-18th-2019"
        }
      ],
      "links": [
        {
          "url": "https://github.com/wycats/handlebars.js/blob/master/release-notes.md#v453---november-18th-2019"
        }
      ]
    },
    {
      "category": "dependency_scanning",
      "name": "Prototype pollution",
      "message": "Prototype pollution in handlebars.js",
      "cve": "package.json:handlebars.js:retire.js:9f6d4c3f022b430abb4c56ad119db0f0",
      "severity": "Medium",
      "scanner": {
        "id": "retire.js",
        "name": "Retire.js"
      },
      "location": {
        "file": "package.json",
        "dependency": {
          "package": {
            "name": "handlebars.js"
          },
          "version": "4.0.11"
        }
      },
      "identifiers": [
        {
          "type": "retire.js",
          "name": "RETIRE-JS-9f6d4c3f022b430abb4c56ad119db0f0",
          "value": "9f6d4c3f022b430abb4c56ad119db0f0",
          "url": "https://github.com/wycats/handlebars.js/blob/master/release-notes.md#v453---november-18th-2019"
        }
      ],
      "links": [
        {
          "url": "https://github.com/wycats/handlebars.js/blob/master/release-notes.md#v453---november-18th-2019"
        }
      ]
    },
    {
      "category": "dependency_scanning",
      "name": "Prototype pollution",
      "message": "Prototype pollution in handlebars.js",
      "cve": "package.json:handlebars.js:retire.js:9f6d4c3f022b430abb4c56ad119db0f0",
      "severity": "Medium",
      "scanner": {
        "id": "retire.js",
        "name": "Retire.js"
      },
      "location": {
        "file": "package.json",
        "dependency": {
          "package": {
            "name": "handlebars.js"
          },
          "version": "4.0.11"
        }
      },
      "identifiers": [
        {
          "type": "retire.js",
          "name": "RETIRE-JS-9f6d4c3f022b430abb4c56ad119db0f0",
          "value": "9f6d4c3f022b430abb4c56ad119db0f0",
          "url": "https://github.com/wycats/handlebars.js/blob/master/release-notes.md#v453---november-18th-2019"
        }
      ],
      "links": [
        {
          "url": "https://github.com/wycats/handlebars.js/blob/master/release-notes.md#v453---november-18th-2019"
        }
      ]
    },
    {
      "category": "dependency_scanning",
      "name": "Prototype pollution",
      "message": "Prototype pollution in handlebars.js",
      "cve": "package.json:handlebars.js:retire.js:9f6d4c3f022b430abb4c56ad119db0f0",
      "severity": "Medium",
      "scanner": {
        "id": "retire.js",
        "name": "Retire.js"
      },
      "location": {
        "file": "package.json",
        "dependency": {
          "package": {
            "name": "handlebars.js"
          },
          "version": "4.0.11"
        }
      },
      "identifiers": [
        {
          "type": "retire.js",
          "name": "RETIRE-JS-9f6d4c3f022b430abb4c56ad119db0f0",
          "value": "9f6d4c3f022b430abb4c56ad119db0f0",
          "url": "https://github.com/wycats/handlebars.js/blob/master/release-notes.md#v453---november-18th-2019"
        }
      ],
      "links": [
        {
          "url": "https://github.com/wycats/handlebars.js/blob/master/release-notes.md#v453---november-18th-2019"
        }
      ]
    },
    {
      "category": "dependency_scanning",
      "name": "Prototype pollution",
      "message": "Prototype pollution in handlebars.js",
      "cve": "package.json:handlebars.js:retire.js:9f6d4c3f022b430abb4c56ad119db0f0",
      "severity": "Medium",
      "scanner": {
        "id": "retire.js",
        "name": "Retire.js"
      },
      "location": {
        "file": "package.json",
        "dependency": {
          "package": {
            "name": "handlebars.js"
          },
          "version": "4.0.11"
        }
      },
      "identifiers": [
        {
          "type": "retire.js",
          "name": "RETIRE-JS-9f6d4c3f022b430abb4c56ad119db0f0",
          "value": "9f6d4c3f022b430abb4c56ad119db0f0",
          "url": "https://github.com/wycats/handlebars.js/blob/master/release-notes.md#v453---november-18th-2019"
        }
      ],
      "links": [
        {
          "url": "https://github.com/wycats/handlebars.js/blob/master/release-notes.md#v453---november-18th-2019"
        }
      ]
    },
    {
      "category": "dependency_scanning",
      "name": "Prototype pollution",
      "message": "Prototype pollution in handlebars.js",
      "cve": "package.json:handlebars.js:retire.js:9f6d4c3f022b430abb4c56ad119db0f0",
      "severity": "Medium",
      "scanner": {
        "id": "retire.js",
        "name": "Retire.js"
      },
      "location": {
        "file": "package.json",
        "dependency": {
          "package": {
            "name": "handlebars.js"
          },
          "version": "4.0.11"
        }
      },
      "identifiers": [
        {
          "type": "retire.js",
          "name": "RETIRE-JS-9f6d4c3f022b430abb4c56ad119db0f0",
          "value": "9f6d4c3f022b430abb4c56ad119db0f0",
          "url": "https://github.com/wycats/handlebars.js/blob/master/release-notes.md#v453---november-18th-2019"
        }
      ],
      "links": [
        {
          "url": "https://github.com/wycats/handlebars.js/blob/master/release-notes.md#v453---november-18th-2019"
        }
      ]
    },
    {
      "category": "dependency_scanning",
      "name": "Prototype pollution",
      "message": "Prototype pollution in handlebars.js",
      "cve": "package.json:handlebars.js:retire.js:9f6d4c3f022b430abb4c56ad119db0f0",
      "severity": "Medium",
      "scanner": {
        "id": "retire.js",
        "name": "Retire.js"
      },
      "location": {
        "file": "package.json",
        "dependency": {
          "package": {
            "name": "handlebars.js"
          },
          "version": "4.0.11"
        }
      },
      "identifiers": [
        {
          "type": "retire.js",
          "name": "RETIRE-JS-9f6d4c3f022b430abb4c56ad119db0f0",
          "value": "9f6d4c3f022b430abb4c56ad119db0f0",
          "url": "https://github.com/wycats/handlebars.js/blob/master/release-notes.md#v453---november-18th-2019"
        }
      ],
      "links": [
        {
          "url": "https://github.com/wycats/handlebars.js/blob/master/release-notes.md#v453---november-18th-2019"
        }
      ]
    },
    {
      "category": "dependency_scanning",
      "name": "Prototype pollution",
      "message": "Prototype pollution in handlebars.js",
      "cve": "package.json:handlebars.js:retire.js:9f6d4c3f022b430abb4c56ad119db0f0",
      "severity": "Medium",
      "scanner": {
        "id": "retire.js",
        "name": "Retire.js"
      },
      "location": {
        "file": "package.json",
        "dependency": {
          "package": {
            "name": "handlebars.js"
          },
          "version": "4.0.11"
        }
      },
      "identifiers": [
        {
          "type": "retire.js",
          "name": "RETIRE-JS-9f6d4c3f022b430abb4c56ad119db0f0",
          "value": "9f6d4c3f022b430abb4c56ad119db0f0",
          "url": "https://github.com/wycats/handlebars.js/blob/master/release-notes.md#v453---november-18th-2019"
        }
      ],
      "links": [
        {
          "url": "https://github.com/wycats/handlebars.js/blob/master/release-notes.md#v453---november-18th-2019"
        }
      ]
    },
    {
      "category": "dependency_scanning",
      "name": "Prototype pollution",
      "message": "Prototype pollution in handlebars.js",
      "cve": "package.json:handlebars.js:retire.js:9f6d4c3f022b430abb4c56ad119db0f0",
      "severity": "Medium",
      "scanner": {
        "id": "retire.js",
        "name": "Retire.js"
      },
      "location": {
        "file": "package.json",
        "dependency": {
          "package": {
            "name": "handlebars.js"
          },
          "version": "4.0.11"
        }
      },
      "identifiers": [
        {
          "type": "retire.js",
          "name": "RETIRE-JS-9f6d4c3f022b430abb4c56ad119db0f0",
          "value": "9f6d4c3f022b430abb4c56ad119db0f0",
          "url": "https://github.com/wycats/handlebars.js/blob/master/release-notes.md#v453---november-18th-2019"
        }
      ],
      "links": [
        {
          "url": "https://github.com/wycats/handlebars.js/blob/master/release-notes.md#v453---november-18th-2019"
        }
      ]
    },
    {
      "category": "dependency_scanning",
      "name": "Prototype pollution",
      "message": "Prototype pollution in handlebars.js",
      "cve": "package.json:handlebars.js:retire.js:9f6d4c3f022b430abb4c56ad119db0f0",
      "severity": "Medium",
      "scanner": {
        "id": "retire.js",
        "name": "Retire.js"
      },
      "location": {
        "file": "package.json",
        "dependency": {
          "package": {
            "name": "handlebars.js"
          },
          "version": "4.0.11"
        }
      },
      "identifiers": [
        {
          "type": "retire.js",
          "name": "RETIRE-JS-9f6d4c3f022b430abb4c56ad119db0f0",
          "value": "9f6d4c3f022b430abb4c56ad119db0f0",
          "url": "https://github.com/wycats/handlebars.js/blob/master/release-notes.md#v453---november-18th-2019"
        }
      ],
      "links": [
        {
          "url": "https://github.com/wycats/handlebars.js/blob/master/release-notes.md#v453---november-18th-2019"
        }
      ]
    },
    {
      "category": "dependency_scanning",
      "name": "Regex denial of service",
      "message": "Regex denial of service in hawk",
      "cve": "package.json:hawk:npm:77",
      "severity": "Medium",
      "scanner": {
        "id": "retire.js",
        "name": "Retire.js"
      },
      "location": {
        "file": "package.json",
        "dependency": {
          "package": {
            "name": "hawk"
          },
          "version": "1.1.1"
        }
      },
      "identifiers": [
        {
          "type": "npm",
          "name": "NPM-77",
          "value": "77",
          "url": "https://www.npmjs.com/advisories/77"
        }
      ],
      "links": [
        {
          "url": "https://nodesecurity.io/advisories/77"
        }
      ]
    },
    {
      "category": "dependency_scanning",
      "name": "parseHTML() executes scripts in event handlers",
      "message": "parseHTML() executes scripts in event handlers in jquery",
      "cve": "package.json:jquery:cve:CVE-2015-9251",
      "severity": "Medium",
      "scanner": {
        "id": "retire.js",
        "name": "Retire.js"
      },
      "location": {
        "file": "package.json",
        "dependency": {
          "package": {
            "name": "jquery"
          },
          "version": "1.9.1"
        }
      },
      "identifiers": [
        {
          "type": "cve",
          "name": "CVE-2015-9251",
          "value": "CVE-2015-9251",
          "url": "https://cve.mitre.org/cgi-bin/cvename.cgi?name=CVE-2015-9251"
        }
      ],
      "links": [
        {
          "url": "https://bugs.jquery.com/ticket/11974"
        },
        {
          "url": "https://nvd.nist.gov/vuln/detail/CVE-2015-9251"
        },
        {
          "url": "http://research.insecurelabs.org/jquery/test/"
        }
      ]
    },
    {
      "category": "dependency_scanning",
      "name": "3rd party CORS request may execute",
      "message": "3rd party CORS request may execute in jquery",
      "cve": "package.json:jquery:cve:CVE-2015-9251",
      "severity": "Medium",
      "scanner": {
        "id": "retire.js",
        "name": "Retire.js"
      },
      "location": {
        "file": "package.json",
        "dependency": {
          "package": {
            "name": "jquery"
          },
          "version": "1.9.1"
        }
      },
      "identifiers": [
        {
          "type": "cve",
          "name": "CVE-2015-9251",
          "value": "CVE-2015-9251",
          "url": "https://cve.mitre.org/cgi-bin/cvename.cgi?name=CVE-2015-9251"
        }
      ],
      "links": [
        {
          "url": "https://github.com/jquery/jquery/issues/2432"
        },
        {
          "url": "http://blog.jquery.com/2016/01/08/jquery-2-2-and-1-12-released/"
        },
        {
          "url": "https://nvd.nist.gov/vuln/detail/CVE-2015-9251"
        },
        {
          "url": "http://research.insecurelabs.org/jquery/test/"
        }
      ]
    },
    {
      "category": "dependency_scanning",
      "name": "request_remote-memory-exposure",
      "message": "request_remote-memory-exposure in request",
      "cve": "package.json:request:npm:309",
      "severity": "Medium",
      "scanner": {
        "id": "retire.js",
        "name": "Retire.js"
      },
      "location": {
        "file": "package.json",
        "dependency": {
          "package": {
            "name": "request"
          },
          "version": "2.42.0"
        }
      },
      "identifiers": [
        {
          "type": "npm",
          "name": "NPM-309",
          "value": "309",
          "url": "https://www.npmjs.com/advisories/309"
        }
      ],
      "links": [
        {
          "url": "https://nodesecurity.io/advisories/309"
        }
      ]
    },
    {
      "category": "dependency_scanning",
      "name": "Out-of-bounds Read",
      "message": "Out-of-bounds Read in stringstream",
      "cve": "package.json:stringstream:hackerone:321670",
      "severity": "Medium",
      "scanner": {
        "id": "retire.js",
        "name": "Retire.js"
      },
      "location": {
        "file": "package.json",
        "dependency": {
          "package": {
            "name": "stringstream"
          },
          "version": "0.0.5"
        }
      },
      "identifiers": [
        {
          "type": "hackerone",
          "name": "HACKERONE-321670",
          "value": "321670",
          "url": "https://hackerone.com/reports/321670"
        }
      ],
      "links": [
        {
          "url": "https://hackerone.com/reports/321670"
        }
      ]
    },
    {
      "category": "dependency_scanning",
      "name": "Disallow calling helperMissing and blockHelperMissing directly",
      "message": "Disallow calling helperMissing and blockHelperMissing directly in handlebars.js",
      "cve": "package.json:handlebars.js:retire.js:dad7d984bb9cb333cbc023e8b6c17d5a",
      "severity": "Low",
      "scanner": {
        "id": "retire.js",
        "name": "Retire.js"
      },
      "location": {
        "file": "package.json",
        "dependency": {
          "package": {
            "name": "handlebars.js"
          },
          "version": "4.0.11"
        }
      },
      "identifiers": [
        {
          "type": "retire.js",
          "name": "RETIRE-JS-dad7d984bb9cb333cbc023e8b6c17d5a",
          "value": "dad7d984bb9cb333cbc023e8b6c17d5a",
          "url": "https://github.com/wycats/handlebars.js/blob/master/release-notes.md#v430---september-24th-2019"
        }
      ],
      "links": [
        {
          "url": "https://github.com/wycats/handlebars.js/blob/master/release-notes.md#v430---september-24th-2019"
        }
      ]
    },
    {
      "category": "dependency_scanning",
      "name": "Disallow calling helperMissing and blockHelperMissing directly",
      "message": "Disallow calling helperMissing and blockHelperMissing directly in handlebars.js",
      "cve": "package.json:handlebars.js:retire.js:dad7d984bb9cb333cbc023e8b6c17d5a",
      "severity": "Low",
      "scanner": {
        "id": "retire.js",
        "name": "Retire.js"
      },
      "location": {
        "file": "package.json",
        "dependency": {
          "package": {
            "name": "handlebars.js"
          },
          "version": "4.0.11"
        }
      },
      "identifiers": [
        {
          "type": "retire.js",
          "name": "RETIRE-JS-dad7d984bb9cb333cbc023e8b6c17d5a",
          "value": "dad7d984bb9cb333cbc023e8b6c17d5a",
          "url": "https://github.com/wycats/handlebars.js/blob/master/release-notes.md#v430---september-24th-2019"
        }
      ],
      "links": [
        {
          "url": "https://github.com/wycats/handlebars.js/blob/master/release-notes.md#v430---september-24th-2019"
        }
      ]
    },
    {
      "category": "dependency_scanning",
      "name": "Disallow calling helperMissing and blockHelperMissing directly",
      "message": "Disallow calling helperMissing and blockHelperMissing directly in handlebars.js",
      "cve": "package.json:handlebars.js:retire.js:dad7d984bb9cb333cbc023e8b6c17d5a",
      "severity": "Low",
      "scanner": {
        "id": "retire.js",
        "name": "Retire.js"
      },
      "location": {
        "file": "package.json",
        "dependency": {
          "package": {
            "name": "handlebars.js"
          },
          "version": "4.0.11"
        }
      },
      "identifiers": [
        {
          "type": "retire.js",
          "name": "RETIRE-JS-dad7d984bb9cb333cbc023e8b6c17d5a",
          "value": "dad7d984bb9cb333cbc023e8b6c17d5a",
          "url": "https://github.com/wycats/handlebars.js/blob/master/release-notes.md#v430---september-24th-2019"
        }
      ],
      "links": [
        {
          "url": "https://github.com/wycats/handlebars.js/blob/master/release-notes.md#v430---september-24th-2019"
        }
      ]
    },
    {
      "category": "dependency_scanning",
      "name": "Disallow calling helperMissing and blockHelperMissing directly",
      "message": "Disallow calling helperMissing and blockHelperMissing directly in handlebars.js",
      "cve": "package.json:handlebars.js:retire.js:dad7d984bb9cb333cbc023e8b6c17d5a",
      "severity": "Low",
      "scanner": {
        "id": "retire.js",
        "name": "Retire.js"
      },
      "location": {
        "file": "package.json",
        "dependency": {
          "package": {
            "name": "handlebars.js"
          },
          "version": "4.0.11"
        }
      },
      "identifiers": [
        {
          "type": "retire.js",
          "name": "RETIRE-JS-dad7d984bb9cb333cbc023e8b6c17d5a",
          "value": "dad7d984bb9cb333cbc023e8b6c17d5a",
          "url": "https://github.com/wycats/handlebars.js/blob/master/release-notes.md#v430---september-24th-2019"
        }
      ],
      "links": [
        {
          "url": "https://github.com/wycats/handlebars.js/blob/master/release-notes.md#v430---september-24th-2019"
        }
      ]
    },
    {
      "category": "dependency_scanning",
      "name": "Disallow calling helperMissing and blockHelperMissing directly",
      "message": "Disallow calling helperMissing and blockHelperMissing directly in handlebars.js",
      "cve": "package.json:handlebars.js:retire.js:dad7d984bb9cb333cbc023e8b6c17d5a",
      "severity": "Low",
      "scanner": {
        "id": "retire.js",
        "name": "Retire.js"
      },
      "location": {
        "file": "package.json",
        "dependency": {
          "package": {
            "name": "handlebars.js"
          },
          "version": "4.0.11"
        }
      },
      "identifiers": [
        {
          "type": "retire.js",
          "name": "RETIRE-JS-dad7d984bb9cb333cbc023e8b6c17d5a",
          "value": "dad7d984bb9cb333cbc023e8b6c17d5a",
          "url": "https://github.com/wycats/handlebars.js/blob/master/release-notes.md#v430---september-24th-2019"
        }
      ],
      "links": [
        {
          "url": "https://github.com/wycats/handlebars.js/blob/master/release-notes.md#v430---september-24th-2019"
        }
      ]
    },
    {
      "category": "dependency_scanning",
      "name": "Disallow calling helperMissing and blockHelperMissing directly",
      "message": "Disallow calling helperMissing and blockHelperMissing directly in handlebars.js",
      "cve": "package.json:handlebars.js:retire.js:dad7d984bb9cb333cbc023e8b6c17d5a",
      "severity": "Low",
      "scanner": {
        "id": "retire.js",
        "name": "Retire.js"
      },
      "location": {
        "file": "package.json",
        "dependency": {
          "package": {
            "name": "handlebars.js"
          },
          "version": "4.0.11"
        }
      },
      "identifiers": [
        {
          "type": "retire.js",
          "name": "RETIRE-JS-dad7d984bb9cb333cbc023e8b6c17d5a",
          "value": "dad7d984bb9cb333cbc023e8b6c17d5a",
          "url": "https://github.com/wycats/handlebars.js/blob/master/release-notes.md#v430---september-24th-2019"
        }
      ],
      "links": [
        {
          "url": "https://github.com/wycats/handlebars.js/blob/master/release-notes.md#v430---september-24th-2019"
        }
      ]
    },
    {
      "category": "dependency_scanning",
      "name": "Disallow calling helperMissing and blockHelperMissing directly",
      "message": "Disallow calling helperMissing and blockHelperMissing directly in handlebars.js",
      "cve": "package.json:handlebars.js:retire.js:dad7d984bb9cb333cbc023e8b6c17d5a",
      "severity": "Low",
      "scanner": {
        "id": "retire.js",
        "name": "Retire.js"
      },
      "location": {
        "file": "package.json",
        "dependency": {
          "package": {
            "name": "handlebars.js"
          },
          "version": "4.0.11"
        }
      },
      "identifiers": [
        {
          "type": "retire.js",
          "name": "RETIRE-JS-dad7d984bb9cb333cbc023e8b6c17d5a",
          "value": "dad7d984bb9cb333cbc023e8b6c17d5a",
          "url": "https://github.com/wycats/handlebars.js/blob/master/release-notes.md#v430---september-24th-2019"
        }
      ],
      "links": [
        {
          "url": "https://github.com/wycats/handlebars.js/blob/master/release-notes.md#v430---september-24th-2019"
        }
      ]
    },
    {
      "category": "dependency_scanning",
      "name": "Disallow calling helperMissing and blockHelperMissing directly",
      "message": "Disallow calling helperMissing and blockHelperMissing directly in handlebars.js",
      "cve": "package.json:handlebars.js:retire.js:dad7d984bb9cb333cbc023e8b6c17d5a",
      "severity": "Low",
      "scanner": {
        "id": "retire.js",
        "name": "Retire.js"
      },
      "location": {
        "file": "package.json",
        "dependency": {
          "package": {
            "name": "handlebars.js"
          },
          "version": "4.0.11"
        }
      },
      "identifiers": [
        {
          "type": "retire.js",
          "name": "RETIRE-JS-dad7d984bb9cb333cbc023e8b6c17d5a",
          "value": "dad7d984bb9cb333cbc023e8b6c17d5a",
          "url": "https://github.com/wycats/handlebars.js/blob/master/release-notes.md#v430---september-24th-2019"
        }
      ],
      "links": [
        {
          "url": "https://github.com/wycats/handlebars.js/blob/master/release-notes.md#v430---september-24th-2019"
        }
      ]
    },
    {
      "category": "dependency_scanning",
      "name": "Disallow calling helperMissing and blockHelperMissing directly",
      "message": "Disallow calling helperMissing and blockHelperMissing directly in handlebars.js",
      "cve": "package.json:handlebars.js:retire.js:dad7d984bb9cb333cbc023e8b6c17d5a",
      "severity": "Low",
      "scanner": {
        "id": "retire.js",
        "name": "Retire.js"
      },
      "location": {
        "file": "package.json",
        "dependency": {
          "package": {
            "name": "handlebars.js"
          },
          "version": "4.0.11"
        }
      },
      "identifiers": [
        {
          "type": "retire.js",
          "name": "RETIRE-JS-dad7d984bb9cb333cbc023e8b6c17d5a",
          "value": "dad7d984bb9cb333cbc023e8b6c17d5a",
          "url": "https://github.com/wycats/handlebars.js/blob/master/release-notes.md#v430---september-24th-2019"
        }
      ],
      "links": [
        {
          "url": "https://github.com/wycats/handlebars.js/blob/master/release-notes.md#v430---september-24th-2019"
        }
      ]
    },
    {
      "category": "dependency_scanning",
      "name": "Disallow calling helperMissing and blockHelperMissing directly",
      "message": "Disallow calling helperMissing and blockHelperMissing directly in handlebars.js",
      "cve": "package.json:handlebars.js:retire.js:dad7d984bb9cb333cbc023e8b6c17d5a",
      "severity": "Low",
      "scanner": {
        "id": "retire.js",
        "name": "Retire.js"
      },
      "location": {
        "file": "package.json",
        "dependency": {
          "package": {
            "name": "handlebars.js"
          },
          "version": "4.0.11"
        }
      },
      "identifiers": [
        {
          "type": "retire.js",
          "name": "RETIRE-JS-dad7d984bb9cb333cbc023e8b6c17d5a",
          "value": "dad7d984bb9cb333cbc023e8b6c17d5a",
          "url": "https://github.com/wycats/handlebars.js/blob/master/release-notes.md#v430---september-24th-2019"
        }
      ],
      "links": [
        {
          "url": "https://github.com/wycats/handlebars.js/blob/master/release-notes.md#v430---september-24th-2019"
        }
      ]
    },
    {
      "category": "dependency_scanning",
      "name": "Disallow calling helperMissing and blockHelperMissing directly",
      "message": "Disallow calling helperMissing and blockHelperMissing directly in handlebars.js",
      "cve": "package.json:handlebars.js:retire.js:dad7d984bb9cb333cbc023e8b6c17d5a",
      "severity": "Low",
      "scanner": {
        "id": "retire.js",
        "name": "Retire.js"
      },
      "location": {
        "file": "package.json",
        "dependency": {
          "package": {
            "name": "handlebars.js"
          },
          "version": "4.0.11"
        }
      },
      "identifiers": [
        {
          "type": "retire.js",
          "name": "RETIRE-JS-dad7d984bb9cb333cbc023e8b6c17d5a",
          "value": "dad7d984bb9cb333cbc023e8b6c17d5a",
          "url": "https://github.com/wycats/handlebars.js/blob/master/release-notes.md#v430---september-24th-2019"
        }
      ],
      "links": [
        {
          "url": "https://github.com/wycats/handlebars.js/blob/master/release-notes.md#v430---september-24th-2019"
        }
      ]
    },
    {
      "category": "dependency_scanning",
      "name": "Disallow calling helperMissing and blockHelperMissing directly",
      "message": "Disallow calling helperMissing and blockHelperMissing directly in handlebars.js",
      "cve": "package.json:handlebars.js:retire.js:dad7d984bb9cb333cbc023e8b6c17d5a",
      "severity": "Low",
      "scanner": {
        "id": "retire.js",
        "name": "Retire.js"
      },
      "location": {
        "file": "package.json",
        "dependency": {
          "package": {
            "name": "handlebars.js"
          },
          "version": "4.0.11"
        }
      },
      "identifiers": [
        {
          "type": "retire.js",
          "name": "RETIRE-JS-dad7d984bb9cb333cbc023e8b6c17d5a",
          "value": "dad7d984bb9cb333cbc023e8b6c17d5a",
          "url": "https://github.com/wycats/handlebars.js/blob/master/release-notes.md#v430---september-24th-2019"
        }
      ],
      "links": [
        {
          "url": "https://github.com/wycats/handlebars.js/blob/master/release-notes.md#v430---september-24th-2019"
        }
      ]
    },
    {
      "category": "dependency_scanning",
      "name": "Disallow calling helperMissing and blockHelperMissing directly",
      "message": "Disallow calling helperMissing and blockHelperMissing directly in handlebars.js",
      "cve": "package.json:handlebars.js:retire.js:dad7d984bb9cb333cbc023e8b6c17d5a",
      "severity": "Low",
      "scanner": {
        "id": "retire.js",
        "name": "Retire.js"
      },
      "location": {
        "file": "package.json",
        "dependency": {
          "package": {
            "name": "handlebars.js"
          },
          "version": "4.0.11"
        }
      },
      "identifiers": [
        {
          "type": "retire.js",
          "name": "RETIRE-JS-dad7d984bb9cb333cbc023e8b6c17d5a",
          "value": "dad7d984bb9cb333cbc023e8b6c17d5a",
          "url": "https://github.com/wycats/handlebars.js/blob/master/release-notes.md#v430---september-24th-2019"
        }
      ],
      "links": [
        {
          "url": "https://github.com/wycats/handlebars.js/blob/master/release-notes.md#v430---september-24th-2019"
        }
      ]
    },
    {
      "category": "dependency_scanning",
      "name": "Disallow calling helperMissing and blockHelperMissing directly",
      "message": "Disallow calling helperMissing and blockHelperMissing directly in handlebars.js",
      "cve": "package.json:handlebars.js:retire.js:dad7d984bb9cb333cbc023e8b6c17d5a",
      "severity": "Low",
      "scanner": {
        "id": "retire.js",
        "name": "Retire.js"
      },
      "location": {
        "file": "package.json",
        "dependency": {
          "package": {
            "name": "handlebars.js"
          },
          "version": "4.0.11"
        }
      },
      "identifiers": [
        {
          "type": "retire.js",
          "name": "RETIRE-JS-dad7d984bb9cb333cbc023e8b6c17d5a",
          "value": "dad7d984bb9cb333cbc023e8b6c17d5a",
          "url": "https://github.com/wycats/handlebars.js/blob/master/release-notes.md#v430---september-24th-2019"
        }
      ],
      "links": [
        {
          "url": "https://github.com/wycats/handlebars.js/blob/master/release-notes.md#v430---september-24th-2019"
        }
      ]
    },
    {
      "category": "dependency_scanning",
      "name": "Disallow calling helperMissing and blockHelperMissing directly",
      "message": "Disallow calling helperMissing and blockHelperMissing directly in handlebars.js",
      "cve": "package.json:handlebars.js:retire.js:dad7d984bb9cb333cbc023e8b6c17d5a",
      "severity": "Low",
      "scanner": {
        "id": "retire.js",
        "name": "Retire.js"
      },
      "location": {
        "file": "package.json",
        "dependency": {
          "package": {
            "name": "handlebars.js"
          },
          "version": "4.0.11"
        }
      },
      "identifiers": [
        {
          "type": "retire.js",
          "name": "RETIRE-JS-dad7d984bb9cb333cbc023e8b6c17d5a",
          "value": "dad7d984bb9cb333cbc023e8b6c17d5a",
          "url": "https://github.com/wycats/handlebars.js/blob/master/release-notes.md#v430---september-24th-2019"
        }
      ],
      "links": [
        {
          "url": "https://github.com/wycats/handlebars.js/blob/master/release-notes.md#v430---september-24th-2019"
        }
      ]
    },
    {
      "category": "dependency_scanning",
      "name": "Disallow calling helperMissing and blockHelperMissing directly",
      "message": "Disallow calling helperMissing and blockHelperMissing directly in handlebars.js",
      "cve": "package.json:handlebars.js:retire.js:dad7d984bb9cb333cbc023e8b6c17d5a",
      "severity": "Low",
      "scanner": {
        "id": "retire.js",
        "name": "Retire.js"
      },
      "location": {
        "file": "package.json",
        "dependency": {
          "package": {
            "name": "handlebars.js"
          },
          "version": "4.0.11"
        }
      },
      "identifiers": [
        {
          "type": "retire.js",
          "name": "RETIRE-JS-dad7d984bb9cb333cbc023e8b6c17d5a",
          "value": "dad7d984bb9cb333cbc023e8b6c17d5a",
          "url": "https://github.com/wycats/handlebars.js/blob/master/release-notes.md#v430---september-24th-2019"
        }
      ],
      "links": [
        {
          "url": "https://github.com/wycats/handlebars.js/blob/master/release-notes.md#v430---september-24th-2019"
        }
      ]
    },
    {
      "category": "dependency_scanning",
      "name": "Prototype pollution attack",
      "message": "Prototype pollution attack in hoek",
      "cve": "package.json:hoek:hackerone:310439",
      "severity": "Low",
      "scanner": {
        "id": "retire.js",
        "name": "Retire.js"
      },
      "location": {
        "file": "package.json",
        "dependency": {
          "package": {
            "name": "hoek"
          },
          "version": "0.9.1"
        }
      },
      "identifiers": [
        {
          "type": "hackerone",
          "name": "HACKERONE-310439",
          "value": "310439",
          "url": "https://hackerone.com/reports/310439"
        }
      ],
      "links": [
        {
          "url": "https://hackerone.com/reports/310439"
        }
      ]
    },
    {
      "category": "dependency_scanning",
      "name": "Prototype pollution attack",
      "message": "Prototype pollution attack in hoek",
      "cve": "package.json:hoek:hackerone:310439",
      "severity": "Low",
      "scanner": {
        "id": "retire.js",
        "name": "Retire.js"
      },
      "location": {
        "file": "package.json",
        "dependency": {
          "package": {
            "name": "hoek"
          },
          "version": "4.2.0"
        }
      },
      "identifiers": [
        {
          "type": "hackerone",
          "name": "HACKERONE-310439",
          "value": "310439",
          "url": "https://hackerone.com/reports/310439"
        }
      ],
      "links": [
        {
          "url": "https://hackerone.com/reports/310439"
        }
      ]
    },
    {
      "category": "dependency_scanning",
      "name": "jQuery before 3.4.0, as used in Drupal, Backdrop CMS, and other products, mishandles jQuery.extend(true, {}, ...) because of Object.prototype pollution",
      "message": "jQuery before 3.4.0, as used in Drupal, Backdrop CMS, and other products, mishandles jQuery.extend(true, {}, ...) because of Object.prototype pollution in jquery",
      "cve": "package.json:jquery:cve:CVE-2019-11358",
      "severity": "Low",
      "scanner": {
        "id": "retire.js",
        "name": "Retire.js"
      },
      "location": {
        "file": "package.json",
        "dependency": {
          "package": {
            "name": "jquery"
          },
          "version": "1.9.1"
        }
      },
      "identifiers": [
        {
          "type": "cve",
          "name": "CVE-2019-11358",
          "value": "CVE-2019-11358",
          "url": "https://cve.mitre.org/cgi-bin/cvename.cgi?name=CVE-2019-11358"
        }
      ],
      "links": [
        {
          "url": "https://blog.jquery.com/2019/04/10/jquery-3-4-0-released/"
        },
        {
          "url": "https://nvd.nist.gov/vuln/detail/CVE-2019-11358"
        },
        {
          "url": "https://github.com/jquery/jquery/commit/753d591aea698e57d6db58c9f722cd0808619b1b"
        }
      ]
    },
    {
      "category": "dependency_scanning",
      "name": "Prototype pollution attack",
      "message": "Prototype pollution attack in lodash",
      "cve": "package.json:lodash:hackerone:380873",
      "severity": "Low",
      "scanner": {
        "id": "retire.js",
        "name": "Retire.js"
      },
      "location": {
        "file": "package.json",
        "dependency": {
          "package": {
            "name": "lodash"
          },
          "version": "4.17.4"
        }
      },
      "identifiers": [
        {
          "type": "hackerone",
          "name": "HACKERONE-380873",
          "value": "380873",
          "url": "https://hackerone.com/reports/380873"
        }
      ],
      "links": [
        {
          "url": "https://hackerone.com/reports/380873"
        }
      ]
    },
    {
      "category": "dependency_scanning",
      "name": "Prototype pollution attack",
      "message": "Prototype pollution attack in lodash",
      "cve": "package.json:lodash:hackerone:380873",
      "severity": "Low",
      "scanner": {
        "id": "retire.js",
        "name": "Retire.js"
      },
      "location": {
        "file": "package.json",
        "dependency": {
          "package": {
            "name": "lodash"
          },
          "version": "4.17.5"
        }
      },
      "identifiers": [
        {
          "type": "hackerone",
          "name": "HACKERONE-380873",
          "value": "380873",
          "url": "https://hackerone.com/reports/380873"
        }
      ],
      "links": [
        {
          "url": "https://hackerone.com/reports/380873"
        }
      ]
    }
  ],
  "remediations": [],
  "scan": {
    "scanner": {
      "id": "retire.js",
      "name": "Retire.js",
      "url": "https://retirejs.github.io/retire.js",
      "vendor": {
        "name": "GitLab"
      },
      "version": "3.0.1"
    },
    "type": "dependency_scanning",
    "status": "success"
  }
}
