{
  "version": "1.1",
  "licenses": [
    {
      "count": 76,
      "name": "http://go.microsoft.com/fwlink/?LinkId=329770"
    },
    {
      "count": 2,
      "name": "https://github.com/dotnet/corefx/blob/master/LICENSE.TXT"
    },
    {
      "count": 2,
      "name": "unknown"
    },
    {
      "count": 1,
      "name": "MIT"
    },
    {
      "count": 1,
      "name": "http://opensource.org/licenses/Apache-2.0"
    },
    {
      "count": 1,
      "name": "http://opensource.org/licenses/LGPL-2.1"
    },
    {
      "count": 1,
      "name": "http://www.apache.org/licenses/LICENSE-2.0"
    },
    {
      "count": 1,
      "name": "http://www.opensource.org/licenses/mit-license.php"
    },
    {
      "count": 1,
      "name": "https://github.com/Microsoft/ChakraCore/blob/master/LICENSE.txt"
    },
    {
      "count": 1,
      "name": "https://raw.githubusercontent.com/antlr/antlrcs/master/LICENSE.txt"
    },
    {
      "count": 1,
      "name": "https://raw.githubusercontent.com/nhibernate/nhibernate-core/master/LICENSE.txt"
    }
  ],
  "dependencies": [
    {
      "licenses": [
        {
          "name": "https://raw.githubusercontent.com/antlr/antlrcs/master/LICENSE.txt",
          "url": ""
        }
      ],
      "license": {
        "name": "https://raw.githubusercontent.com/antlr/antlrcs/master/LICENSE.txt"
      },
      "dependency": {
        "name": "Antlr3.Runtime",
        "description": "",
        "pathes": [
          "."
        ]
      }
    },
    {
      "licenses": [
        {
          "name": "unknown",
          "url": ""
        }
      ],
      "license": {
        "name": "unknown"
      },
      "dependency": {
        "name": "Iesi.Collections",
        "description": "",
        "pathes": [
          "."
        ]
      }
    },
    {
      "licenses": [
        {
          "name": "https://github.com/Microsoft/ChakraCore/blob/master/LICENSE.txt",
          "url": ""
        }
      ],
      "license": {
        "name": "https://github.com/Microsoft/ChakraCore/blob/master/LICENSE.txt"
      },
      "dependency": {
        "name": "Microsoft.ChakraCore",
        "description": "",
        "pathes": [
          "."
        ]
      }
    },
    {
      "licenses": [
        {
          "name": "http://go.microsoft.com/fwlink/?LinkId=329770",
          "url": ""
        }
      ],
      "license": {
        "name": "http://go.microsoft.com/fwlink/?LinkId=329770"
      },
      "dependency": {
        "name": "Microsoft.NETCore.Platforms",
        "description": "",
        "pathes": [
          "."
        ]
      }
    },
    {
      "licenses": [
        {
          "name": "http://go.microsoft.com/fwlink/?LinkId=329770",
          "url": ""
        }
      ],
      "license": {
        "name": "http://go.microsoft.com/fwlink/?LinkId=329770"
      },
      "dependency": {
        "name": "Microsoft.NETCore.Targets",
        "description": "",
        "pathes": [
          "."
        ]
      }
    },
    {
      "licenses": [
        {
          "name": "http://go.microsoft.com/fwlink/?LinkId=329770",
          "url": ""
        }
      ],
      "license": {
        "name": "http://go.microsoft.com/fwlink/?LinkId=329770"
      },
      "dependency": {
        "name": "Microsoft.Win32.Primitives",
        "description": "",
        "pathes": [
          "."
        ]
      }
    },
    {
      "licenses": [
        {
          "name": "http://www.opensource.org/licenses/mit-license.php",
          "url": ""
        }
      ],
      "license": {
        "name": "http://www.opensource.org/licenses/mit-license.php"
      },
      "dependency": {
        "name": "MvcMailer",
        "description": "",
        "pathes": [
          "."
        ]
      }
    },
    {
      "licenses": [
        {
          "name": "http://go.microsoft.com/fwlink/?LinkId=329770",
          "url": ""
        }
      ],
      "license": {
        "name": "http://go.microsoft.com/fwlink/?LinkId=329770"
      },
      "dependency": {
        "name": "NETStandard.Library",
        "description": "",
        "pathes": [
          "."
        ]
      }
    },
    {
      "licenses": [
        {
          "name": "https://raw.githubusercontent.com/nhibernate/nhibernate-core/master/LICENSE.txt",
          "url": ""
        }
      ],
      "license": {
        "name": "https://raw.githubusercontent.com/nhibernate/nhibernate-core/master/LICENSE.txt"
      },
      "dependency": {
        "name": "NHibernate",
        "description": "",
        "pathes": [
          "."
        ]
      }
    },
    {
      "licenses": [
        {
          "name": "http://www.apache.org/licenses/LICENSE-2.0",
          "url": ""
        }
      ],
      "license": {
        "name": "http://www.apache.org/licenses/LICENSE-2.0"
      },
      "dependency": {
        "name": "NodaTime",
        "description": "",
        "pathes": [
          "."
        ]
      }
    },
    {
      "licenses": [
        {
          "name": "http://opensource.org/licenses/Apache-2.0",
          "url": ""
        }
      ],
      "license": {
        "name": "http://opensource.org/licenses/Apache-2.0"
      },
      "dependency": {
        "name": "Remotion.Linq",
        "description": "",
        "pathes": [
          "."
        ]
      }
    },
    {
      "licenses": [
        {
          "name": "http://opensource.org/licenses/LGPL-2.1",
          "url": ""
        }
      ],
      "license": {
        "name": "http://opensource.org/licenses/LGPL-2.1"
      },
      "dependency": {
        "name": "Remotion.Linq.EagerFetching",
        "description": "",
        "pathes": [
          "."
        ]
      }
    },
    {
      "licenses": [
        {
          "name": "http://go.microsoft.com/fwlink/?LinkId=329770",
          "url": ""
        }
      ],
      "license": {
        "name": "http://go.microsoft.com/fwlink/?LinkId=329770"
      },
      "dependency": {
        "name": "System.AppContext",
        "description": "",
        "pathes": [
          "."
        ]
      }
    },
    {
      "licenses": [
        {
          "name": "http://go.microsoft.com/fwlink/?LinkId=329770",
          "url": ""
        }
      ],
      "license": {
        "name": "http://go.microsoft.com/fwlink/?LinkId=329770"
      },
      "dependency": {
        "name": "System.Buffers",
        "description": "",
        "pathes": [
          "."
        ]
      }
    },
    {
      "licenses": [
        {
          "name": "http://go.microsoft.com/fwlink/?LinkId=329770",
          "url": ""
        }
      ],
      "license": {
        "name": "http://go.microsoft.com/fwlink/?LinkId=329770"
      },
      "dependency": {
        "name": "System.Collections",
        "description": "",
        "pathes": [
          "."
        ]
      }
    },
    {
      "licenses": [
        {
          "name": "http://go.microsoft.com/fwlink/?LinkId=329770",
          "url": ""
        }
      ],
      "license": {
        "name": "http://go.microsoft.com/fwlink/?LinkId=329770"
      },
      "dependency": {
        "name": "System.Collections.Concurrent",
        "description": "",
        "pathes": [
          "."
        ]
      }
    },
    {
      "licenses": [
        {
          "name": "https://github.com/dotnet/corefx/blob/master/LICENSE.TXT",
          "url": ""
        }
      ],
      "license": {
        "name": "https://github.com/dotnet/corefx/blob/master/LICENSE.TXT"
      },
      "dependency": {
        "name": "System.Configuration.ConfigurationManager",
        "description": "",
        "pathes": [
          "."
        ]
      }
    },
    {
      "licenses": [
        {
          "name": "http://go.microsoft.com/fwlink/?LinkId=329770",
          "url": ""
        }
      ],
      "license": {
        "name": "http://go.microsoft.com/fwlink/?LinkId=329770"
      },
      "dependency": {
        "name": "System.Console",
        "description": "",
        "pathes": [
          "."
        ]
      }
    },
    {
      "licenses": [
        {
          "name": "http://go.microsoft.com/fwlink/?LinkId=329770",
          "url": ""
        }
      ],
      "license": {
        "name": "http://go.microsoft.com/fwlink/?LinkId=329770"
      },
      "dependency": {
        "name": "System.Diagnostics.Debug",
        "description": "",
        "pathes": [
          "."
        ]
      }
    },
    {
      "licenses": [
        {
          "name": "http://go.microsoft.com/fwlink/?LinkId=329770",
          "url": ""
        }
      ],
      "license": {
        "name": "http://go.microsoft.com/fwlink/?LinkId=329770"
      },
      "dependency": {
        "name": "System.Diagnostics.DiagnosticSource",
        "description": "",
        "pathes": [
          "."
        ]
      }
    },
    {
      "licenses": [
        {
          "name": "http://go.microsoft.com/fwlink/?LinkId=329770",
          "url": ""
        }
      ],
      "license": {
        "name": "http://go.microsoft.com/fwlink/?LinkId=329770"
      },
      "dependency": {
        "name": "System.Diagnostics.Tools",
        "description": "",
        "pathes": [
          "."
        ]
      }
    },
    {
      "licenses": [
        {
          "name": "http://go.microsoft.com/fwlink/?LinkId=329770",
          "url": ""
        }
      ],
      "license": {
        "name": "http://go.microsoft.com/fwlink/?LinkId=329770"
      },
      "dependency": {
        "name": "System.Diagnostics.Tracing",
        "description": "",
        "pathes": [
          "."
        ]
      }
    },
    {
      "licenses": [
        {
          "name": "http://go.microsoft.com/fwlink/?LinkId=329770",
          "url": ""
        }
      ],
      "license": {
        "name": "http://go.microsoft.com/fwlink/?LinkId=329770"
      },
      "dependency": {
        "name": "System.Globalization",
        "description": "",
        "pathes": [
          "."
        ]
      }
    },
    {
      "licenses": [
        {
          "name": "http://go.microsoft.com/fwlink/?LinkId=329770",
          "url": ""
        }
      ],
      "license": {
        "name": "http://go.microsoft.com/fwlink/?LinkId=329770"
      },
      "dependency": {
        "name": "System.Globalization.Calendars",
        "description": "",
        "pathes": [
          "."
        ]
      }
    },
    {
      "licenses": [
        {
          "name": "http://go.microsoft.com/fwlink/?LinkId=329770",
          "url": ""
        }
      ],
      "license": {
        "name": "http://go.microsoft.com/fwlink/?LinkId=329770"
      },
      "dependency": {
        "name": "System.Globalization.Extensions",
        "description": "",
        "pathes": [
          "."
        ]
      }
    },
    {
      "licenses": [
        {
          "name": "http://go.microsoft.com/fwlink/?LinkId=329770",
          "url": ""
        }
      ],
      "license": {
        "name": "http://go.microsoft.com/fwlink/?LinkId=329770"
      },
      "dependency": {
        "name": "System.IO",
        "description": "",
        "pathes": [
          "."
        ]
      }
    },
    {
      "licenses": [
        {
          "name": "http://go.microsoft.com/fwlink/?LinkId=329770",
          "url": ""
        }
      ],
      "license": {
        "name": "http://go.microsoft.com/fwlink/?LinkId=329770"
      },
      "dependency": {
        "name": "System.IO.Compression",
        "description": "",
        "pathes": [
          "."
        ]
      }
    },
    {
      "licenses": [
        {
          "name": "http://go.microsoft.com/fwlink/?LinkId=329770",
          "url": ""
        }
      ],
      "license": {
        "name": "http://go.microsoft.com/fwlink/?LinkId=329770"
      },
      "dependency": {
        "name": "System.IO.Compression.ZipFile",
        "description": "",
        "pathes": [
          "."
        ]
      }
    },
    {
      "licenses": [
        {
          "name": "http://go.microsoft.com/fwlink/?LinkId=329770",
          "url": ""
        }
      ],
      "license": {
        "name": "http://go.microsoft.com/fwlink/?LinkId=329770"
      },
      "dependency": {
        "name": "System.IO.FileSystem",
        "description": "",
        "pathes": [
          "."
        ]
      }
    },
    {
      "licenses": [
        {
          "name": "http://go.microsoft.com/fwlink/?LinkId=329770",
          "url": ""
        }
      ],
      "license": {
        "name": "http://go.microsoft.com/fwlink/?LinkId=329770"
      },
      "dependency": {
        "name": "System.IO.FileSystem.Primitives",
        "description": "",
        "pathes": [
          "."
        ]
      }
    },
    {
      "licenses": [
        {
          "name": "http://go.microsoft.com/fwlink/?LinkId=329770",
          "url": ""
        }
      ],
      "license": {
        "name": "http://go.microsoft.com/fwlink/?LinkId=329770"
      },
      "dependency": {
        "name": "System.Linq",
        "description": "",
        "pathes": [
          "."
        ]
      }
    },
    {
      "licenses": [
        {
          "name": "http://go.microsoft.com/fwlink/?LinkId=329770",
          "url": ""
        }
      ],
      "license": {
        "name": "http://go.microsoft.com/fwlink/?LinkId=329770"
      },
      "dependency": {
        "name": "System.Linq.Expressions",
        "description": "",
        "pathes": [
          "."
        ]
      }
    },
    {
      "licenses": [
        {
          "name": "http://go.microsoft.com/fwlink/?LinkId=329770",
          "url": ""
        }
      ],
      "license": {
        "name": "http://go.microsoft.com/fwlink/?LinkId=329770"
      },
      "dependency": {
        "name": "System.Linq.Queryable",
        "description": "",
        "pathes": [
          "."
        ]
      }
    },
    {
      "licenses": [
        {
          "name": "http://go.microsoft.com/fwlink/?LinkId=329770",
          "url": ""
        }
      ],
      "license": {
        "name": "http://go.microsoft.com/fwlink/?LinkId=329770"
      },
      "dependency": {
        "name": "System.Net.Http",
        "description": "",
        "pathes": [
          "."
        ]
      }
    },
    {
      "licenses": [
        {
          "name": "http://go.microsoft.com/fwlink/?LinkId=329770",
          "url": ""
        }
      ],
      "license": {
        "name": "http://go.microsoft.com/fwlink/?LinkId=329770"
      },
      "dependency": {
        "name": "System.Net.Primitives",
        "description": "",
        "pathes": [
          "."
        ]
      }
    },
    {
      "licenses": [
        {
          "name": "http://go.microsoft.com/fwlink/?LinkId=329770",
          "url": ""
        }
      ],
      "license": {
        "name": "http://go.microsoft.com/fwlink/?LinkId=329770"
      },
      "dependency": {
        "name": "System.Net.Sockets",
        "description": "",
        "pathes": [
          "."
        ]
      }
    },
    {
      "licenses": [
        {
          "name": "http://go.microsoft.com/fwlink/?LinkId=329770",
          "url": ""
        }
      ],
      "license": {
        "name": "http://go.microsoft.com/fwlink/?LinkId=329770"
      },
      "dependency": {
        "name": "System.ObjectModel",
        "description": "",
        "pathes": [
          "."
        ]
      }
    },
    {
      "licenses": [
        {
          "name": "http://go.microsoft.com/fwlink/?LinkId=329770",
          "url": ""
        }
      ],
      "license": {
        "name": "http://go.microsoft.com/fwlink/?LinkId=329770"
      },
      "dependency": {
        "name": "System.Reflection",
        "description": "",
        "pathes": [
          "."
        ]
      }
    },
    {
      "licenses": [
        {
          "name": "http://go.microsoft.com/fwlink/?LinkId=329770",
          "url": ""
        }
      ],
      "license": {
        "name": "http://go.microsoft.com/fwlink/?LinkId=329770"
      },
      "dependency": {
        "name": "System.Reflection.Emit",
        "description": "",
        "pathes": [
          "."
        ]
      }
    },
    {
      "licenses": [
        {
          "name": "http://go.microsoft.com/fwlink/?LinkId=329770",
          "url": ""
        }
      ],
      "license": {
        "name": "http://go.microsoft.com/fwlink/?LinkId=329770"
      },
      "dependency": {
        "name": "System.Reflection.Emit.ILGeneration",
        "description": "",
        "pathes": [
          "."
        ]
      }
    },
    {
      "licenses": [
        {
          "name": "http://go.microsoft.com/fwlink/?LinkId=329770",
          "url": ""
        }
      ],
      "license": {
        "name": "http://go.microsoft.com/fwlink/?LinkId=329770"
      },
      "dependency": {
        "name": "System.Reflection.Emit.Lightweight",
        "description": "",
        "pathes": [
          "."
        ]
      }
    },
    {
      "licenses": [
        {
          "name": "http://go.microsoft.com/fwlink/?LinkId=329770",
          "url": ""
        }
      ],
      "license": {
        "name": "http://go.microsoft.com/fwlink/?LinkId=329770"
      },
      "dependency": {
        "name": "System.Reflection.Extensions",
        "description": "",
        "pathes": [
          "."
        ]
      }
    },
    {
      "licenses": [
        {
          "name": "http://go.microsoft.com/fwlink/?LinkId=329770",
          "url": ""
        }
      ],
      "license": {
        "name": "http://go.microsoft.com/fwlink/?LinkId=329770"
      },
      "dependency": {
        "name": "System.Reflection.Primitives",
        "description": "",
        "pathes": [
          "."
        ]
      }
    },
    {
      "licenses": [
        {
          "name": "http://go.microsoft.com/fwlink/?LinkId=329770",
          "url": ""
        }
      ],
      "license": {
        "name": "http://go.microsoft.com/fwlink/?LinkId=329770"
      },
      "dependency": {
        "name": "System.Reflection.TypeExtensions",
        "description": "",
        "pathes": [
          "."
        ]
      }
    },
    {
      "licenses": [
        {
          "name": "http://go.microsoft.com/fwlink/?LinkId=329770",
          "url": ""
        }
      ],
      "license": {
        "name": "http://go.microsoft.com/fwlink/?LinkId=329770"
      },
      "dependency": {
        "name": "System.Resources.ResourceManager",
        "description": "",
        "pathes": [
          "."
        ]
      }
    },
    {
      "licenses": [
        {
          "name": "http://go.microsoft.com/fwlink/?LinkId=329770",
          "url": ""
        }
      ],
      "license": {
        "name": "http://go.microsoft.com/fwlink/?LinkId=329770"
      },
      "dependency": {
        "name": "System.Runtime",
        "description": "",
        "pathes": [
          "."
        ]
      }
    },
    {
      "licenses": [
        {
          "name": "http://go.microsoft.com/fwlink/?LinkId=329770",
          "url": ""
        }
      ],
      "license": {
        "name": "http://go.microsoft.com/fwlink/?LinkId=329770"
      },
      "dependency": {
        "name": "System.Runtime.Extensions",
        "description": "",
        "pathes": [
          "."
        ]
      }
    },
    {
      "licenses": [
        {
          "name": "http://go.microsoft.com/fwlink/?LinkId=329770",
          "url": ""
        }
      ],
      "license": {
        "name": "http://go.microsoft.com/fwlink/?LinkId=329770"
      },
      "dependency": {
        "name": "System.Runtime.Handles",
        "description": "",
        "pathes": [
          "."
        ]
      }
    },
    {
      "licenses": [
        {
          "name": "http://go.microsoft.com/fwlink/?LinkId=329770",
          "url": ""
        }
      ],
      "license": {
        "name": "http://go.microsoft.com/fwlink/?LinkId=329770"
      },
      "dependency": {
        "name": "System.Runtime.InteropServices",
        "description": "",
        "pathes": [
          "."
        ]
      }
    },
    {
      "licenses": [
        {
          "name": "http://go.microsoft.com/fwlink/?LinkId=329770",
          "url": ""
        }
      ],
      "license": {
        "name": "http://go.microsoft.com/fwlink/?LinkId=329770"
      },
      "dependency": {
        "name": "System.Runtime.InteropServices.RuntimeInformation",
        "description": "",
        "pathes": [
          "."
        ]
      }
    },
    {
      "licenses": [
        {
          "name": "http://go.microsoft.com/fwlink/?LinkId=329770",
          "url": ""
        }
      ],
      "license": {
        "name": "http://go.microsoft.com/fwlink/?LinkId=329770"
      },
      "dependency": {
        "name": "System.Runtime.Numerics",
        "description": "",
        "pathes": [
          "."
        ]
      }
    },
    {
      "licenses": [
        {
          "name": "http://go.microsoft.com/fwlink/?LinkId=329770",
          "url": ""
        }
      ],
      "license": {
        "name": "http://go.microsoft.com/fwlink/?LinkId=329770"
      },
      "dependency": {
        "name": "System.Runtime.Serialization.Formatters",
        "description": "",
        "pathes": [
          "."
        ]
      }
    },
    {
      "licenses": [
        {
          "name": "http://go.microsoft.com/fwlink/?LinkId=329770",
          "url": ""
        }
      ],
      "license": {
        "name": "http://go.microsoft.com/fwlink/?LinkId=329770"
      },
      "dependency": {
        "name": "System.Runtime.Serialization.Primitives",
        "description": "",
        "pathes": [
          "."
        ]
      }
    },
    {
      "licenses": [
        {
          "name": "http://go.microsoft.com/fwlink/?LinkId=329770",
          "url": ""
        }
      ],
      "license": {
        "name": "http://go.microsoft.com/fwlink/?LinkId=329770"
      },
      "dependency": {
        "name": "System.Security.Cryptography.Algorithms",
        "description": "",
        "pathes": [
          "."
        ]
      }
    },
    {
      "licenses": [
        {
          "name": "http://go.microsoft.com/fwlink/?LinkId=329770",
          "url": ""
        }
      ],
      "license": {
        "name": "http://go.microsoft.com/fwlink/?LinkId=329770"
      },
      "dependency": {
        "name": "System.Security.Cryptography.Cng",
        "description": "",
        "pathes": [
          "."
        ]
      }
    },
    {
      "licenses": [
        {
          "name": "http://go.microsoft.com/fwlink/?LinkId=329770",
          "url": ""
        }
      ],
      "license": {
        "name": "http://go.microsoft.com/fwlink/?LinkId=329770"
      },
      "dependency": {
        "name": "System.Security.Cryptography.Csp",
        "description": "",
        "pathes": [
          "."
        ]
      }
    },
    {
      "licenses": [
        {
          "name": "http://go.microsoft.com/fwlink/?LinkId=329770",
          "url": ""
        }
      ],
      "license": {
        "name": "http://go.microsoft.com/fwlink/?LinkId=329770"
      },
      "dependency": {
        "name": "System.Security.Cryptography.Encoding",
        "description": "",
        "pathes": [
          "."
        ]
      }
    },
    {
      "licenses": [
        {
          "name": "http://go.microsoft.com/fwlink/?LinkId=329770",
          "url": ""
        }
      ],
      "license": {
        "name": "http://go.microsoft.com/fwlink/?LinkId=329770"
      },
      "dependency": {
        "name": "System.Security.Cryptography.OpenSsl",
        "description": "",
        "pathes": [
          "."
        ]
      }
    },
    {
      "licenses": [
        {
          "name": "http://go.microsoft.com/fwlink/?LinkId=329770",
          "url": ""
        }
      ],
      "license": {
        "name": "http://go.microsoft.com/fwlink/?LinkId=329770"
      },
      "dependency": {
        "name": "System.Security.Cryptography.Primitives",
        "description": "",
        "pathes": [
          "."
        ]
      }
    },
    {
      "licenses": [
        {
          "name": "https://github.com/dotnet/corefx/blob/master/LICENSE.TXT",
          "url": ""
        }
      ],
      "license": {
        "name": "https://github.com/dotnet/corefx/blob/master/LICENSE.TXT"
      },
      "dependency": {
        "name": "System.Security.Cryptography.ProtectedData",
        "description": "",
        "pathes": [
          "."
        ]
      }
    },
    {
      "licenses": [
        {
          "name": "http://go.microsoft.com/fwlink/?LinkId=329770",
          "url": ""
        }
      ],
      "license": {
        "name": "http://go.microsoft.com/fwlink/?LinkId=329770"
      },
      "dependency": {
        "name": "System.Security.Cryptography.X509Certificates",
        "description": "",
        "pathes": [
          "."
        ]
      }
    },
    {
      "licenses": [
        {
          "name": "http://go.microsoft.com/fwlink/?LinkId=329770",
          "url": ""
        }
      ],
      "license": {
        "name": "http://go.microsoft.com/fwlink/?LinkId=329770"
      },
      "dependency": {
        "name": "System.Text.Encoding",
        "description": "",
        "pathes": [
          "."
        ]
      }
    },
    {
      "licenses": [
        {
          "name": "http://go.microsoft.com/fwlink/?LinkId=329770",
          "url": ""
        }
      ],
      "license": {
        "name": "http://go.microsoft.com/fwlink/?LinkId=329770"
      },
      "dependency": {
        "name": "System.Text.Encoding.Extensions",
        "description": "",
        "pathes": [
          "."
        ]
      }
    },
    {
      "licenses": [
        {
          "name": "http://go.microsoft.com/fwlink/?LinkId=329770",
          "url": ""
        }
      ],
      "license": {
        "name": "http://go.microsoft.com/fwlink/?LinkId=329770"
      },
      "dependency": {
        "name": "System.Text.RegularExpressions",
        "description": "",
        "pathes": [
          "."
        ]
      }
    },
    {
      "licenses": [
        {
          "name": "http://go.microsoft.com/fwlink/?LinkId=329770",
          "url": ""
        }
      ],
      "license": {
        "name": "http://go.microsoft.com/fwlink/?LinkId=329770"
      },
      "dependency": {
        "name": "System.Threading",
        "description": "",
        "pathes": [
          "."
        ]
      }
    },
    {
      "licenses": [
        {
          "name": "http://go.microsoft.com/fwlink/?LinkId=329770",
          "url": ""
        }
      ],
      "license": {
        "name": "http://go.microsoft.com/fwlink/?LinkId=329770"
      },
      "dependency": {
        "name": "System.Threading.Tasks",
        "description": "",
        "pathes": [
          "."
        ]
      }
    },
    {
      "licenses": [
        {
          "name": "http://go.microsoft.com/fwlink/?LinkId=329770",
          "url": ""
        }
      ],
      "license": {
        "name": "http://go.microsoft.com/fwlink/?LinkId=329770"
      },
      "dependency": {
        "name": "System.Threading.Tasks.Extensions",
        "description": "",
        "pathes": [
          "."
        ]
      }
    },
    {
      "licenses": [
        {
          "name": "http://go.microsoft.com/fwlink/?LinkId=329770",
          "url": ""
        }
      ],
      "license": {
        "name": "http://go.microsoft.com/fwlink/?LinkId=329770"
      },
      "dependency": {
        "name": "System.Threading.Timer",
        "description": "",
        "pathes": [
          "."
        ]
      }
    },
    {
      "licenses": [
        {
          "name": "http://go.microsoft.com/fwlink/?LinkId=329770",
          "url": ""
        }
      ],
      "license": {
        "name": "http://go.microsoft.com/fwlink/?LinkId=329770"
      },
      "dependency": {
        "name": "System.Xml.ReaderWriter",
        "description": "",
        "pathes": [
          "."
        ]
      }
    },
    {
      "licenses": [
        {
          "name": "http://go.microsoft.com/fwlink/?LinkId=329770",
          "url": ""
        }
      ],
      "license": {
        "name": "http://go.microsoft.com/fwlink/?LinkId=329770"
      },
      "dependency": {
        "name": "System.Xml.XDocument",
        "description": "",
        "pathes": [
          "."
        ]
      }
    },
    {
      "licenses": [
        {
          "name": "unknown",
          "url": ""
        }
      ],
      "license": {
        "name": "unknown"
      },
      "dependency": {
        "name": "T4Scaffolding.Core",
        "description": "",
        "pathes": [
          "."
        ]
      }
    },
    {
      "licenses": [
        {
          "name": "MIT",
          "url": "http://opensource.org/licenses/mit-license"
        }
      ],
      "license": {
        "name": "MIT",
        "url": "http://opensource.org/licenses/mit-license"
      },
      "dependency": {
        "name": "jive",
        "description": "",
        "pathes": [
          "."
        ]
      }
    },
    {
      "licenses": [
        {
          "name": "http://go.microsoft.com/fwlink/?LinkId=329770",
          "url": ""
        }
      ],
      "license": {
        "name": "http://go.microsoft.com/fwlink/?LinkId=329770"
      },
      "dependency": {
        "name": "runtime.debian.8-x64.runtime.native.System.Security.Cryptography.OpenSsl",
        "description": "",
        "pathes": [
          "."
        ]
      }
    },
    {
      "licenses": [
        {
          "name": "http://go.microsoft.com/fwlink/?LinkId=329770",
          "url": ""
        }
      ],
      "license": {
        "name": "http://go.microsoft.com/fwlink/?LinkId=329770"
      },
      "dependency": {
        "name": "runtime.fedora.23-x64.runtime.native.System.Security.Cryptography.OpenSsl",
        "description": "",
        "pathes": [
          "."
        ]
      }
    },
    {
      "licenses": [
        {
          "name": "http://go.microsoft.com/fwlink/?LinkId=329770",
          "url": ""
        }
      ],
      "license": {
        "name": "http://go.microsoft.com/fwlink/?LinkId=329770"
      },
      "dependency": {
        "name": "runtime.fedora.24-x64.runtime.native.System.Security.Cryptography.OpenSsl",
        "description": "",
        "pathes": [
          "."
        ]
      }
    },
    {
      "licenses": [
        {
          "name": "http://go.microsoft.com/fwlink/?LinkId=329770",
          "url": ""
        }
      ],
      "license": {
        "name": "http://go.microsoft.com/fwlink/?LinkId=329770"
      },
      "dependency": {
        "name": "runtime.native.System",
        "description": "",
        "pathes": [
          "."
        ]
      }
    },
    {
      "licenses": [
        {
          "name": "http://go.microsoft.com/fwlink/?LinkId=329770",
          "url": ""
        }
      ],
      "license": {
        "name": "http://go.microsoft.com/fwlink/?LinkId=329770"
      },
      "dependency": {
        "name": "runtime.native.System.IO.Compression",
        "description": "",
        "pathes": [
          "."
        ]
      }
    },
    {
      "licenses": [
        {
          "name": "http://go.microsoft.com/fwlink/?LinkId=329770",
          "url": ""
        }
      ],
      "license": {
        "name": "http://go.microsoft.com/fwlink/?LinkId=329770"
      },
      "dependency": {
        "name": "runtime.native.System.Net.Http",
        "description": "",
        "pathes": [
          "."
        ]
      }
    },
    {
      "licenses": [
        {
          "name": "http://go.microsoft.com/fwlink/?LinkId=329770",
          "url": ""
        }
      ],
      "license": {
        "name": "http://go.microsoft.com/fwlink/?LinkId=329770"
      },
      "dependency": {
        "name": "runtime.native.System.Security.Cryptography.Apple",
        "description": "",
        "pathes": [
          "."
        ]
      }
    },
    {
      "licenses": [
        {
          "name": "http://go.microsoft.com/fwlink/?LinkId=329770",
          "url": ""
        }
      ],
      "license": {
        "name": "http://go.microsoft.com/fwlink/?LinkId=329770"
      },
      "dependency": {
        "name": "runtime.native.System.Security.Cryptography.OpenSsl",
        "description": "",
        "pathes": [
          "."
        ]
      }
    },
    {
      "licenses": [
        {
          "name": "http://go.microsoft.com/fwlink/?LinkId=329770",
          "url": ""
        }
      ],
      "license": {
        "name": "http://go.microsoft.com/fwlink/?LinkId=329770"
      },
      "dependency": {
        "name": "runtime.opensuse.13.2-x64.runtime.native.System.Security.Cryptography.OpenSsl",
        "description": "",
        "pathes": [
          "."
        ]
      }
    },
    {
      "licenses": [
        {
          "name": "http://go.microsoft.com/fwlink/?LinkId=329770",
          "url": ""
        }
      ],
      "license": {
        "name": "http://go.microsoft.com/fwlink/?LinkId=329770"
      },
      "dependency": {
        "name": "runtime.opensuse.42.1-x64.runtime.native.System.Security.Cryptography.OpenSsl",
        "description": "",
        "pathes": [
          "."
        ]
      }
    },
    {
      "licenses": [
        {
          "name": "http://go.microsoft.com/fwlink/?LinkId=329770",
          "url": ""
        }
      ],
      "license": {
        "name": "http://go.microsoft.com/fwlink/?LinkId=329770"
      },
      "dependency": {
        "name": "runtime.osx.10.10-x64.runtime.native.System.Security.Cryptography.Apple",
        "description": "",
        "pathes": [
          "."
        ]
      }
    },
    {
      "licenses": [
        {
          "name": "http://go.microsoft.com/fwlink/?LinkId=329770",
          "url": ""
        }
      ],
      "license": {
        "name": "http://go.microsoft.com/fwlink/?LinkId=329770"
      },
      "dependency": {
        "name": "runtime.osx.10.10-x64.runtime.native.System.Security.Cryptography.OpenSsl",
        "description": "",
        "pathes": [
          "."
        ]
      }
    },
    {
      "licenses": [
        {
          "name": "http://go.microsoft.com/fwlink/?LinkId=329770",
          "url": ""
        }
      ],
      "license": {
        "name": "http://go.microsoft.com/fwlink/?LinkId=329770"
      },
      "dependency": {
        "name": "runtime.rhel.7-x64.runtime.native.System.Security.Cryptography.OpenSsl",
        "description": "",
        "pathes": [
          "."
        ]
      }
    },
    {
      "licenses": [
        {
          "name": "http://go.microsoft.com/fwlink/?LinkId=329770",
          "url": ""
        }
      ],
      "license": {
        "name": "http://go.microsoft.com/fwlink/?LinkId=329770"
      },
      "dependency": {
        "name": "runtime.ubuntu.14.04-x64.runtime.native.System.Security.Cryptography.OpenSsl",
        "description": "",
        "pathes": [
          "."
        ]
      }
    },
    {
      "licenses": [
        {
          "name": "http://go.microsoft.com/fwlink/?LinkId=329770",
          "url": ""
        }
      ],
      "license": {
        "name": "http://go.microsoft.com/fwlink/?LinkId=329770"
      },
      "dependency": {
        "name": "runtime.ubuntu.16.04-x64.runtime.native.System.Security.Cryptography.OpenSsl",
        "description": "",
        "pathes": [
          "."
        ]
      }
    },
    {
      "licenses": [
        {
          "name": "http://go.microsoft.com/fwlink/?LinkId=329770",
          "url": ""
        }
      ],
      "license": {
        "name": "http://go.microsoft.com/fwlink/?LinkId=329770"
      },
      "dependency": {
        "name": "runtime.ubuntu.16.10-x64.runtime.native.System.Security.Cryptography.OpenSsl",
        "description": "",
        "pathes": [
          "."
        ]
      }
    }
  ]
}