[
  {
    "name": "acorn",
    "version": "4.0.4"
  },
  {
    "name": "acorn",
    "version": "3.3.0"
  },
  {
    "name": "acorn",
    "version": "4.0.11"
  },
  {
    "name": "@angular/animations",
    "version": "4.4.6"
  }
]