pipdeptree==0.10.1
  - pip [required: >=6.0.0, installed: 9.0.1]
Pylons==1.0.2
  - Beaker [required: >=1.5.4, installed: 1.9.0]
    - funcsigs [required: Any, installed: 1.0.2]
  - decorator [required: >=3.3.2, installed: 4.1.2]
  - FormEncode [required: >=1.2.4, installed: 1.3.1]
  - Mako [required: >=0.5.0, installed: 1.0.7]
    - MarkupSafe [required: >=0.9.2, installed: 1.0]
  - MarkupSafe [required: >=0.15, installed: 1.0]
  - nose [required: >=1.1.2, installed: 1.3.7]
  - Paste [required: >=1.7.5.1, installed: 2.0.3]
    - six [required: >=1.4.0, installed: 1.11.0]
  - PasteDeploy [required: >=1.5.0, installed: 1.5.2]
  - PasteScript [required: >=1.7.4.2, installed: 2.0.2]
    - Paste [required: >=1.3, installed: 2.0.3]
      - six [required: >=1.4.0, installed: 1.11.0]
    - PasteDeploy [required: Any, installed: 1.5.2]
    - six [required: Any, installed: 1.11.0]
  - Routes [required: >=1.12.3, installed: 2.4.1]
    - repoze.lru [required: >=0.3, installed: 0.7]
    - six [required: Any, installed: 1.11.0]
  - simplejson [required: >=2.2.1, installed: 3.13.2]
  - Tempita [required: >=0.5.1, installed: 0.5.2]
  - WebError [required: >=0.10.3, installed: 0.13.1]
    - Paste [required: >=1.7.1, installed: 2.0.3]
      - six [required: >=1.4.0, installed: 1.11.0]
    - Pygments [required: Any, installed: 2.2.0]
    - Tempita [required: Any, installed: 0.5.2]
    - WebOb [required: Any, installed: 1.7.4]
  - WebHelpers [required: >=0.6.4, installed: 1.3]
    - MarkupSafe [required: >=0.9.2, installed: 1.0]
  - WebOb [required: >=1.1.1, installed: 1.7.4]
  - WebTest [required: >=1.3.1, installed: 2.0.29]
    - beautifulsoup4 [required: Any, installed: 4.6.0]
    - six [required: Any, installed: 1.11.0]
    - waitress [required: >=0.8.5, installed: 1.1.0]
    - WebOb [required: >=1.2, installed: 1.7.4]
setuptools==38.2.4
virtualenv==15.1.0
wheel==0.30.0
