{
  "version": "2.4",
  "vulnerabilities": [
    {
      "id": "60ec5dd9fca5f1d2a537c8c3bbf9400674706a95f08616d6639025d902f324d9",
      "category": "sast",
      "name": "Unsafe Regular Expression",
      "message": "Unsafe Regular Expression",
      "description": "Potentially unsafe regular expressions. It may take a very long time to run.",
      "cve": "src/html/index.html:023d9408225a8a1d2d8142434ccb3deffa50da7903e3f1a9e7ce0d4b941579e9:security/detect-unsafe-regex",
      "severity": "High",
      "confidence": "Unknown",
      "scanner": {
        "id": "eslint",
        "name": "ESLint"
      },
      "location": {
        "file": "src/html/index.html",
        "start_line": 8
      },
      "identifiers": [
        {
          "type": "eslint_rule_id",
          "name": "ESLint rule ID security/detect-unsafe-regex",
          "value": "security/detect-unsafe-regex",
          "url": "https://github.com/nodesecurity/eslint-plugin-security#detect-unsafe-regex"
        },
        {
          "type": "cwe",
          "name": "CWE-400",
          "value": "400",
          "url": "https://cwe.mitre.org/data/definitions/400.html"
        }
      ]
    },
    {
      "id": "bf975ecd55ed0d89f3195a3d6746abab1d4871e56170f633da7a7a23cffa3436",
      "category": "sast",
      "name": "eval with argument of type Identifier",
      "message": "eval with argument of type Identifier",
      "description": "eval() used with a variable. This can lead to command injection.",
      "cve": "src/html/index.html:1ec42957a56130bbe6bc2a6328755a5a94ac16d93814a6955a0282091f8fab39:security/detect-eval-with-expression",
      "severity": "Critical",
      "confidence": "Unknown",
      "scanner": {
        "id": "eslint",
        "name": "ESLint"
      },
      "location": {
        "file": "src/html/index.html",
        "start_line": 15
      },
      "identifiers": [
        {
          "type": "eslint_rule_id",
          "name": "ESLint rule ID security/detect-eval-with-expression",
          "value": "security/detect-eval-with-expression",
          "url": "https://github.com/nodesecurity/eslint-plugin-security#detect-eval-with-expression"
        },
        {
          "type": "cwe",
          "name": "CWE-95",
          "value": "95",
          "url": "https://cwe.mitre.org/data/definitions/95.html"
        }
      ]
    },
    {
      "id": "5d52c0f298ecd811f6f08f26c806d3ed1eefb9f25ea6f2ec21e3d1b1e7755c17",
      "category": "sast",
      "name": "Potential timing attack, right side: true",
      "message": "Potential timing attack, right side: true",
      "description": "Insecure comparisons (==, !=, !== and ===), which check input sequentially. This could lead to timing attacks on your application.",
      "cve": "src/html/index.html:a53854dbd0609f06a59f4f8b5a14d7a3a43072df3e2cacee9ea9eee4cacced10:security/detect-possible-timing-attacks",
      "severity": "Low",
      "confidence": "Unknown",
      "scanner": {
        "id": "eslint",
        "name": "ESLint"
      },
      "location": {
        "file": "src/html/index.html",
        "start_line": 52,
        "end_line": 54
      },
      "identifiers": [
        {
          "type": "eslint_rule_id",
          "name": "ESLint rule ID security/detect-possible-timing-attacks",
          "value": "security/detect-possible-timing-attacks",
          "url": "https://github.com/nodesecurity/eslint-plugin-security#detect-possible-timing-attacks"
        },
        {
          "type": "cwe",
          "name": "CWE-208",
          "value": "208",
          "url": "https://cwe.mitre.org/data/definitions/208.html"
        }
      ]
    },
    {
      "id": "f03cfc7e3007d2d05ecbbc641a1211d578f7b5a9f7bfcf2106b698f825e95930",
      "category": "sast",
      "name": "Generic Object Injection Sink",
      "message": "Generic Object Injection Sink",
      "description": "Bracket object notation with user input is present, this might allow an attacker to access all properties of the object and even it's prototype, leading to possible code execution.",
      "cve": "src/html/index.html:c0c7b09a326468ca1f53a4a9d1241c2f69957cfbd5806f41cc325ebe01f12140:security/detect-object-injection",
      "severity": "Critical",
      "confidence": "Unknown",
      "scanner": {
        "id": "eslint",
        "name": "ESLint"
      },
      "location": {
        "file": "src/html/index.html",
        "start_line": 30
      },
      "identifiers": [
        {
          "type": "eslint_rule_id",
          "name": "ESLint rule ID security/detect-object-injection",
          "value": "security/detect-object-injection",
          "url": "https://github.com/nodesecurity/eslint-plugin-security#detect-object-injection"
        },
        {
          "type": "cwe",
          "name": "CWE-94",
          "value": "94",
          "url": "https://cwe.mitre.org/data/definitions/94.html"
        }
      ]
    },
    {
      "id": "27fc371a426cf86b64379b2a698256cc36722f22463a96096da0e1848ba4a13f",
      "category": "sast",
      "name": "Found non-literal argument to RegExp Constructor",
      "message": "Found non-literal argument to RegExp Constructor",
      "description": "RegExp() called with a variable, this might allow an attacker to DOS your application with a long-running regular expression.",
      "cve": "src/html/index.html:fd35d502035abfc361798528e022e175bf7c9ad47cc8bb29f0574d2b8aa012ca:security/detect-non-literal-regexp",
      "severity": "Medium",
      "confidence": "Unknown",
      "scanner": {
        "id": "eslint",
        "name": "ESLint"
      },
      "location": {
        "file": "src/html/index.html",
        "start_line": 19
      },
      "identifiers": [
        {
          "type": "eslint_rule_id",
          "name": "ESLint rule ID security/detect-non-literal-regexp",
          "value": "security/detect-non-literal-regexp",
          "url": "https://github.com/nodesecurity/eslint-plugin-security#detect-non-literal-regexp"
        },
        {
          "type": "cwe",
          "name": "CWE-185",
          "value": "185",
          "url": "https://cwe.mitre.org/data/definitions/185.html"
        }
      ]
    }
  ],
  "scan": {
    "scanner": {
      "id": "eslint",
      "name": "ESLint",
      "url": "https://github.com/nodesecurity/eslint-plugin-security",
      "vendor": {
        "name": "GitLab"
      },
      "version": "7.5.0"
    },
    "type": "sast",
    "status": "success",
    "start_time": "placeholder-value",
    "end_time": "placeholder-value"
  }
}
