{
  "version": "15.0.7",
  "vulnerabilities": [
    {
      "id": ":SKIP:",
      "category": "sast",
      "name": "Possible command injection",
      "message": "Possible command injection",
      "cve": "05343687f25863e119feddbdac69c6ebb72b2521df52c3f4c86d330fff2ae231",
      "severity": "Medium",
      "confidence": "Medium",
      "scanner": {
        "id": "brakeman",
        "name": "Brakeman"
      },
      "location": {
        "file": "generic.rb",
        "start_line": 4,
        "class": "Generic",
        "method": "supplied_command"
      },
      "identifiers": [
        {
          "type": "brakeman_warning_code",
          "name": "Brakeman Warning Code 14",
          "value": "14",
          "url": "https://brakemanscanner.org/docs/warning_types/command_injection/"
        },
        {
          "type": "cwe",
          "name": "CWE-77",
          "value": "77",
          "url": "https://cwe.mitre.org/data/definitions/77.html"
        }
      ],
      "tracking": {
        "type": "source",
        "items": [
          {
            "file": "generic.rb",
            "line_start": 4,
            "line_end": 4,
            "signatures": [
              {
                "algorithm": "scope_offset",
                "value": "generic.rb|Generic[0]|supplied_command[0]:1"
              }
            ]
          }
        ]
      }
    }
  ],
  "dependency_files": null,
  "scan": {
    "analyzer": {
      "id": "brakeman",
      "name": "Brakeman",
      "vendor": {
        "name": "GitLab"
      },
      "version": ":SKIP:"
    },
    "scanner": {
      "id": "brakeman",
      "name": "Brakeman",
      "url": "https://brakemanscanner.org",
      "vendor": {
        "name": "GitLab"
      },
      "version": ":SKIP:"
    },
    "type": "sast",
    "start_time": ":SKIP:",
    "end_time": ":SKIP:",
    "status": "success"
  }
}
