{
  "version": "14.0.4",
  "vulnerabilities": [
    {
      "id": "02b695347924f1c24a88e6092866da2d5fdaa075807c0198308ff63d8abd1e10",
      "category": "sast",
      "message": "Probable insecure usage of temp file/directory.",
      "cve": "app1/hardcoded/hardcoded-tmp.py:4ad6d4c40a8c263fc265f3384724014e0a4f8dd6200af83e51ff120420038031:B108",
      "severity": "Medium",
      "confidence": "Medium",
      "scanner": {
        "id": "bandit",
        "name": "Bandit"
      },
      "location": {
        "file": "app1/hardcoded/hardcoded-tmp.py",
        "start_line": 10
      },
      "identifiers": [
        {
          "type": "bandit_test_id",
          "name": "Bandit Test ID B108",
          "value": "B108",
          "url": "https://bandit.readthedocs.io/en/latest/plugins/b108_hardcoded_tmp_directory.html"
        }
      ]
    },
    {
      "id": "30ab04568cfc51c7b56c053de936522abd46204eb8c154c903e8fccfbd1906d6",
      "category": "sast",
      "message": "Probable insecure usage of temp file/directory.",
      "cve": "app1/hardcoded/hardcoded-tmp.py:52865813c884a507be1f152d654245af34aba8a391626d01f1ab6d3f52ec8779:B108",
      "severity": "Medium",
      "confidence": "Medium",
      "scanner": {
        "id": "bandit",
        "name": "Bandit"
      },
      "location": {
        "file": "app1/hardcoded/hardcoded-tmp.py",
        "start_line": 1
      },
      "identifiers": [
        {
          "type": "bandit_test_id",
          "name": "Bandit Test ID B108",
          "value": "B108",
          "url": "https://bandit.readthedocs.io/en/latest/plugins/b108_hardcoded_tmp_directory.html"
        }
      ]
    },
    {
      "id": "358c2ed3fb629c632e19aa38e0d916e91c134464ff16b13e7881f7c3fe5f7003",
      "category": "sast",
      "message": "Probable insecure usage of temp file/directory.",
      "cve": "app1/hardcoded/hardcoded-tmp.py:63dd4d626855555b816985d82c4614a790462a0a3ada89dc58eb97f9c50f3077:B108",
      "severity": "Medium",
      "confidence": "Medium",
      "scanner": {
        "id": "bandit",
        "name": "Bandit"
      },
      "location": {
        "file": "app1/hardcoded/hardcoded-tmp.py",
        "start_line": 14
      },
      "identifiers": [
        {
          "type": "bandit_test_id",
          "name": "Bandit Test ID B108",
          "value": "B108",
          "url": "https://bandit.readthedocs.io/en/latest/plugins/b108_hardcoded_tmp_directory.html"
        }
      ]
    },
    {
      "id": "c4a2e4511928a199cf19804de7a21b9f5475044add161642960222f29f0c3975",
      "category": "sast",
      "message": "Use of insecure MD2, MD4, MD5, or SHA1 hash function.",
      "cve": "app1/imports/imports-aliases.py:017017b77deb0b8369b6065947833eeea752a92ec8a700db590fece3e934cf0d:B303",
      "severity": "Medium",
      "confidence": "High",
      "scanner": {
        "id": "bandit",
        "name": "Bandit"
      },
      "location": {
        "file": "app1/imports/imports-aliases.py",
        "start_line": 13
      },
      "identifiers": [
        {
          "type": "bandit_test_id",
          "name": "Bandit Test ID B303",
          "value": "B303"
        }
      ]
    },
    {
      "id": "ff028f4a6eb2858beaf217a55ee07f99fc5822e11a1886387765821549738888",
      "category": "sast",
      "message": "Use of insecure MD2, MD4, MD5, or SHA1 hash function.",
      "cve": "app1/imports/imports-aliases.py:45fc8c53aea7b84f06bc4e590cc667678d6073c4c8a1d471177ca2146fb22db2:B303",
      "severity": "Medium",
      "confidence": "High",
      "scanner": {
        "id": "bandit",
        "name": "Bandit"
      },
      "location": {
        "file": "app1/imports/imports-aliases.py",
        "start_line": 14
      },
      "identifiers": [
        {
          "type": "bandit_test_id",
          "name": "Bandit Test ID B303",
          "value": "B303"
        }
      ]
    },
    {
      "id": "2bb2dff8aebf044e2d6922b1dc92c453db3ffa622135982e1d84e6828216b294",
      "category": "sast",
      "message": "Pickle and modules that wrap it can be unsafe when used to deserialize untrusted data, possible security issue.",
      "cve": "app1/imports/imports-aliases.py:5f200d47291e7bbd8352db23019b85453ca048dd98ea0c291260fa7d009963a4:B301",
      "severity": "Medium",
      "confidence": "High",
      "scanner": {
        "id": "bandit",
        "name": "Bandit"
      },
      "location": {
        "file": "app1/imports/imports-aliases.py",
        "start_line": 15
      },
      "identifiers": [
        {
          "type": "bandit_test_id",
          "name": "Bandit Test ID B301",
          "value": "B301"
        }
      ]
    },
    {
      "id": "26ae6676e57741f2ed9665d68a231dea99981630139d477b36c25ec5a571f411",
      "category": "sast",
      "message": "Use of insecure MD2, MD4, MD5, or SHA1 hash function.",
      "cve": "app1/imports/imports-aliases.py:a7173c43ae66bd07466632d819d450e0071e02dbf782763640d1092981f9631b:B303",
      "severity": "Medium",
      "confidence": "High",
      "scanner": {
        "id": "bandit",
        "name": "Bandit"
      },
      "location": {
        "file": "app1/imports/imports-aliases.py",
        "start_line": 12
      },
      "identifiers": [
        {
          "type": "bandit_test_id",
          "name": "Bandit Test ID B303",
          "value": "B303"
        }
      ]
    },
    {
      "id": "b8ed2780459618c68cd881e499d3c6e95c6ee6aeb4c9f5f2c2f00308687af1c7",
      "category": "sast",
      "message": "Use of insecure MD2, MD4, MD5, or SHA1 hash function.",
      "cve": "app1/imports/imports-aliases.py:cb203b465dffb0cb3a8e8bd8910b84b93b0a5995a938e4b903dbb0cd6ffa1254:B303",
      "severity": "Medium",
      "confidence": "High",
      "scanner": {
        "id": "bandit",
        "name": "Bandit"
      },
      "location": {
        "file": "app1/imports/imports-aliases.py",
        "start_line": 11
      },
      "identifiers": [
        {
          "type": "bandit_test_id",
          "name": "Bandit Test ID B303",
          "value": "B303"
        }
      ]
    },
    {
      "id": "60b671adfe8c92eab347518411a5f1913cf56b0f3cfd8024dd517c9c56fd2b0d",
      "category": "sast",
      "message": "Probable insecure usage of temp file/directory.",
      "cve": "app2/hardcoded/hardcoded-tmp.py:4ad6d4c40a8c263fc265f3384724014e0a4f8dd6200af83e51ff120420038031:B108",
      "severity": "Medium",
      "confidence": "Medium",
      "scanner": {
        "id": "bandit",
        "name": "Bandit"
      },
      "location": {
        "file": "app2/hardcoded/hardcoded-tmp.py",
        "start_line": 10
      },
      "identifiers": [
        {
          "type": "bandit_test_id",
          "name": "Bandit Test ID B108",
          "value": "B108",
          "url": "https://bandit.readthedocs.io/en/latest/plugins/b108_hardcoded_tmp_directory.html"
        }
      ]
    },
    {
      "id": "fa40241da25853974431ff0fcb04599f8cc5f48af92509f75c2c8e91d93c6b20",
      "category": "sast",
      "message": "Probable insecure usage of temp file/directory.",
      "cve": "app2/hardcoded/hardcoded-tmp.py:52865813c884a507be1f152d654245af34aba8a391626d01f1ab6d3f52ec8779:B108",
      "severity": "Medium",
      "confidence": "Medium",
      "scanner": {
        "id": "bandit",
        "name": "Bandit"
      },
      "location": {
        "file": "app2/hardcoded/hardcoded-tmp.py",
        "start_line": 1
      },
      "identifiers": [
        {
          "type": "bandit_test_id",
          "name": "Bandit Test ID B108",
          "value": "B108",
          "url": "https://bandit.readthedocs.io/en/latest/plugins/b108_hardcoded_tmp_directory.html"
        }
      ]
    },
    {
      "id": "c29a79989c9a30a44b066c478b7dfbd1b2851efa5b04b8de32ef6afe01cb836f",
      "category": "sast",
      "message": "Probable insecure usage of temp file/directory.",
      "cve": "app2/hardcoded/hardcoded-tmp.py:63dd4d626855555b816985d82c4614a790462a0a3ada89dc58eb97f9c50f3077:B108",
      "severity": "Medium",
      "confidence": "Medium",
      "scanner": {
        "id": "bandit",
        "name": "Bandit"
      },
      "location": {
        "file": "app2/hardcoded/hardcoded-tmp.py",
        "start_line": 14
      },
      "identifiers": [
        {
          "type": "bandit_test_id",
          "name": "Bandit Test ID B108",
          "value": "B108",
          "url": "https://bandit.readthedocs.io/en/latest/plugins/b108_hardcoded_tmp_directory.html"
        }
      ]
    },
    {
      "id": "26f06d42ba02b0ce94758e1617f600647a0014e5a7e307144c503defe018d0ef",
      "category": "sast",
      "message": "Use of insecure MD2, MD4, MD5, or SHA1 hash function.",
      "cve": "app2/imports/imports-aliases.py:017017b77deb0b8369b6065947833eeea752a92ec8a700db590fece3e934cf0d:B303",
      "severity": "Medium",
      "confidence": "High",
      "scanner": {
        "id": "bandit",
        "name": "Bandit"
      },
      "location": {
        "file": "app2/imports/imports-aliases.py",
        "start_line": 13
      },
      "identifiers": [
        {
          "type": "bandit_test_id",
          "name": "Bandit Test ID B303",
          "value": "B303"
        }
      ]
    },
    {
      "id": "fe4e933aa4887e93d409555ad16c34ca6d87a2ba9b06c0b9681147fb0961ea17",
      "category": "sast",
      "message": "Use of insecure MD2, MD4, MD5, or SHA1 hash function.",
      "cve": "app2/imports/imports-aliases.py:45fc8c53aea7b84f06bc4e590cc667678d6073c4c8a1d471177ca2146fb22db2:B303",
      "severity": "Medium",
      "confidence": "High",
      "scanner": {
        "id": "bandit",
        "name": "Bandit"
      },
      "location": {
        "file": "app2/imports/imports-aliases.py",
        "start_line": 14
      },
      "identifiers": [
        {
          "type": "bandit_test_id",
          "name": "Bandit Test ID B303",
          "value": "B303"
        }
      ]
    },
    {
      "id": "68d1753b4405f5c27eab8286175d8336264f486230a6513d452b368b74849b45",
      "category": "sast",
      "message": "Pickle and modules that wrap it can be unsafe when used to deserialize untrusted data, possible security issue.",
      "cve": "app2/imports/imports-aliases.py:5f200d47291e7bbd8352db23019b85453ca048dd98ea0c291260fa7d009963a4:B301",
      "severity": "Medium",
      "confidence": "High",
      "scanner": {
        "id": "bandit",
        "name": "Bandit"
      },
      "location": {
        "file": "app2/imports/imports-aliases.py",
        "start_line": 15
      },
      "identifiers": [
        {
          "type": "bandit_test_id",
          "name": "Bandit Test ID B301",
          "value": "B301"
        }
      ]
    },
    {
      "id": "adfea4a659a3f5ca5a4ac5b504bdd9296cdd5338fad4582f4b1e10fdae10dffd",
      "category": "sast",
      "message": "Use of insecure MD2, MD4, MD5, or SHA1 hash function.",
      "cve": "app2/imports/imports-aliases.py:a7173c43ae66bd07466632d819d450e0071e02dbf782763640d1092981f9631b:B303",
      "severity": "Medium",
      "confidence": "High",
      "scanner": {
        "id": "bandit",
        "name": "Bandit"
      },
      "location": {
        "file": "app2/imports/imports-aliases.py",
        "start_line": 12
      },
      "identifiers": [
        {
          "type": "bandit_test_id",
          "name": "Bandit Test ID B303",
          "value": "B303"
        }
      ]
    },
    {
      "id": "b368dd43957894cd561d1375dcf102db9039eb930b059947be906c0307bea094",
      "category": "sast",
      "message": "Use of insecure MD2, MD4, MD5, or SHA1 hash function.",
      "cve": "app2/imports/imports-aliases.py:cb203b465dffb0cb3a8e8bd8910b84b93b0a5995a938e4b903dbb0cd6ffa1254:B303",
      "severity": "Medium",
      "confidence": "High",
      "scanner": {
        "id": "bandit",
        "name": "Bandit"
      },
      "location": {
        "file": "app2/imports/imports-aliases.py",
        "start_line": 11
      },
      "identifiers": [
        {
          "type": "bandit_test_id",
          "name": "Bandit Test ID B303",
          "value": "B303"
        }
      ]
    },
    {
      "id": "417862d9e06c74c1fd59a970f8766ace0991d13170b14acc70b3ed989cbd7c7e",
      "category": "sast",
      "message": "Possible hardcoded password: 'Admin'",
      "cve": "app1/hardcoded/hardcoded-passwords.py:0ffe6f9a322ff44b2b69f5eccda67edb85743cbbec0272b947645acdeb3146b8:B107",
      "severity": "Low",
      "confidence": "Medium",
      "scanner": {
        "id": "bandit",
        "name": "Bandit"
      },
      "location": {
        "file": "app1/hardcoded/hardcoded-passwords.py",
        "start_line": 1,
        "end_line": 3
      },
      "identifiers": [
        {
          "type": "bandit_test_id",
          "name": "Bandit Test ID B107",
          "value": "B107",
          "url": "https://bandit.readthedocs.io/en/latest/plugins/b107_hardcoded_password_default.html"
        }
      ]
    },
    {
      "id": "9523f9259a0631ca23cbf142b8b4b848b4262abf78765d30addeec89c9dc21ab",
      "category": "sast",
      "message": "Possible hardcoded password: 'blerg'",
      "cve": "app1/hardcoded/hardcoded-passwords.py:4311b06d08df8fa58229b341c531da8e1a31ec4520597bdff920cd5c098d86f9:B105",
      "severity": "Low",
      "confidence": "Medium",
      "scanner": {
        "id": "bandit",
        "name": "Bandit"
      },
      "location": {
        "file": "app1/hardcoded/hardcoded-passwords.py",
        "start_line": 24
      },
      "identifiers": [
        {
          "type": "bandit_test_id",
          "name": "Bandit Test ID B105",
          "value": "B105",
          "url": "https://bandit.readthedocs.io/en/latest/plugins/b105_hardcoded_password_string.html"
        }
      ]
    },
    {
      "id": "2a1e518e99d378bad86c0a33145517257888b487e7653818b2a0ec9ad31aa876",
      "category": "sast",
      "message": "Possible hardcoded password: 'blerg'",
      "cve": "app1/hardcoded/hardcoded-passwords.py:5f6749dc5b86c774abf8c07b295b8934d7e60861aa0d45de67d633a56342d7b5:B107",
      "severity": "Low",
      "confidence": "Medium",
      "scanner": {
        "id": "bandit",
        "name": "Bandit"
      },
      "location": {
        "file": "app1/hardcoded/hardcoded-passwords.py",
        "start_line": 16,
        "end_line": 18
      },
      "identifiers": [
        {
          "type": "bandit_test_id",
          "name": "Bandit Test ID B107",
          "value": "B107",
          "url": "https://bandit.readthedocs.io/en/latest/plugins/b107_hardcoded_password_default.html"
        }
      ]
    },
    {
      "id": "719944f70f5385e302bdc1f67f59320f325160e8c9e73130a17a279acc3dacb2",
      "category": "sast",
      "message": "Possible hardcoded password: 'blerg'",
      "cve": "app1/hardcoded/hardcoded-passwords.py:63c62a8b7e1e5224439bd26b28030585ac48741e28ca64561a6071080c560a5f:B105",
      "severity": "Low",
      "confidence": "Medium",
      "scanner": {
        "id": "bandit",
        "name": "Bandit"
      },
      "location": {
        "file": "app1/hardcoded/hardcoded-passwords.py",
        "start_line": 23
      },
      "identifiers": [
        {
          "type": "bandit_test_id",
          "name": "Bandit Test ID B105",
          "value": "B105",
          "url": "https://bandit.readthedocs.io/en/latest/plugins/b105_hardcoded_password_string.html"
        }
      ]
    },
    {
      "id": "7816a826ffe37559191a20457fe93f9a4ebda073bd4782e60bca6baeed3872d7",
      "category": "sast",
      "message": "Possible hardcoded password: 'root'",
      "cve": "app1/hardcoded/hardcoded-passwords.py:7431c73a0bc16d94ece2a2e75ef38f302574d42c37ac0c3c38ad0b3bf8a59f10:B105",
      "severity": "Low",
      "confidence": "Medium",
      "scanner": {
        "id": "bandit",
        "name": "Bandit"
      },
      "location": {
        "file": "app1/hardcoded/hardcoded-passwords.py",
        "start_line": 5
      },
      "identifiers": [
        {
          "type": "bandit_test_id",
          "name": "Bandit Test ID B105",
          "value": "B105",
          "url": "https://bandit.readthedocs.io/en/latest/plugins/b105_hardcoded_password_string.html"
        }
      ]
    },
    {
      "id": "b683931727cf2360b6a5a12f71bad94f1adc5125139ca2f143590ad2457007e8",
      "category": "sast",
      "message": "Possible hardcoded password: 'blerg'",
      "cve": "app1/hardcoded/hardcoded-passwords.py:97c30f1d76d2a88913e3ce9ae74087874d740f87de8af697a9c455f01119f633:B106",
      "severity": "Low",
      "confidence": "Medium",
      "scanner": {
        "id": "bandit",
        "name": "Bandit"
      },
      "location": {
        "file": "app1/hardcoded/hardcoded-passwords.py",
        "start_line": 22
      },
      "identifiers": [
        {
          "type": "bandit_test_id",
          "name": "Bandit Test ID B106",
          "value": "B106",
          "url": "https://bandit.readthedocs.io/en/latest/plugins/b106_hardcoded_password_funcarg.html"
        }
      ]
    },
    {
      "id": "f9172cc45183e4d8705cceb1af55384e93290c358f876f15c16e5fc8ea8c3a2e",
      "category": "sast",
      "message": "Possible hardcoded password: ''",
      "cve": "app1/hardcoded/hardcoded-passwords.py:d2d1857c27caedd49c57bfbcdc23afcc92bd66a22701fcdc632869aab4ca73ee:B105",
      "severity": "Low",
      "confidence": "Medium",
      "scanner": {
        "id": "bandit",
        "name": "Bandit"
      },
      "location": {
        "file": "app1/hardcoded/hardcoded-passwords.py",
        "start_line": 9
      },
      "identifiers": [
        {
          "type": "bandit_test_id",
          "name": "Bandit Test ID B105",
          "value": "B105",
          "url": "https://bandit.readthedocs.io/en/latest/plugins/b105_hardcoded_password_string.html"
        }
      ]
    },
    {
      "id": "904a610c043af61fa65cf3fd2482c87865cf2b003df27db6b057be1b2408660d",
      "category": "sast",
      "message": "Possible hardcoded password: 'ajklawejrkl42348swfgkg'",
      "cve": "app1/hardcoded/hardcoded-passwords.py:fb3866215a61393a5c9c32a3b60e2058171a23219c353f722cbd3567acab21d2:B105",
      "severity": "Low",
      "confidence": "Medium",
      "scanner": {
        "id": "bandit",
        "name": "Bandit"
      },
      "location": {
        "file": "app1/hardcoded/hardcoded-passwords.py",
        "start_line": 13
      },
      "identifiers": [
        {
          "type": "bandit_test_id",
          "name": "Bandit Test ID B105",
          "value": "B105",
          "url": "https://bandit.readthedocs.io/en/latest/plugins/b105_hardcoded_password_string.html"
        }
      ]
    },
    {
      "id": "4ecc0da4e341c72777b6d3b8dce647807c8d45ac8d779cc510f3b5077f17c06e",
      "category": "sast",
      "message": "Consider possible security implications associated with the subprocess module.",
      "cve": "app1/imports/imports-aliases.py:2c3e1fa1e54c3c6646e8bcfaee2518153c6799b77587ff8d9a7b0631f6d34785:B404",
      "severity": "Low",
      "confidence": "High",
      "scanner": {
        "id": "bandit",
        "name": "Bandit"
      },
      "location": {
        "file": "app1/imports/imports-aliases.py",
        "start_line": 1
      },
      "identifiers": [
        {
          "type": "bandit_test_id",
          "name": "Bandit Test ID B404",
          "value": "B404"
        }
      ]
    },
    {
      "id": "7dcd72c173b5e86337d72c3d0cf6e6bb9882a386c06450ace0c57812b7125953",
      "category": "sast",
      "message": "Consider possible security implications associated with pickle module.",
      "cve": "app1/imports/imports-aliases.py:51b71661dff994bde3529639a727a678c8f5c4c96f00d300913f6d5be1bbdf26:B403",
      "severity": "Low",
      "confidence": "High",
      "scanner": {
        "id": "bandit",
        "name": "Bandit"
      },
      "location": {
        "file": "app1/imports/imports-aliases.py",
        "start_line": 7,
        "end_line": 8
      },
      "identifiers": [
        {
          "type": "bandit_test_id",
          "name": "Bandit Test ID B403",
          "value": "B403"
        }
      ]
    },
    {
      "id": "75db449fba7d842a088a4cac342748b5dca93e24b831bbd9fcabc4077da2abc6",
      "category": "sast",
      "message": "Consider possible security implications associated with loads module.",
      "cve": "app1/imports/imports-aliases.py:6ff02aeb3149c01ab68484d794a94f58d5d3e3bb0d58557ef4153644ea68ea54:B403",
      "severity": "Low",
      "confidence": "High",
      "scanner": {
        "id": "bandit",
        "name": "Bandit"
      },
      "location": {
        "file": "app1/imports/imports-aliases.py",
        "start_line": 6
      },
      "identifiers": [
        {
          "type": "bandit_test_id",
          "name": "Bandit Test ID B403",
          "value": "B403"
        }
      ]
    },
    {
      "id": "de808a9d2b8a6935781d869ac89539ccaf28dfd052f409c99862ba869f502de7",
      "category": "sast",
      "message": "subprocess call with shell=True seems safe, but may be changed in the future, consider rewriting without shell",
      "cve": "app1/imports/imports-aliases.py:f99f9721e27537fbcb6699a4cf39c6740d6234d2c6f06cfc2d9ea977313c483d:B602",
      "severity": "Low",
      "confidence": "High",
      "scanner": {
        "id": "bandit",
        "name": "Bandit"
      },
      "location": {
        "file": "app1/imports/imports-aliases.py",
        "start_line": 9
      },
      "identifiers": [
        {
          "type": "bandit_test_id",
          "name": "Bandit Test ID B602",
          "value": "B602",
          "url": "https://bandit.readthedocs.io/en/latest/plugins/b602_subprocess_popen_with_shell_equals_true.html"
        }
      ]
    },
    {
      "id": "ad863a5ffc448f04bb8f60843e2a3a42576a77dabf06d59290341de328ad9e77",
      "category": "sast",
      "message": "Consider possible security implications associated with the subprocess module.",
      "cve": "app1/imports/imports-from.py:0a48de4a3d5348853a03666cb574697e3982998355e7a095a798bd02a5947276:B404",
      "severity": "Low",
      "confidence": "High",
      "scanner": {
        "id": "bandit",
        "name": "Bandit"
      },
      "location": {
        "file": "app1/imports/imports-from.py",
        "start_line": 1,
        "end_line": 2
      },
      "identifiers": [
        {
          "type": "bandit_test_id",
          "name": "Bandit Test ID B404",
          "value": "B404"
        }
      ]
    },
    {
      "id": "9ddcaada652baf72cd2be5c5926b0c586584e14fde80567f7112b823f87473ad",
      "category": "sast",
      "message": "Consider possible security implications associated with the subprocess module.",
      "cve": "app1/imports/imports-from.py:332a12ab1146698f614a905ce6a6a5401497a12281aef200e80522711c69dcf4:B404",
      "severity": "Low",
      "confidence": "High",
      "scanner": {
        "id": "bandit",
        "name": "Bandit"
      },
      "location": {
        "file": "app1/imports/imports-from.py",
        "start_line": 6
      },
      "identifiers": [
        {
          "type": "bandit_test_id",
          "name": "Bandit Test ID B404",
          "value": "B404"
        }
      ]
    },
    {
      "id": "598ae75247fd79b03db0dfd2766ec1986574b73775c10cd0cc42bbc713fda98d",
      "category": "sast",
      "message": "Consider possible security implications associated with the subprocess module.",
      "cve": "app1/imports/imports-from.py:eb8a0db9cd1a8c1ab39a77e6025021b1261cc2a0b026b2f4a11fca4e0636d8dd:B404",
      "severity": "Low",
      "confidence": "High",
      "scanner": {
        "id": "bandit",
        "name": "Bandit"
      },
      "location": {
        "file": "app1/imports/imports-from.py",
        "start_line": 7
      },
      "identifiers": [
        {
          "type": "bandit_test_id",
          "name": "Bandit Test ID B404",
          "value": "B404"
        }
      ]
    },
    {
      "id": "3eedc1b347d6daa33c0b53646f6b456ac79f6e7e6b63232a9897b9aacbba11e6",
      "category": "sast",
      "message": "Consider possible security implications associated with the subprocess module.",
      "cve": "app1/imports/imports-function.py:5858400c2f39047787702de44d03361ef8d954c9d14bd54ee1c2bef9e6a7df93:B404",
      "severity": "Low",
      "confidence": "High",
      "scanner": {
        "id": "bandit",
        "name": "Bandit"
      },
      "location": {
        "file": "app1/imports/imports-function.py",
        "start_line": 4
      },
      "identifiers": [
        {
          "type": "bandit_test_id",
          "name": "Bandit Test ID B404",
          "value": "B404"
        }
      ]
    },
    {
      "id": "7525ed0625c8fd2f40a3d0f270f2a068100ec31e8188d898d776b3c383dd8429",
      "category": "sast",
      "message": "Consider possible security implications associated with pickle module.",
      "cve": "app1/imports/imports-function.py:dbda3cf4190279d30e0aad7dd137eca11272b0b225e8af4e8bf39682da67d956:B403",
      "severity": "Low",
      "confidence": "High",
      "scanner": {
        "id": "bandit",
        "name": "Bandit"
      },
      "location": {
        "file": "app1/imports/imports-function.py",
        "start_line": 2
      },
      "identifiers": [
        {
          "type": "bandit_test_id",
          "name": "Bandit Test ID B403",
          "value": "B403"
        }
      ]
    },
    {
      "id": "9cb5b237cff0f0283410cdb4a4e4989bfb24bd18c14132c71599340913fd8ca7",
      "category": "sast",
      "message": "Consider possible security implications associated with pickle module.",
      "cve": "app1/imports/imports-with-importlib.py:c5c6b66dee67ea3d5a34d72ccb77b6752ca1095e18a6d488cdbdba0a48cc8800:B403",
      "severity": "Low",
      "confidence": "High",
      "scanner": {
        "id": "bandit",
        "name": "Bandit"
      },
      "location": {
        "file": "app1/imports/imports-with-importlib.py",
        "start_line": 3
      },
      "identifiers": [
        {
          "type": "bandit_test_id",
          "name": "Bandit Test ID B403",
          "value": "B403"
        }
      ]
    },
    {
      "id": "2855c78b0281e08db971729c6944acaf1d046ba8416065e97b4bac1ce4d0fc2a",
      "category": "sast",
      "message": "Consider possible security implications associated with the subprocess module.",
      "cve": "app1/imports/imports-with-importlib.py:c6b36c25d7e767a77b76d5971a276ef7831f6518bce6823c38a6877cf9f2c0e3:B404",
      "severity": "Low",
      "confidence": "High",
      "scanner": {
        "id": "bandit",
        "name": "Bandit"
      },
      "location": {
        "file": "app1/imports/imports-with-importlib.py",
        "start_line": 5
      },
      "identifiers": [
        {
          "type": "bandit_test_id",
          "name": "Bandit Test ID B404",
          "value": "B404"
        }
      ]
    },
    {
      "id": "20e2d5579c2d6fcbf207a86d0cce399b76caec15caa510af3448ad9a3a9a7c24",
      "category": "sast",
      "message": "Consider possible security implications associated with the subprocess module.",
      "cve": "app1/imports/imports.py:8de9bc98029d212db530785a5f6780cfa663548746ff228ab8fa96c5bb82f089:B404",
      "severity": "Low",
      "confidence": "High",
      "scanner": {
        "id": "bandit",
        "name": "Bandit"
      },
      "location": {
        "file": "app1/imports/imports.py",
        "start_line": 4
      },
      "identifiers": [
        {
          "type": "bandit_test_id",
          "name": "Bandit Test ID B404",
          "value": "B404"
        }
      ]
    },
    {
      "id": "66af61a00d019796728b486a0f10ff40a2b6a194bbb748e1d806535eb6423d2f",
      "category": "sast",
      "message": "Consider possible security implications associated with pickle module.",
      "cve": "app1/imports/imports.py:af58d07f6ad519ef5287fcae65bf1a6999448a1a3a8bc1ac2a11daa80d0b96bf:B403",
      "severity": "Low",
      "confidence": "High",
      "scanner": {
        "id": "bandit",
        "name": "Bandit"
      },
      "location": {
        "file": "app1/imports/imports.py",
        "start_line": 2
      },
      "identifiers": [
        {
          "type": "bandit_test_id",
          "name": "Bandit Test ID B403",
          "value": "B403"
        }
      ]
    },
    {
      "id": "bcb810e14854fccb2dd8abf15fcb9863685c52bd3d7d71bf8c240ec355b4f499",
      "category": "sast",
      "message": "Possible hardcoded password: 'Admin'",
      "cve": "app2/hardcoded/hardcoded-passwords.py:0ffe6f9a322ff44b2b69f5eccda67edb85743cbbec0272b947645acdeb3146b8:B107",
      "severity": "Low",
      "confidence": "Medium",
      "scanner": {
        "id": "bandit",
        "name": "Bandit"
      },
      "location": {
        "file": "app2/hardcoded/hardcoded-passwords.py",
        "start_line": 1,
        "end_line": 3
      },
      "identifiers": [
        {
          "type": "bandit_test_id",
          "name": "Bandit Test ID B107",
          "value": "B107",
          "url": "https://bandit.readthedocs.io/en/latest/plugins/b107_hardcoded_password_default.html"
        }
      ]
    },
    {
      "id": "d55cb7b67181bdadfd3da014813f8629274282314698b57f328c559d08784792",
      "category": "sast",
      "message": "Possible hardcoded password: 'blerg'",
      "cve": "app2/hardcoded/hardcoded-passwords.py:4311b06d08df8fa58229b341c531da8e1a31ec4520597bdff920cd5c098d86f9:B105",
      "severity": "Low",
      "confidence": "Medium",
      "scanner": {
        "id": "bandit",
        "name": "Bandit"
      },
      "location": {
        "file": "app2/hardcoded/hardcoded-passwords.py",
        "start_line": 24
      },
      "identifiers": [
        {
          "type": "bandit_test_id",
          "name": "Bandit Test ID B105",
          "value": "B105",
          "url": "https://bandit.readthedocs.io/en/latest/plugins/b105_hardcoded_password_string.html"
        }
      ]
    },
    {
      "id": "4ede6b19d917f4373e1a270adf084ddb2009c7e1c74861e3f45e303ad4c3fbf6",
      "category": "sast",
      "message": "Possible hardcoded password: 'blerg'",
      "cve": "app2/hardcoded/hardcoded-passwords.py:5f6749dc5b86c774abf8c07b295b8934d7e60861aa0d45de67d633a56342d7b5:B107",
      "severity": "Low",
      "confidence": "Medium",
      "scanner": {
        "id": "bandit",
        "name": "Bandit"
      },
      "location": {
        "file": "app2/hardcoded/hardcoded-passwords.py",
        "start_line": 16,
        "end_line": 18
      },
      "identifiers": [
        {
          "type": "bandit_test_id",
          "name": "Bandit Test ID B107",
          "value": "B107",
          "url": "https://bandit.readthedocs.io/en/latest/plugins/b107_hardcoded_password_default.html"
        }
      ]
    },
    {
      "id": "8cf1f4e116d6a26f5dba80986aab487975d94bdc5bfc3a9bddd71649fd74c6ed",
      "category": "sast",
      "message": "Possible hardcoded password: 'blerg'",
      "cve": "app2/hardcoded/hardcoded-passwords.py:63c62a8b7e1e5224439bd26b28030585ac48741e28ca64561a6071080c560a5f:B105",
      "severity": "Low",
      "confidence": "Medium",
      "scanner": {
        "id": "bandit",
        "name": "Bandit"
      },
      "location": {
        "file": "app2/hardcoded/hardcoded-passwords.py",
        "start_line": 23
      },
      "identifiers": [
        {
          "type": "bandit_test_id",
          "name": "Bandit Test ID B105",
          "value": "B105",
          "url": "https://bandit.readthedocs.io/en/latest/plugins/b105_hardcoded_password_string.html"
        }
      ]
    },
    {
      "id": "9037830e1cfb3b5169af08bdd6f15889d61c00c51e716877deb108d598e58024",
      "category": "sast",
      "message": "Possible hardcoded password: 'root'",
      "cve": "app2/hardcoded/hardcoded-passwords.py:7431c73a0bc16d94ece2a2e75ef38f302574d42c37ac0c3c38ad0b3bf8a59f10:B105",
      "severity": "Low",
      "confidence": "Medium",
      "scanner": {
        "id": "bandit",
        "name": "Bandit"
      },
      "location": {
        "file": "app2/hardcoded/hardcoded-passwords.py",
        "start_line": 5
      },
      "identifiers": [
        {
          "type": "bandit_test_id",
          "name": "Bandit Test ID B105",
          "value": "B105",
          "url": "https://bandit.readthedocs.io/en/latest/plugins/b105_hardcoded_password_string.html"
        }
      ]
    },
    {
      "id": "e007225cfd6a4120fbf390cda84d6cc421ceb8d52d362183251c258b837efd73",
      "category": "sast",
      "message": "Possible hardcoded password: 'blerg'",
      "cve": "app2/hardcoded/hardcoded-passwords.py:97c30f1d76d2a88913e3ce9ae74087874d740f87de8af697a9c455f01119f633:B106",
      "severity": "Low",
      "confidence": "Medium",
      "scanner": {
        "id": "bandit",
        "name": "Bandit"
      },
      "location": {
        "file": "app2/hardcoded/hardcoded-passwords.py",
        "start_line": 22
      },
      "identifiers": [
        {
          "type": "bandit_test_id",
          "name": "Bandit Test ID B106",
          "value": "B106",
          "url": "https://bandit.readthedocs.io/en/latest/plugins/b106_hardcoded_password_funcarg.html"
        }
      ]
    },
    {
      "id": "3a84c775ae38bbd70e86c7724f1d3d0baa05a5e05e20ff1822875871d8ef5fcf",
      "category": "sast",
      "message": "Possible hardcoded password: ''",
      "cve": "app2/hardcoded/hardcoded-passwords.py:d2d1857c27caedd49c57bfbcdc23afcc92bd66a22701fcdc632869aab4ca73ee:B105",
      "severity": "Low",
      "confidence": "Medium",
      "scanner": {
        "id": "bandit",
        "name": "Bandit"
      },
      "location": {
        "file": "app2/hardcoded/hardcoded-passwords.py",
        "start_line": 9
      },
      "identifiers": [
        {
          "type": "bandit_test_id",
          "name": "Bandit Test ID B105",
          "value": "B105",
          "url": "https://bandit.readthedocs.io/en/latest/plugins/b105_hardcoded_password_string.html"
        }
      ]
    },
    {
      "id": "1a948ed7ac52840ec3aec5ed3b003b978e1c0efb3859eba392dd79b2fbd7fbed",
      "category": "sast",
      "message": "Possible hardcoded password: 'ajklawejrkl42348swfgkg'",
      "cve": "app2/hardcoded/hardcoded-passwords.py:fb3866215a61393a5c9c32a3b60e2058171a23219c353f722cbd3567acab21d2:B105",
      "severity": "Low",
      "confidence": "Medium",
      "scanner": {
        "id": "bandit",
        "name": "Bandit"
      },
      "location": {
        "file": "app2/hardcoded/hardcoded-passwords.py",
        "start_line": 13
      },
      "identifiers": [
        {
          "type": "bandit_test_id",
          "name": "Bandit Test ID B105",
          "value": "B105",
          "url": "https://bandit.readthedocs.io/en/latest/plugins/b105_hardcoded_password_string.html"
        }
      ]
    },
    {
      "id": "6637d8220ec62ed5ac9a2ebe501f9f26792b01e9e0dfaf1d3e1fb0f2ac43a825",
      "category": "sast",
      "message": "Consider possible security implications associated with the subprocess module.",
      "cve": "app2/imports/imports-aliases.py:2c3e1fa1e54c3c6646e8bcfaee2518153c6799b77587ff8d9a7b0631f6d34785:B404",
      "severity": "Low",
      "confidence": "High",
      "scanner": {
        "id": "bandit",
        "name": "Bandit"
      },
      "location": {
        "file": "app2/imports/imports-aliases.py",
        "start_line": 1
      },
      "identifiers": [
        {
          "type": "bandit_test_id",
          "name": "Bandit Test ID B404",
          "value": "B404"
        }
      ]
    },
    {
      "id": "c6a0ce21144ececa0b60ac0d3c30298ae5d13717a87e4ba764a6a9067e35bb84",
      "category": "sast",
      "message": "Consider possible security implications associated with pickle module.",
      "cve": "app2/imports/imports-aliases.py:51b71661dff994bde3529639a727a678c8f5c4c96f00d300913f6d5be1bbdf26:B403",
      "severity": "Low",
      "confidence": "High",
      "scanner": {
        "id": "bandit",
        "name": "Bandit"
      },
      "location": {
        "file": "app2/imports/imports-aliases.py",
        "start_line": 7,
        "end_line": 8
      },
      "identifiers": [
        {
          "type": "bandit_test_id",
          "name": "Bandit Test ID B403",
          "value": "B403"
        }
      ]
    },
    {
      "id": "8bf78c359765ba71cfff3267ffbb337b7cee6ea676dfaaaa8d0021d5c4d587a3",
      "category": "sast",
      "message": "Consider possible security implications associated with loads module.",
      "cve": "app2/imports/imports-aliases.py:6ff02aeb3149c01ab68484d794a94f58d5d3e3bb0d58557ef4153644ea68ea54:B403",
      "severity": "Low",
      "confidence": "High",
      "scanner": {
        "id": "bandit",
        "name": "Bandit"
      },
      "location": {
        "file": "app2/imports/imports-aliases.py",
        "start_line": 6
      },
      "identifiers": [
        {
          "type": "bandit_test_id",
          "name": "Bandit Test ID B403",
          "value": "B403"
        }
      ]
    },
    {
      "id": "895a88eaf3ff497718b4d6fc8f784ecd9ca981e35988bb75c720037caf6ad880",
      "category": "sast",
      "message": "subprocess call with shell=True seems safe, but may be changed in the future, consider rewriting without shell",
      "cve": "app2/imports/imports-aliases.py:f99f9721e27537fbcb6699a4cf39c6740d6234d2c6f06cfc2d9ea977313c483d:B602",
      "severity": "Low",
      "confidence": "High",
      "scanner": {
        "id": "bandit",
        "name": "Bandit"
      },
      "location": {
        "file": "app2/imports/imports-aliases.py",
        "start_line": 9
      },
      "identifiers": [
        {
          "type": "bandit_test_id",
          "name": "Bandit Test ID B602",
          "value": "B602",
          "url": "https://bandit.readthedocs.io/en/latest/plugins/b602_subprocess_popen_with_shell_equals_true.html"
        }
      ]
    },
    {
      "id": "93764d25284a9e78185d1d9423bad4dddf7e88ea3821f2aa8f731efc0fbf58c6",
      "category": "sast",
      "message": "Consider possible security implications associated with the subprocess module.",
      "cve": "app2/imports/imports-from.py:0a48de4a3d5348853a03666cb574697e3982998355e7a095a798bd02a5947276:B404",
      "severity": "Low",
      "confidence": "High",
      "scanner": {
        "id": "bandit",
        "name": "Bandit"
      },
      "location": {
        "file": "app2/imports/imports-from.py",
        "start_line": 1,
        "end_line": 2
      },
      "identifiers": [
        {
          "type": "bandit_test_id",
          "name": "Bandit Test ID B404",
          "value": "B404"
        }
      ]
    },
    {
      "id": "b0ebe2a9957c4e1243f9352f814e6b83122bb474ff2358d132f95a45bbecc56f",
      "category": "sast",
      "message": "Consider possible security implications associated with the subprocess module.",
      "cve": "app2/imports/imports-from.py:332a12ab1146698f614a905ce6a6a5401497a12281aef200e80522711c69dcf4:B404",
      "severity": "Low",
      "confidence": "High",
      "scanner": {
        "id": "bandit",
        "name": "Bandit"
      },
      "location": {
        "file": "app2/imports/imports-from.py",
        "start_line": 6
      },
      "identifiers": [
        {
          "type": "bandit_test_id",
          "name": "Bandit Test ID B404",
          "value": "B404"
        }
      ]
    },
    {
      "id": "95d347ad6c30fe04f39d484f0e77a470e8c7ee2d03c0fe695111cfdfe70a632e",
      "category": "sast",
      "message": "Consider possible security implications associated with the subprocess module.",
      "cve": "app2/imports/imports-from.py:eb8a0db9cd1a8c1ab39a77e6025021b1261cc2a0b026b2f4a11fca4e0636d8dd:B404",
      "severity": "Low",
      "confidence": "High",
      "scanner": {
        "id": "bandit",
        "name": "Bandit"
      },
      "location": {
        "file": "app2/imports/imports-from.py",
        "start_line": 7
      },
      "identifiers": [
        {
          "type": "bandit_test_id",
          "name": "Bandit Test ID B404",
          "value": "B404"
        }
      ]
    },
    {
      "id": "898a1185078eceffcd287bfca64120aee6819f929dcf4f1737d8315a4c346f36",
      "category": "sast",
      "message": "Consider possible security implications associated with the subprocess module.",
      "cve": "app2/imports/imports-function.py:5858400c2f39047787702de44d03361ef8d954c9d14bd54ee1c2bef9e6a7df93:B404",
      "severity": "Low",
      "confidence": "High",
      "scanner": {
        "id": "bandit",
        "name": "Bandit"
      },
      "location": {
        "file": "app2/imports/imports-function.py",
        "start_line": 4
      },
      "identifiers": [
        {
          "type": "bandit_test_id",
          "name": "Bandit Test ID B404",
          "value": "B404"
        }
      ]
    },
    {
      "id": "d1b11b43ee3641ffd123a0374c3e6831f65fa1fb1bd4621c38ca73d3047efa36",
      "category": "sast",
      "message": "Consider possible security implications associated with pickle module.",
      "cve": "app2/imports/imports-function.py:dbda3cf4190279d30e0aad7dd137eca11272b0b225e8af4e8bf39682da67d956:B403",
      "severity": "Low",
      "confidence": "High",
      "scanner": {
        "id": "bandit",
        "name": "Bandit"
      },
      "location": {
        "file": "app2/imports/imports-function.py",
        "start_line": 2
      },
      "identifiers": [
        {
          "type": "bandit_test_id",
          "name": "Bandit Test ID B403",
          "value": "B403"
        }
      ]
    },
    {
      "id": "ca5a31dd78375bde92e0c36f4c92637a6af2bf32787f16608251b0b9f2f23945",
      "category": "sast",
      "message": "Consider possible security implications associated with pickle module.",
      "cve": "app2/imports/imports-with-importlib.py:c5c6b66dee67ea3d5a34d72ccb77b6752ca1095e18a6d488cdbdba0a48cc8800:B403",
      "severity": "Low",
      "confidence": "High",
      "scanner": {
        "id": "bandit",
        "name": "Bandit"
      },
      "location": {
        "file": "app2/imports/imports-with-importlib.py",
        "start_line": 3
      },
      "identifiers": [
        {
          "type": "bandit_test_id",
          "name": "Bandit Test ID B403",
          "value": "B403"
        }
      ]
    },
    {
      "id": "837e13b50b87bfe73d0b2a12ca7468d4116d357e9173f4fa8a8dd4ee5c38cc52",
      "category": "sast",
      "message": "Consider possible security implications associated with the subprocess module.",
      "cve": "app2/imports/imports-with-importlib.py:c6b36c25d7e767a77b76d5971a276ef7831f6518bce6823c38a6877cf9f2c0e3:B404",
      "severity": "Low",
      "confidence": "High",
      "scanner": {
        "id": "bandit",
        "name": "Bandit"
      },
      "location": {
        "file": "app2/imports/imports-with-importlib.py",
        "start_line": 5
      },
      "identifiers": [
        {
          "type": "bandit_test_id",
          "name": "Bandit Test ID B404",
          "value": "B404"
        }
      ]
    },
    {
      "id": "ff5adb8a3f87abd94fbb1bbb2fe521c1c973e5ec7fe9dc870068537f93167e36",
      "category": "sast",
      "message": "Consider possible security implications associated with the subprocess module.",
      "cve": "app2/imports/imports.py:8de9bc98029d212db530785a5f6780cfa663548746ff228ab8fa96c5bb82f089:B404",
      "severity": "Low",
      "confidence": "High",
      "scanner": {
        "id": "bandit",
        "name": "Bandit"
      },
      "location": {
        "file": "app2/imports/imports.py",
        "start_line": 4
      },
      "identifiers": [
        {
          "type": "bandit_test_id",
          "name": "Bandit Test ID B404",
          "value": "B404"
        }
      ]
    },
    {
      "id": "e541c096843d960457fce5c3a4ab245b1fe84633d5d1dbb31800f8539839ec2b",
      "category": "sast",
      "message": "Consider possible security implications associated with pickle module.",
      "cve": "app2/imports/imports.py:af58d07f6ad519ef5287fcae65bf1a6999448a1a3a8bc1ac2a11daa80d0b96bf:B403",
      "severity": "Low",
      "confidence": "High",
      "scanner": {
        "id": "bandit",
        "name": "Bandit"
      },
      "location": {
        "file": "app2/imports/imports.py",
        "start_line": 2
      },
      "identifiers": [
        {
          "type": "bandit_test_id",
          "name": "Bandit Test ID B403",
          "value": "B403"
        }
      ]
    },
    {
      "id": "8a3289088f5617f0a0f7b59277dd9ecef31c6b3a400bf9d9f188dcc26f199d66",
      "category": "sast",
      "message": "Use of assert detected. The enclosed code will be removed when compiling to optimised byte code.",
      "cve": "tests/test_simple.py:35aea3197077c426f919f32b73fc506bf109ff2e25a063270e53f4cd60b0f5cf:B101",
      "severity": "Low",
      "confidence": "High",
      "scanner": {
        "id": "bandit",
        "name": "Bandit"
      },
      "location": {
        "file": "tests/test_simple.py",
        "start_line": 7
      },
      "identifiers": [
        {
          "type": "bandit_test_id",
          "name": "Bandit Test ID B101",
          "value": "B101",
          "url": "https://bandit.readthedocs.io/en/latest/plugins/b101_assert_used.html"
        }
      ]
    }
  ],
  "scan": {
    "scanner": {
      "id": "bandit",
      "name": "Bandit",
      "url": "https://github.com/PyCQA/bandit",
      "vendor": {
        "name": "GitLab"
      },
      "version": "1.7.1"
    },
    "type": "sast",
    "start_time": "2022-01-07T19:27:11",
    "end_time": "2022-01-07T19:27:12",
    "status": "success"
  }
}
