{
  "manifest_format": 2,
  "software": {
    "zlib": {
      "locked_version": "cacf7f1d4e3d44d871b605da3b647f07d718623f",
      "locked_source": {
        "git": "git@dev.gitlab.org:omnibus-mirror/zlib.git"
      },
      "source_type": "git",
      "described_version": "v1.2.11",
      "display_version": "v1.2.11",
      "vendor": null,
      "license": "Zlib"
    },
    "cacerts": {
      "locked_version": "2020.01.01",
      "locked_source": {
        "md5": "c726ae88fd600aa26df1d30f42b51fec",
        "url": "https://curl.haxx.se/ca/cacert-2020-01-01.pem"
      },
      "source_type": "url",
      "described_version": "2020.01.01",
      "display_version": "20200101",
      "vendor": null,
      "license": "MPL-2.0"
    },
    "openssl": {
      "locked_version": "e2e09d9fba1187f8d6aafaa34d4172f56f1ffb72",
      "locked_source": {
        "git": "git@dev.gitlab.org:omnibus-mirror/openssl.git"
      },
      "source_type": "git",
      "described_version": "OpenSSL_1_1_1g",
      "display_version": "1.1.1g",
      "vendor": "openssl",
      "license": "OpenSSL"
    },
    "config_guess": {
      "locked_version": "c9092d05347c925a26f6887980e185206e13f9d6",
      "locked_source": {
        "git": "git@dev.gitlab.org:omnibus-mirror/config_guess.git"
      },
      "source_type": "git",
      "described_version": "c9092d05347c925a26f6887980e185206e13f9d6",
      "display_version": "c9092d05347c925a26f6887980e185206e13f9d6",
      "vendor": null,
      "license": "GPL-3.0 (with exception)"
    },
    "libtool": {
      "locked_version": "2.4.6",
      "locked_source": {
        "sha256": "e3bd4d5d3d025a36c21dd6af7ea818a2afcd4dfc1ea5a17b39d7854bcd0c06e3",
        "url": "https://ftp.gnu.org/gnu/libtool/libtool-2.4.6.tar.gz"
      },
      "source_type": "url",
      "described_version": "2.4.6",
      "display_version": "2.4.6",
      "vendor": null,
      "license": "GPL-2.0"
    },
    "curl": {
      "locked_version": "4d6bd91ab33328c6d27eddc32e064defc02dc4fd",
      "locked_source": {
        "git": "git@dev.gitlab.org:omnibus-mirror/curl.git"
      },
      "source_type": "git",
      "described_version": "curl-7_59_0",
      "display_version": "7.59.0",
      "vendor": "haxx",
      "license": "MIT"
    },
    "ncurses": {
      "locked_version": "5.9",
      "locked_source": {
        "md5": "8cb9c412e5f2d96bc6f459aa8c6282a1",
        "url": "http://ftp.gnu.org/gnu/ncurses/ncurses-5.9.tar.gz"
      },
      "source_type": "url",
      "described_version": "5.9",
      "display_version": "5.9",
      "vendor": null,
      "license": "MIT"
    },
    "libedit": {
      "locked_version": "20120601-3.0",
      "locked_source": {
        "md5": "e50f6a7afb4de00c81650f7b1a0f5aea",
        "url": "http://www.thrysoee.dk/editline/libedit-20120601-3.0.tar.gz"
      },
      "source_type": "url",
      "described_version": "20120601-3.0",
      "display_version": "20120601-3.0",
      "vendor": null,
      "license": "BSD-3-Clause"
    },
    "pcre2": {
      "locked_version": "10.34",
      "locked_source": {
        "md5": "e3e15cca49557a9c07a21dde2da05ea5",
        "url": "http://downloads.sourceforge.net/project/pcre/pcre2/10.34/pcre2-10.34.tar.gz"
      },
      "source_type": "url",
      "described_version": "10.34",
      "display_version": "10.34",
      "vendor": null,
      "license": "BSD-2-Clause"
    },
    "libiconv": {
      "locked_version": "1.15",
      "locked_source": {
        "url": "https://ftp.gnu.org/pub/gnu/libiconv/libiconv-1.15.tar.gz",
        "sha256": "ccf536620a45458d26ba83887a983b96827001e92a13847b45e4925cc8913178"
      },
      "source_type": "url",
      "described_version": "1.15",
      "display_version": "1.15",
      "vendor": null,
      "license": "LGPL-2.1"
    },
    "redis": {
      "locked_version": "ce878b6ed5df1a7b3e87a8af2d1262de4c5bb828",
      "locked_source": {
        "git": "git@dev.gitlab.org:omnibus-mirror/redis.git"
      },
      "source_type": "git",
      "described_version": "5.0.9",
      "display_version": "5.0.9",
      "vendor": null,
      "license": "BSD-3-Clause"
    },
    "pcre": {
      "locked_version": "8.44",
      "locked_source": {
        "sha256": "aecafd4af3bd0f3935721af77b889d9024b2e01d96b58471bd91a3063fb47728",
        "url": "http://downloads.sourceforge.net/project/pcre/pcre/8.44/pcre-8.44.tar.gz"
      },
      "source_type": "url",
      "described_version": "8.44",
      "display_version": "8.44",
      "vendor": null,
      "license": "BSD-2-Clause"
    },
    "nginx-module-vts": {
      "locked_version": "d6aead19ab52834ad748f14dc536b9128ee22372",
      "locked_source": {
        "git": "git@dev.gitlab.org:omnibus-mirror/nginx-module-vts.git"
      },
      "source_type": "git",
      "described_version": "v0.1.18",
      "display_version": "v0.1.18",
      "vendor": null,
      "license": "BSD-2-Clause"
    },
    "libffi": {
      "locked_version": "3.2.1",
      "locked_source": {
        "md5": "83b89587607e3eb65c70d361f13bab43",
        "url": "ftp://sourceware.org/pub/libffi/libffi-3.2.1.tar.gz"
      },
      "source_type": "url",
      "described_version": "3.2.1",
      "display_version": "3.2.1",
      "vendor": null,
      "license": "MIT"
    },
    "libyaml": {
      "locked_version": "0.1.7",
      "locked_source": {
        "sha256": "8088e457264a98ba451a90b8661fcb4f9d6f478f7265d48322a196cec2480729",
        "url": "http://pyyaml.org/download/libyaml/yaml-0.1.7.tar.gz"
      },
      "source_type": "url",
      "described_version": "0.1.7",
      "display_version": "0.1.7",
      "vendor": null,
      "license": "MIT"
    },
    "ruby": {
      "locked_version": "2.6.6",
      "locked_source": {
        "sha256": "364b143def360bac1b74eb56ed60b1a0dca6439b00157ae11ff77d5cd2e92291",
        "url": "https://cache.ruby-lang.org/pub/ruby/2.6/ruby-2.6.6.tar.gz"
      },
      "source_type": "url",
      "described_version": "2.6.6",
      "display_version": "2.6.6",
      "vendor": null,
      "license": "BSD-2-Clause"
    },
    "rubygems": {
      "locked_version": "2.7.10",
      "locked_source": null,
      "source_type": "project_local",
      "described_version": "2.7.10",
      "display_version": "2.7.10",
      "vendor": null,
      "license": "MIT"
    },
    "rb-readline": {
      "locked_version": "9fba246073f78831b7c7129c76cc07d8476a8892",
      "locked_source": {
        "git": "git@dev.gitlab.org:omnibus-mirror/rb-readline.git"
      },
      "source_type": "git",
      "described_version": "master",
      "display_version": "master",
      "vendor": null,
      "license": "BSD-3-Clause"
    },
    "popt": {
      "locked_version": "1.16",
      "locked_source": {
        "url": "https://ftp.osuosl.org/pub/blfs/conglomeration/popt/popt-1.16.tar.gz",
        "md5": "3743beefa3dd6247a73f8f7a32c14c33"
      },
      "source_type": "url",
      "described_version": "1.16",
      "display_version": "1.16",
      "vendor": null,
      "license": "MIT"
    },
    "grafana": {
      "locked_version": "7.0.3",
      "locked_source": {
        "url": "https://dl.grafana.com/oss/release/grafana-7.0.3.linux-amd64.tar.gz",
        "sha256": "8fac62da4e4bfcebce3e66c4f62fd4ed89139b06b09d0155454199ba6d4869f2"
      },
      "source_type": "url",
      "described_version": "7.0.3",
      "display_version": "7.0.3",
      "vendor": null,
      "license": "APACHE-2.0"
    },
    "libossp-uuid": {
      "locked_version": "1.6.2",
      "locked_source": {
        "md5": "5db0d43a9022a6ebbbc25337ae28942f",
        "url": "https://www.mirrorservice.org/sites/ftp.ossp.org/pkg/lib/uuid/uuid-1.6.2.tar.gz"
      },
      "source_type": "url",
      "described_version": "1.6.2",
      "display_version": "1.6.2",
      "vendor": null,
      "license": "MIT"
    },
    "postgresql": {
      "locked_version": "11.9",
      "locked_source": {
        "sha256": "35618aa72e0372091f923c42389c6febd07513157b4fbb9408371706afbb6635",
        "url": "https://ftp.postgresql.org/pub/source/v11.9/postgresql-11.9.tar.bz2"
      },
      "source_type": "url",
      "described_version": "11.9",
      "display_version": "11.9",
      "vendor": null,
      "license": "PostgreSQL"
    },
    "bundler": {
      "locked_version": "1.17.3",
      "locked_source": null,
      "source_type": "project_local",
      "described_version": "1.17.3",
      "display_version": "1.17.3",
      "vendor": null,
      "license": "MIT"
    },
    "omnibus-ctl": {
      "locked_version": "e160156deaa0afc037748b10d1c9ef0a5be97dc1",
      "locked_source": {
        "git": "git@dev.gitlab.org:omnibus-mirror/omnibus-ctl.git"
      },
      "source_type": "git",
      "described_version": "v0.6.0",
      "display_version": "v0.6.0",
      "vendor": null,
      "license": "Apache-2.0"
    },
    "acme-client": {
      "locked_version": "2.0.7",
      "locked_source": null,
      "source_type": "project_local",
      "described_version": "2.0.7",
      "display_version": "2.0.7",
      "vendor": null,
      "license": "MIT"
    },
    "compat_resource": {
      "locked_version": "e36200f6b804915b68a4ce74c8b7a293c041d9fe",
      "locked_source": {
        "git": "git@dev.gitlab.org:omnibus-mirror/compat_resource.git"
      },
      "source_type": "git",
      "described_version": "v12.19.1",
      "display_version": "v12.19.1",
      "vendor": null,
      "license": "Apache-2.0"
    },
    "pkg-config-lite": {
      "locked_version": "0.28-1",
      "locked_source": {
        "md5": "61f05feb6bab0a6bbfab4b6e3b2f44b6",
        "url": "http://downloads.sourceforge.net/project/pkgconfiglite/0.28-1/pkg-config-lite-0.28-1.tar.gz"
      },
      "source_type": "url",
      "described_version": "0.28-1",
      "display_version": "0.28-1",
      "vendor": null,
      "license": "GPL-2.0"
    },
    "liblzma": {
      "locked_version": "5.2.4",
      "locked_source": {
        "url": "http://tukaani.org/xz/xz-5.2.4.tar.gz",
        "sha256": "b512f3b726d3b37b6dc4c8570e137b9311e7552e8ccbab4d39d47ce5f4177145"
      },
      "source_type": "url",
      "described_version": "5.2.4",
      "display_version": "5.2.4",
      "vendor": null,
      "license": "Public-Domain"
    },
    "libxml2": {
      "locked_version": "2.9.9",
      "locked_source": {
        "md5": "c04a5a0a042eaa157e8e8c9eabe76bd6",
        "url": "ftp://xmlsoft.org/libxml2/libxml2-2.9.9.tar.gz"
      },
      "source_type": "url",
      "described_version": "2.9.9",
      "display_version": "2.9.9",
      "vendor": null,
      "license": "MIT"
    },
    "libxslt": {
      "locked_version": "1.1.32",
      "locked_source": {
        "md5": "1fc72f98e98bf4443f1651165f3aa146",
        "url": "ftp://xmlsoft.org/libxml2/libxslt-1.1.32.tar.gz"
      },
      "source_type": "url",
      "described_version": "1.1.32",
      "display_version": "1.1.32",
      "vendor": null,
      "license": "MIT"
    },
    "rsync": {
      "locked_version": "3.1.3",
      "locked_source": {
        "md5": "1581a588fde9d89f6bc6201e8129afaf",
        "url": "https://rsync.samba.org/ftp/rsync/src/rsync-3.1.3.tar.gz"
      },
      "source_type": "url",
      "described_version": "3.1.3",
      "display_version": "3.1.3",
      "vendor": null,
      "license": "GPL v3"
    },
    "libicu": {
      "locked_version": "0c5873f89bf64f6bbc0a24b84f07d79b25785a42",
      "locked_source": {
        "git": "git@dev.gitlab.org:omnibus-mirror/libicu.git"
      },
      "source_type": "git",
      "described_version": "release-57-1",
      "display_version": "57.1",
      "vendor": null,
      "license": "MIT"
    },
    "postgresql_new": {
      "locked_version": "12.4",
      "locked_source": {
        "sha256": "bee93fbe2c32f59419cb162bcc0145c58da9a8644ee154a30b9a5ce47de606cc",
        "url": "https://ftp.postgresql.org/pub/source/v12.4/postgresql-12.4.tar.bz2"
      },
      "source_type": "url",
      "described_version": "12.4",
      "display_version": "12.4",
      "vendor": null,
      "license": "PostgreSQL"
    },
    "bzip2": {
      "locked_version": "1.0.6",
      "locked_source": {
        "md5": "00b516f4704d4a7cb50a1d97e6e8e15b",
        "url": "https://sourceware.org/pub/bzip2/bzip2-1.0.6.tar.gz"
      },
      "source_type": "url",
      "described_version": "1.0.6",
      "display_version": "1.0.6",
      "vendor": null,
      "license": "BSD-2-Clause"
    },
    "python3": {
      "locked_version": "3.7.9",
      "locked_source": {
        "url": "https://www.python.org/ftp/python/3.7.9/Python-3.7.9.tgz",
        "sha256": "39b018bc7d8a165e59aa827d9ae45c45901739b0bbb13721e4f973f3521c166a"
      },
      "source_type": "url",
      "described_version": "3.7.9",
      "display_version": "3.7.9",
      "vendor": null,
      "license": "Python-2.0"
    },
    "python-docutils": {
      "locked_version": "0.16",
      "locked_source": null,
      "source_type": "project_local",
      "described_version": "0.16",
      "display_version": "0.16",
      "vendor": null,
      "license": "Public-Domain"
    },
    "krb5": {
      "locked_version": "ba8bddac958972b1f119774ae508510726090a78",
      "locked_source": {
        "git": "git@dev.gitlab.org:omnibus-mirror/krb5.git"
      },
      "source_type": "git",
      "described_version": "krb5-1.17",
      "display_version": "1.17",
      "vendor": null,
      "license": "MIT"
    },
    "registry": {
      "locked_version": "a3dacbf6ae4b3d10598d4a303a34c806f7b83583",
      "locked_source": {
        "git": "git@dev.gitlab.org:gitlab/container-registry.git"
      },
      "source_type": "git",
      "described_version": "v2.10.1-gitlab",
      "display_version": "v2.10.1",
      "vendor": null,
      "license": "Apache-2.0"
    },
    "gitlab-pages": {
      "locked_version": "b382faeec6491bb544d33549570610a476f597b7",
      "locked_source": {
        "git": "git@dev.gitlab.org:gitlab/gitlab-pages.git"
      },
      "source_type": "git",
      "described_version": "master",
      "display_version": "master",
      "vendor": null,
      "license": "MIT"
    },
    "unzip": {
      "locked_version": "6.0",
      "locked_source": {
        "url": "https://managedway.dl.sourceforge.net/project/infozip/UnZip%206.x%20%28latest%29/UnZip%206.0/unzip60.tar.gz",
        "sha256": "036d96991646d0449ed0aa952e4fbe21b476ce994abc276e49d30e686708bd37"
      },
      "source_type": "url",
      "described_version": "6.0",
      "display_version": "6.0",
      "vendor": null,
      "license": "Info-ZIP"
    },
    "libre2": {
      "locked_version": "7436831ef39b89b3a2ea50be91cf09732a900239",
      "locked_source": {
        "git": "git@dev.gitlab.org:omnibus-mirror/libre2.git"
      },
      "source_type": "git",
      "described_version": "2016-02-01",
      "display_version": "20160201",
      "vendor": null,
      "license": "BSD"
    },
    "libgpg-error": {
      "locked_version": "1.39",
      "locked_source": {
        "url": "https://www.gnupg.org/ftp/gcrypt/libgpg-error/libgpg-error-1.39.tar.bz2",
        "sha256": "4a836edcae592094ef1c5a4834908f44986ab2b82e0824a0344b49df8cdb298f"
      },
      "source_type": "url",
      "described_version": "1.39",
      "display_version": "1.39",
      "vendor": null,
      "license": "LGPL-2.1"
    },
    "libassuan": {
      "locked_version": "2.5.3",
      "locked_source": {
        "url": "https://www.gnupg.org/ftp/gcrypt/libassuan/libassuan-2.5.3.tar.bz2",
        "sha256": "91bcb0403866b4e7c4bc1cc52ed4c364a9b5414b3994f718c70303f7f765e702"
      },
      "source_type": "url",
      "described_version": "2.5.3",
      "display_version": "2.5.3",
      "vendor": null,
      "license": "LGPL-2.1"
    },
    "npth": {
      "locked_version": "1.6",
      "locked_source": {
        "url": "https://www.gnupg.org/ftp/gcrypt/npth/npth-1.6.tar.bz2",
        "sha256": "1393abd9adcf0762d34798dc34fdcf4d0d22a8410721e76f1e3afcd1daa4e2d1"
      },
      "source_type": "url",
      "described_version": "1.6",
      "display_version": "1.6",
      "vendor": null,
      "license": "LGPL-2.1"
    },
    "libgcrypt": {
      "locked_version": "1.8.6",
      "locked_source": {
        "url": "https://www.gnupg.org/ftp/gcrypt/libgcrypt/libgcrypt-1.8.6.tar.bz2",
        "sha256": "0cba2700617b99fc33864a0c16b1fa7fdf9781d9ed3509f5d767178e5fd7b975"
      },
      "source_type": "url",
      "described_version": "1.8.6",
      "display_version": "1.8.6",
      "vendor": null,
      "license": "LGPL-2.1"
    },
    "libksba": {
      "locked_version": "1.4.0",
      "locked_source": {
        "url": "https://www.gnupg.org/ftp/gcrypt/libksba/libksba-1.4.0.tar.bz2",
        "sha256": "bfe6a8e91ff0f54d8a329514db406667000cb207238eded49b599761bfca41b6"
      },
      "source_type": "url",
      "described_version": "1.4.0",
      "display_version": "1.4.0",
      "vendor": null,
      "license": "LGPL-3"
    },
    "gnupg": {
      "locked_version": "2.2.22",
      "locked_source": {
        "url": "https://www.gnupg.org/ftp/gcrypt/gnupg/gnupg-2.2.22.tar.bz2",
        "sha256": "7c1370565e1910b9d8c4e0fb57b9de34aa062ec7bb91abad5803d791f38d855b"
      },
      "source_type": "url",
      "described_version": "2.2.22",
      "display_version": "2.2.22",
      "vendor": null,
      "license": "LGPL-2.1"
    },
    "gpgme": {
      "locked_version": "1.14.0",
      "locked_source": {
        "url": "https://www.gnupg.org/ftp/gcrypt/gpgme/gpgme-1.14.0.tar.bz2",
        "sha256": "cef1f710a6b0d28f5b44242713ad373702d1466dcbe512eb4e754d7f35cd4307"
      },
      "source_type": "url",
      "described_version": "1.14.0",
      "display_version": "1.14.0",
      "vendor": null,
      "license": "LGPL-2.1"
    },
    "libpng": {
      "locked_version": "a40189cf881e9f0db80511c382292a5604c3c3d1",
      "locked_source": {
        "git": "git@dev.gitlab.org:omnibus-mirror/libpng.git"
      },
      "source_type": "git",
      "described_version": "v1.6.37",
      "display_version": "v1.6.37",
      "vendor": null,
      "license": "Libpng"
    },
    "libjpeg-turbo": {
      "locked_version": "ae87a958613b69628b92088b313ded0d4f59a716",
      "locked_source": {
        "git": "git@dev.gitlab.org:omnibus-mirror/libjpeg-turbo.git"
      },
      "source_type": "git",
      "described_version": "2.0.5",
      "display_version": "2.0.5",
      "vendor": null,
      "license": "BSD-3-Clause"
    },
    "libtiff": {
      "locked_version": "e0d707dc1524d8c0e20f03396f234e0f1b07b3f4",
      "locked_source": {
        "git": "git@dev.gitlab.org:omnibus-mirror/libtiff.git"
      },
      "source_type": "git",
      "described_version": "v4.1.0",
      "display_version": "v4.1.0",
      "vendor": null,
      "license": "libtiff"
    },
    "graphicsmagick": {
      "locked_version": "1.3.34",
      "locked_source": {
        "url": "https://ftp.icm.edu.pl/pub/unix/graphics/GraphicsMagick/1.3/GraphicsMagick-1.3.34.tar.gz",
        "sha256": "4717f7a32d964c515d83706fd52d34e089c2ffa35f8fbf43c923ce19343cf2f4"
      },
      "source_type": "url",
      "described_version": "1.3.34",
      "display_version": "1.3.34",
      "vendor": null,
      "license": "MIT"
    },
    "exiftool": {
      "locked_version": "654e94a1eaf54d3084a2b3dadb5a366e271e9f6b",
      "locked_source": {
        "git": "git@dev.gitlab.org:omnibus-mirror/exiftool.git"
      },
      "source_type": "git",
      "described_version": "11.70",
      "display_version": "11.70",
      "vendor": null,
      "license": "GPL-1.0 or Artistic"
    },
    "git": {
      "locked_version": "2.28.0",
      "locked_source": {
        "url": "https://www.kernel.org/pub/software/scm/git/git-2.28.0.tar.gz",
        "sha256": "f914c60a874d466c1e18467c864a910dd4ea22281ba6d4d58077cb0c3f115170"
      },
      "source_type": "url",
      "described_version": "2.28.0",
      "display_version": "2.28.0",
      "vendor": null,
      "license": "GPL-2.0"
    },
    "jemalloc": {
      "locked_version": "ea6b3e973b477b8061e0076bb257dbd7f3faa756",
      "locked_source": {
        "git": "git@dev.gitlab.org:omnibus-mirror/jemalloc.git"
      },
      "source_type": "git",
      "described_version": "5.2.1",
      "display_version": "5.2.1",
      "vendor": null,
      "license": "jemalloc"
    },
    "nginx": {
      "locked_version": "1.18.0",
      "locked_source": {
        "sha256": "4c373e7ab5bf91d34a4f11a0c9496561061ba5eee6020db272a17a7228d35f99",
        "url": "http://nginx.org/download/nginx-1.18.0.tar.gz"
      },
      "source_type": "url",
      "described_version": "1.18.0",
      "display_version": "1.18.0",
      "vendor": null,
      "license": "BSD-2-Clause"
    },
    "mixlib-log": {
      "locked_version": "3.0.9",
      "locked_source": null,
      "source_type": "project_local",
      "described_version": "3.0.9",
      "display_version": "3.0.9",
      "vendor": null,
      "license": "Apache-2.0"
    },
    "chef-zero": {
      "locked_version": "15.0.3",
      "locked_source": null,
      "source_type": "project_local",
      "described_version": "15.0.3",
      "display_version": "15.0.3",
      "vendor": null,
      "license": "Apache-2.0"
    },
    "awesome_print": {
      "locked_version": "1.8.0",
      "locked_source": null,
      "source_type": "project_local",
      "described_version": "1.8.0",
      "display_version": "1.8.0",
      "vendor": null,
      "license": "MIT"
    },
    "ohai": {
      "locked_version": "15.12.0",
      "locked_source": null,
      "source_type": "project_local",
      "described_version": "15.12.0",
      "display_version": "15.12.0",
      "vendor": null,
      "license": "Apache-2.0"
    },
    "chef-gem": {
      "locked_version": "15.14.0",
      "locked_source": null,
      "source_type": "project_local",
      "described_version": "15.14.0",
      "display_version": "15.14.0",
      "vendor": null,
      "license": "Apache-2.0"
    },
    "chef-bin": {
      "locked_version": "15.14.0",
      "locked_source": null,
      "source_type": "project_local",
      "described_version": "15.14.0",
      "display_version": "15.14.0",
      "vendor": null,
      "license": "Apache-2.0"
    },
    "remote-syslog": {
      "locked_version": "1.6.15",
      "locked_source": null,
      "source_type": "project_local",
      "described_version": "1.6.15",
      "display_version": "1.6.15",
      "vendor": null,
      "license": "MIT"
    },
    "logrotate": {
      "locked_version": "b6d261a1b00e96f65c5d9bc4a2f496e2e243f3ac",
      "locked_source": {
        "git": "git@dev.gitlab.org:omnibus-mirror/logrotate.git"
      },
      "source_type": "git",
      "described_version": "3.16.0",
      "display_version": "3.16.0",
      "vendor": null,
      "license": "GPL-2.0"
    },
    "runit": {
      "locked_version": "2.1.2",
      "locked_source": {
        "md5": "6c985fbfe3a34608eb3c53dc719172c4",
        "url": "http://smarden.org/runit/runit-2.1.2.tar.gz"
      },
      "source_type": "url",
      "described_version": "2.1.2",
      "display_version": "2.1.2",
      "vendor": null,
      "license": "BSD-3-Clause"
    },
    "go-crond": {
      "locked_version": "09eeb850d41d50e87964b5df2d1bc2e2e8efb8a1",
      "locked_source": {
        "git": "git@dev.gitlab.org:omnibus-mirror/go-crond.git"
      },
      "source_type": "git",
      "described_version": "20.7.0",
      "display_version": "20.7.0",
      "vendor": null,
      "license": "BSD-2-Clause"
    },
    "docker-distribution-pruner": {
      "locked_version": "7cf07e0fcd8b478ec223db9ef4ab68a3c0619859",
      "locked_source": {
        "git": "git@dev.gitlab.org:gitlab/docker-distribution-pruner.git"
      },
      "source_type": "git",
      "described_version": "v0.1.0",
      "display_version": "v0.1.0",
      "vendor": null,
      "license": "MIT"
    },
    "mattermost": {
      "locked_version": "5.27.0",
      "locked_source": {
        "url": "https://releases.mattermost.com/5.27.0/mattermost-team-5.27.0-linux-amd64.tar.gz",
        "md5": "4d407a020be6a9ace0e98b523d08c497"
      },
      "source_type": "url",
      "described_version": "5.27.0",
      "display_version": "5.27.0",
      "vendor": null,
      "license": "MIT with Trademark Protection"
    },
    "prometheus": {
      "locked_version": "983ebb4a513302315a8117932ab832815f85e3d2",
      "locked_source": {
        "git": "git@dev.gitlab.org:omnibus-mirror/prometheus.git"
      },
      "source_type": "git",
      "described_version": "v2.20.1",
      "display_version": "v2.20.1",
      "vendor": null,
      "license": "APACHE-2.0"
    },
    "alertmanager": {
      "locked_version": "4c6c03ebfe21009c546e4d1e9b92c371d67c021d",
      "locked_source": {
        "git": "git@dev.gitlab.org:omnibus-mirror/alertmanager.git"
      },
      "source_type": "git",
      "described_version": "v0.21.0",
      "display_version": "v0.21.0",
      "vendor": null,
      "license": "APACHE-2.0"
    },
    "grafana-dashboards": {
      "locked_version": "244a320c12526ec20e942455c7ed69972664d588",
      "locked_source": {
        "git": "git@dev.gitlab.org:omnibus-mirror/grafana-dashboards.git"
      },
      "source_type": "git",
      "described_version": "v1.8.0",
      "display_version": "v1.8.0",
      "vendor": null,
      "license": "MIT"
    },
    "node-exporter": {
      "locked_version": "3715be6ae899f2a9b9dbfd9c39f3e09a7bd4559f",
      "locked_source": {
        "git": "git@dev.gitlab.org:omnibus-mirror/node_exporter.git"
      },
      "source_type": "git",
      "described_version": "v1.0.1",
      "display_version": "v1.0.1",
      "vendor": null,
      "license": "APACHE-2.0"
    },
    "redis-exporter": {
      "locked_version": "34c779deb5f9a1e023166b5cf3717d53cdc97053",
      "locked_source": {
        "git": "git@dev.gitlab.org:omnibus-mirror/redis_exporter.git"
      },
      "source_type": "git",
      "described_version": "v1.6.1",
      "display_version": "v1.6.1",
      "vendor": null,
      "license": "MIT"
    },
    "postgres-exporter": {
      "locked_version": "aeec47ead4ad3941cf1b6588b1ac5a44ca9e9c4b",
      "locked_source": {
        "git": "git@dev.gitlab.org:omnibus-mirror/postgres_exporter.git"
      },
      "source_type": "git",
      "described_version": "v0.8.0",
      "display_version": "v0.8.0",
      "vendor": null,
      "license": "Apache-2.0"
    },
    "gitlab-exporter": {
      "locked_version": "7.1.0",
      "locked_source": null,
      "source_type": "project_local",
      "described_version": "7.1.0",
      "display_version": "7.1.0",
      "vendor": null,
      "license": "MIT"
    },
    "gitlab-workhorse": {
      "locked_version": "ddd5359869b65445a8f154ae2071ed1c2e380377",
      "locked_source": {
        "git": "git@dev.gitlab.org:gitlab/gitlab-workhorse.git"
      },
      "source_type": "git",
      "described_version": "master",
      "display_version": "master",
      "vendor": null,
      "license": "MIT"
    },
    "gitlab-shell": {
      "locked_version": "dc7d87e870216a719643a6e927d6fd3e5b402d24",
      "locked_source": {
        "git": "git@dev.gitlab.org:gitlab/gitlab-shell.git"
      },
      "source_type": "git",
      "described_version": "master",
      "display_version": "master",
      "vendor": null,
      "license": "MIT"
    },
    "gitlab-ctl": {
      "locked_version": null,
      "locked_source": {
        "path": "/builds/gitlab/omnibus-gitlab/files/gitlab-ctl-commands"
      },
      "source_type": "path",
      "described_version": null,
      "display_version": null,
      "vendor": null,
      "license": "Apache-2.0"
    },
    "gitlab-psql": {
      "locked_version": "7e11364159031db0eb55867ad3d5713b",
      "locked_source": null,
      "source_type": "project_local",
      "described_version": "7e11364159031db0eb55867ad3d5713b",
      "display_version": "7e11364159031db0eb55867ad3d5713b",
      "vendor": null,
      "license": "Apache-2.0"
    },
    "gitlab-redis-cli": {
      "locked_version": "c44b184e13a2ff40d6f71b3eff6bf6ee",
      "locked_source": null,
      "source_type": "project_local",
      "described_version": "c44b184e13a2ff40d6f71b3eff6bf6ee",
      "display_version": "c44b184e13a2ff40d6f71b3eff6bf6ee",
      "vendor": null,
      "license": "Apache-2.0"
    },
    "gitlab-kas": {
      "locked_version": "a41e824dd02cdf371e29651f84da5b9143f551a3",
      "locked_source": {
        "git": "git@dev.gitlab.org:gitlab/gitlab-agent.git"
      },
      "source_type": "git",
      "described_version": "v0.0.6",
      "display_version": "v0.0.6",
      "vendor": null,
      "license": "MIT"
    },
    "gitlab-healthcheck": {
      "locked_version": "90e6447aeead4a29ac9fffc15945ce6b",
      "locked_source": null,
      "source_type": "project_local",
      "described_version": "90e6447aeead4a29ac9fffc15945ce6b",
      "display_version": "90e6447aeead4a29ac9fffc15945ce6b",
      "vendor": null,
      "license": "Apache-2.0"
    },
    "gitlab-cookbooks": {
      "locked_version": null,
      "locked_source": {
        "path": "/builds/gitlab/omnibus-gitlab/files/gitlab-cookbooks"
      },
      "source_type": "path",
      "described_version": null,
      "display_version": null,
      "vendor": null,
      "license": "Apache-2.0"
    },
    "chef-acme": {
      "locked_version": "c0f781dbce1718f73aa5f479b2aa55d6d501a95e",
      "locked_source": {
        "git": "git@dev.gitlab.org:omnibus-mirror/chef-acme.git"
      },
      "source_type": "git",
      "described_version": "v4.1.1",
      "display_version": "v4.1.1",
      "vendor": null,
      "license": "Apache-2.0"
    },
    "gitlab-selinux": {
      "locked_version": null,
      "locked_source": {
        "path": "/builds/gitlab/omnibus-gitlab/files/gitlab-selinux"
      },
      "source_type": "path",
      "described_version": null,
      "display_version": null,
      "vendor": null,
      "license": "Apache-2.0"
    },
    "gitlab-scripts": {
      "locked_version": null,
      "locked_source": {
        "path": "/builds/gitlab/omnibus-gitlab/files/gitlab-scripts"
      },
      "source_type": "path",
      "described_version": null,
      "display_version": null,
      "vendor": null,
      "license": "Apache-2.0"
    },
    "gitlab-config-template": {
      "locked_version": null,
      "locked_source": {
        "path": "/builds/gitlab/omnibus-gitlab/files/gitlab-config-template"
      },
      "source_type": "path",
      "described_version": null,
      "display_version": null,
      "vendor": null,
      "license": "Apache-2.0"
    },
    "package-scripts": {
      "locked_version": "13.5.1+ce.0",
      "locked_source": null,
      "source_type": "project_local",
      "described_version": "13.5.1+ce.0",
      "display_version": "13.5.1+ce.0",
      "vendor": null,
      "license": "Apache-2.0"
    },
    "gitlab-rails": {
      "locked_version": "c60d68bbaca234673f2f689e1f7444ce8edbcf86",
      "locked_source": {
        "git": "git@dev.gitlab.org:gitlab/gitlabhq.git"
      },
      "source_type": "git",
      "described_version": "master",
      "display_version": "master",
      "vendor": null,
      "license": "MIT"
    },
    "gitaly": {
      "locked_version": "8695956fd0709f9cd78afeebe6378ccb3fc2d9e2",
      "locked_source": {
        "git": "git@dev.gitlab.org:gitlab/gitaly"
      },
      "source_type": "git",
      "described_version": "master",
      "display_version": "master",
      "vendor": null,
      "license": "MIT"
    },
    "version-manifest": {
      "locked_version": "0.0.1",
      "locked_source": null,
      "source_type": "project_local",
      "described_version": "0.0.1",
      "display_version": "0.0.1",
      "vendor": null,
      "license": "project_license"
    }
  },
  "build_version": "13.5.1+rfbranch.174387.255da8f4",
  "build_git_revision": "255da8f4a0b5fed7f54e29c78ec86d84b90721d8",
  "license": "MIT"
}
