{
  "budget": {
    "timings": {
      "SpeedIndex": 2000,
      "firstContentfulPaint": 1000,
      "largestContentfulPaint": 2500
    },
    "cpu": {
      "totalBlockingTime": 300
    },
    "pageinfo": {
      "cumulativeLayoutShift": 0.1
    },
    "requests": {
      "httpErrors" : 0
    }
  }
}
