{
  "gitlab_workhorse": {
    "secret_token": "pGLVbZpgOWJE3s3Za21POHWWYP6Z43ZZkGLU1RO+kJo="
  },
  "gitlab_shell": {
    "secret_token": "A3gj90324G32s"
  },
  "gitlab_rails": {
    "secret_key_base": "18adef8c2ad67d893db2b8e8e1977ecf8102514d5934e6c3ef285388c0aa6665cadc2cf7c03ff0ab57c1694184e59b03a6e1564bc4758cb391948ade3c691a6c",
    "db_key_base": "3edf8499abd18258c9f3873b08b2196628841a5a453f98be1c67d734425d3660c32b1856a4f167c16419b243819f445e8c65283ae05cf722f3a313c1469a1d77",
    "otp_key_base": "8eb703b22a1107659adfa04e647e98bd34c8192660e0a5907627b1db6e259abd808d0aa242c1e876be93e62a4ff00767990e287fa5778e3aa36f8e9f1af10bdd",
    "openid_connect_signing_key": "-----BEGIN RSA PRIVATE KEY-----\nMIIJKAIBAAKCAgEA1mf1Lm1tjY9jvnKFWW6/BtrlYk2cgXK/R6BO0PyOLk/QcRfN\nZMu1GmOGkVdgoxQ2lNh1CAWK/RDG17McuThSkdHuUwmrN2iTvgo5+tu1WH/RSSKJ\nsvvviQmtb2DO2sE1EqL4nEBUPLxF8jxmNiDj0wUNOp3jFffQc+gFULUV3jL6NC8Q\n6M8izKCTeBPqR1mKtFukIKWe9z2xjqgQNBq+EY3EgloZI6X3vCWond168j4Knni/\nyEu54zBkCzU6+w1BP4svqlQPUKOD3f2fylsxVrXPl2puuekK8AmBjje2TIDB1zVB\nYMw6Oyej4sJ92q6yYs9ui+l9+1wDlCrwv41RAD1EGiIddrSR9B2SUGafh4LCzCO2\nlMkKWDv1bclkYyOU3S8aDJJqzg8DytCzUwy8wtwbk/FhkM8VJZxQNVlV7yDhjmZX\neF68beQ8Akl/mnwTI4Js/fbguNgaRl56mknd33xP9biPSx1jqZUdd9odnZ1PPLKx\nrFq9F4fjg2b9yaXJt0hUvfp66ce6SFkruiIItJ4HH+ujG2rt3eqOwfrGpu1gxGGF\nNE8CSg9dcQcMN9bgbKj24CZT8VYkp2bsGSafH1zIlC1REzcGs0Bg/Ri7t9yYFiZt\nSE3lqcgS1YUzwpZrMNTc5j4JCVOraEbUX8eRmd0sUnBkeZG61Z/cQDYVi1kCAwEA\nAQKCAgA3ARKAZ6hcUbXoDN8y81tkedGxJ3IIL5Ts3i56JOCg9u7lpJKX0j7S10eV\nj9IF5FCgXOuhNDLU+3HXsmajCdT8/dtjSC65l0WX0m3PcoAShS/+0DJ9TW7FPEtX\nMIHA0yI3dsHK7CHwNujG3UHnjwaDg19Cc3DnmNzMb3C1pM9IYtGXg5+V6lXmIyfR\n/WH0Df+sh3oSugqPKS+dBnapt1adkD4iptSeNZzZktuwLDq3XL1CrH2e9/ZnV2nD\nClPoRh1AHQgMbWZEbL6Ou9s7gaulsBzinnZrkWKx8+5duuM0uy9/c3UjTSF/PYso\nyHabHIg9GzQkBrHAQ3nTkDSVH77wlShP7/C3/ZEiqPR45UXZlLL6Lr01pba4sNrk\nXrBHVY/62y0tjK0Ugj57ESzvYzTefIbXIuozE4Qt9LTP1VK71TdkfzTRtdHtjYme\n4aExymYwBo/3UnU/z7MV5uQX48yMPSb6j2/m/2covDKVHGMdoPY9UL6pJgeWhl/B\nEXe4gqoMnzZ3Nv862LYJcbl20Is0DNX2tYBc1VnXhlvDOjYtCnGpkujn9naKgTPV\n80CrRyiP2sWjvw8gso3ZTXpydCvM80NZ5eqjwxZzx+5AljndxtVutCSDvq8Snetu\na1jAhz7dnC5eCO8XLJT7ABgPcqBqjzSIkYxzO7z/Q8IAhCJOpQKCAQEA/oDP1Kf0\nBL1kz8O0nM+yOarW2KYlJFIY2Zds6+jWhQrTRCOgyXhzEG5WJ8pXCo7VFO71Q5xU\n9q9A53NuwgkFsAe8LGzAxNhJHrxcQDjpnkNjhnQAoRYkjjPcHSx/uWHQHUv7TsdQ\nT9kzSaVse1Ep2ExUKsVMPHFqzn+5laTdIG3CCuyn51bMzwRNcG+2PnLmvyae5fZo\nv5974S8VbcpQqrhr5WQeNiAgVo5sl487KVmy8e6rzitqoq1YVjzjy38IT0SLXx5B\ngrO0X6dmf58Pta1n4Kl47f8rMzgQ8T65qnzngjIN3n0CNZc0wbGA/WIt0PCM/wV6\n+LC8o2QQPg0hhwKCAQEA16rGQZKQN/tp89FKaFY88Bo+cdrZTMwggwDoAcmZWdVT\nlJFmC/5pcHYpMC49hnJMtUNfgjAIAQh87PmTYgPSvTj9cdK04ZEjqwhb+L08jw+1\njtxpW/61xak95rVnBHEJHiIGKV3oFcmOzcFyHjCgOq6sEUfADIADqsDIsAkP7nU6\nssUJTt37sA17vhomughEPUenanTbod7toN8EmtnI3AGeA8Xtpoay8gI8f1g4/exz\nxoJ6phqNWDTZIeTaDLDUXE6tzxazeBXsxJYSmAoI9ynwGjL2vzB9YPKECXijRVGI\nohp3TQemCh1ngGZgIHmOX6gzhyESipn0rNjW/9ykHwKCAQBw26JOBSSarXn1AC4p\nk5jPJckcTaEO2DEY3KN6gcgPO1uwTbRRY05zLNqbzoiGsAwhuk2c68hplBHOEUw+\nU03oX6W8dYWORPM35ANsn1BJ1ExgJTTaOj1/qdOkREVnac6mDzmkF5KvtfueXvMa\nREWwGzj/tno2G31nkRA1IeTFKqbvvT4/wigUbS4B/CfuzXkxruirxXdx8kE2/HAe\nPadD7YA7OwiCrABrIcFZ/DQaBCLsUhBx3qLs/L29kEbbyLtgm17KkVovoY0NFejI\nEzseL4VvBPgRYiRAFE6/DDe9OKJZA+VOklTWevT0J8ixlEYI74M227FKcuVT912U\nhrIlAoIBAQDNLe28SMHoYMqmakFODm2fSHiMPVdrFvD/cYdI3BGHQ8tmlwXs9zg9\nBE2fRv7FwEx2Twi4hRW4Vej0U2UCZPzDhUqqVXo896Zle2h0tyS8PofOyKd8HFG3\nIZKAwaimsxunjVsrU+oPgFjaK+Z0DnMCIVgWgJqXydqzQwIraBO+G82ico6ud8aR\n8eH+NEcPyfmSC2+delvSHpMY79Qjtnq/xNIeaNn2CkSItdP0m2xtN93VyCEDklNS\nzcSd2GoSlNEUmM4HLWPFJabCSLyb5UAuVbnWUxIpRuqhp1gy4pECy9Uf0+oYYOR4\nzwy/PabKfpsTKqULNE29i0cagpnZhoKlAoIBAHlBNHGodFKeYm/cqBy1P410x8DI\n22JTrCp617v9+o+NJqJjHFcADLH+HxlERPKQYucK0pQj+3KUn74rjxwak/F0uix/\nRdy8B4rL018RERzpQDaRj8Pskq+80EtnDQ1uVqk1ca6QymM5HDCKj49KI0ZaXnJC\noRKijCCHb3XQN1FLcxxZHKvc3sSAVnlVxd5AECe/8a7N4w5dwdsGZyJi0doufpFS\n91krR0bATKAZxueco8DkS2vNkkYpeoH2KD+YwQks6EY/FKKt1jeMvgpeVWSgLVKG\nKp6ARq7OZC1y8Rlvojx+AzTlkkcFIDcBWk3VBhPtENceN298t3ccnlk7zWY=\n-----END RSA PRIVATE KEY-----\n",
    "ci_jwt_signing_key": "-----BEGIN RSA PRIVATE KEY-----\nMIIJKgIBAAKCAgEA3Zn0UmuZTvnjUnWfdw7RSEknSbbk0fozqOcZUn2A9uoXbsjC\nHJ+lYtSQz4+pGxrp2i4V7iDUODvybC2s1H4e03/RnHBRJc/XeJ3nkeMWvboJ/Zrw\nQj0HmPGyjvG0n83RwEyI0SDCt2CuqXXk87d5V6o5MGkBzG+pAcb4PKZGCSuLC44y\nMLhqC0yapX/qxi5IIR3CZSrbmwW3dNIQ+nfInV9r6fRIxwNfnb6AnfmLXR3m7VjF\nTqCmIJ0irVA1E0gCKWHX/t8U7KBBpwI5gIJZPOo++YxgG5fzoZQOdYdN5UurV5UV\nOgcT3b787gT11/+enhSopxAJ6kNuZJ/9WLmXTKfww9t3Vhtu6DF4ttSv5Dh8dw+W\nngX7xf7lTPYOBAs4eHUf9EQnAdEVFSo0J90KK/2p8iug47hso3Ain2VDq8tGPGKS\nwH8dbYkhTTv9aQ3ry+Gww8JIcUl6jbHQLHORDBdMOwnObwYK9Lh9YfIFrZsX35Pk\n8FGc4/tFUBolZ6eee6XvIXJLTtZe28DeJ+NrebPtbfSkab6oy/NIf1yqRdDT+E1v\nWuLkNRpv/GnaUVFa/0gJKkBdbWK5PNpSyUzpiTc8D0I3S7YCV2Rrk+LQZshehXox\nTyAWda3Rua4w2wuWuT+CDDGDtcAJsft8oH5iKQD6NsN7LLj4x3V+hp1NKFcCAwEA\nAQKCAgEArYvNgOLNbMFc2w5M9ZPAKOlJgHxglWVqIcPi2+x4HGdWNKe7BWmtv0mT\no0nx+M1KCVmAST6ilOu1vizDJqMjByYaBXccxg0QxWB8o48CF1HkUx2NPYLIOWpI\nGZSHjYNF2mDV4VnTxINOJl6zEH9G43XnVddW1kE4TbECZZUeUj4spb8V5Xv3aKP0\nlNoqBkzmpjDFNi+rTqvacf212EII9d5uCAoNGPa2YjZ4Sb/N+f3aBVU5KIu9rtsA\n9lRTTKdfMgNzgiI5I9uZru6aE9+BfahB63OZLOMCpS7rZ/Wv9nwdUvjpZ8l1MHtL\nYCi4VBHXqhupvTRdX36xrNJzOZIXPzbUB+ZWq5UVhp8ZXcq7paY0c8o9sO9K300c\nm22CN+PwiG5NSQTSw5TPgloRpbNXX5PeGnt4FogYFAODpm6oliItOWEP3ixdaTlP\n0w2ylaH+iYoYoeBeGM8aimQg82dKUiWvDfwh46EuMWBcFLOdmjNyVqCZEjmhRVDk\nRuEg1Ww5tanouN+G/cFfyAF1wXMA/S1i2Y5GlXkKY1kLtoWAXEi1BKmNFUC0BZmd\nKsp7QC5rRs77Fno+ZWjKJrWrBlqZyE6XSf+f6qTBc7YUnXdcx6U965fU3GJb00lR\nnJud/iN0PnN4Aa8wiDqSoONfgV77xErdJ619YzQ5VchyDM8lh3kCggEBAPq8eUjx\n8KJQUzO/zv4GNuwky+3Sm6oqKrNrSja8LMv1w7HNcAkHMtb5bWzQ+7W8/qxKZ4Yn\nmVp+/3cPlDqq28JjHmeCvo1bW87ztBRXaUbRqOLlpoL7VOHb47Z3jMsT8yxMj7SO\nOFNAmIweu/7X7I/mBNgNsSg0D9FkXXEFGKv+12QqesUA13fDltE49OuL/qPXasWi\nIU8LKQoojxCJEmUEbyUQikDseSds9cefbW9CGjZ2Xf6ohEzmbG7tl8jt9w6OsRkU\nCzxe5/tdvDO9LeablJ+bvkX4X6eOOhXHiOA+kPWf3RQ/azsYFq6rleWmL4SJBTy1\nnqXtw/RcZGmfek0CggEBAOJA5uD/I7mRC0TrJL1FyK6d9PfZwBDK/B0QvCyPTHwv\nSWLN7HNypO1BA2IXHUPSTCQzORj9Kd2HWYbYTqpBUoCbrHs7vqCnNj1QDquc8dBe\nXhFh1h70j66sr/GkpoAQUNOR5Ni+1KrZyiMYVu8xIwEbTyFBNXtcp1y2La882yfH\ntt+UuWPV/T7yNcq4vekFpEKoSmTm0j3O3T79ZSk3LFzvfGVgsP2yiBe6dMBqh9HR\n15XUv+PkL9JV4G0kcP9YiNCZaeClJfyIiyPXZxbBd30qDMgqvE4J2ONUV7i4MxpZ\nVHonRQUVsBIjyCaLBMS2EpTpAhvm/CH0NE+1t45mdzMCggEAOvXlA105O8HtvsaE\n80Ec2yzP843J4xrlTamWGwbm9dNGAGKRzN2ve9PNgoAmIJdfv74DWA2pxxkEE8hL\nD/yrjqtmM+sPygfIsAKovvvLGsckkq50GGrni/D8PCUiq4J2dV1PkaK75f/Tn2d+\nx6+YxkHNs8yMcyrC6XdTbcdIBPH5Tmma0waepGAO8AYXuegCqh520iCM+pxiOyxM\ncBP7ilufkzSvfhLdboL1zMpVnosJxPLSqZaQ/dBVgURHpA0pQngVdxM6jSi4Hmjt\nX7FFwOum6F1kQenk/G66g/KW4jx0M/4yq5c6LPw+ITbiGc2ZcO4TmDIRK22c3bJ4\nPkotJQKCAQEAkS/CuGkhPKglyiD2n3qTb/Iuy4lw5ZXMOL6Pciy2kQ4rEntAG0lb\nKmBI0n4wql/dunEgV7fFUMHVImHWAQ0P6zV6dk39YsxKUwf3kgqRZfvYc2EL7StU\ntGteMDtPGOjfZRS+/JNglw5Q1zp8NtuaMdCbc6SLtFDdmPHS2Ru9KobPBCRE3xrn\neqgk+qSYQVr8cEXcD2nLShxf/1bNvqgIEM8hTVDB4trY2BkvaHY0F+GHbT9rr8qz\nIU84R/FVjZX7nZiEx8JSYP4iA2rrXT/i9G+yahR6Z72L7z0lWYTiTis6uXRPpxam\nuM07V/hno++Odv4a+1q7OvKhSvE6C+gW3wKCAQEApA6aeRg6Pl85gWp4c9MMGo3k\numcJZaeRc2d2cwGunAKxmv0jCVoS8YNgEFSewkZEMyC1GzcxFisqyBTcSu8ZlLVj\nYeHMpW1hRIb/J96YJV06XCuyXPZ3cmKup0BsQra277buF28+C6eJHBmukUKJtQ3Q\n88NML8ZSxuIhN7mNLUcfF3Ir/010MHQSefBoiXiu37uCouh0jFfzJFAfI/PR3ZqD\n9OQl/AUimT4iTHENSvVQk5x+sCKNUDUQBCxAVXSPD9uFOLRmgFrMHF7r4eYoe3z7\nEsugyiLu1ZpojCUTUChM7xokCch1pCSbHEGjK1xNB0q5AaaBb7W8asF5EnUZ9w==\n-----END RSA PRIVATE KEY-----\n"
  },
  "gitlab_pages": {
    "gitlab_secret": null,
    "gitlab_id": null,
    "auth_secret": "e9138690a98570d0d33929388a6d9c4b246beca4f365508aaf87433c66558c89a648763b8f6ef65031cabdd9808fdf5881321622f93b2632d66849428eb84617",
    "api_secret_key": "us8hRcs8jtF4ldrR0G92BpS6MKMp4484OAUTtZU/heE="
  },
  "grafana": {
    "secret_key": "b72a324e76f22920a99f2729e34dfa8f",
    "gitlab_secret": null,
    "gitlab_application_id": null,
    "admin_password": "94a7079591799d6ddd9fe9fac4d1d026",
    "metrics_basic_auth_password": null
  },
  "registry": {
    "http_secret": "2b305998ae7318c481e50766ee6b0e2ef20fdf2ced0824a2b2a97b2a79f28c2d5511635d4d53510e4d4ab45a6e4575de95b62b898cec69954988bb335c9b083b",
    "internal_certificate": "-----BEGIN CERTIFICATE-----\nMIIFBTCCAu2gAwIBAgIBADANBgkqhkiG9w0BAQsFADBGMQwwCgYDVQQGEwNVU0Ex\nDzANBgNVBAoMBkdpdExhYjESMBAGA1UECwwJQ29udGFpbmVyMREwDwYDVQQDDAhS\nZWdpc3RyeTAeFw0yMDA4MjYyMzI3NDlaFw0zMDA4MjQyMzI3NDlaMEYxDDAKBgNV\nBAYTA1VTQTEPMA0GA1UECgwGR2l0TGFiMRIwEAYDVQQLDAlDb250YWluZXIxETAP\nBgNVBAMMCFJlZ2lzdHJ5MIICIjANBgkqhkiG9w0BAQEFAAOCAg8AMIICCgKCAgEA\nqbaV8ZocTMF541CWuLp9YoUXat7XJWUWGFfI4kWyr0SZjpIuRwVHVveM3SNRvbG5\ndB/b2ejTg7M2MjMWrq4ZB2kapXKw+7Lh1FXNwlWM6gUVtZ+tyio4VoDPR2fNWYgj\nnnBrSe3XzR14/zNElSjAX13i8U9yuiy2hjwq2jEpvIT1FgFeg55diLYhQS2EikCg\nfly3Yg5ln7Q1XkUvPOd/yC5y7WLOMKiA2FMerSFk7Rvx3d1WJlBNHEqii2KWtLV7\njV6euZTfyLa7B0DKolcYItZoGDDJhOWK8y/RFBSuduxY5T9JRGZoHaZmMlQYcUzy\nB6fZw+2SuEht/St8UCWHPTMBIixsZhP5pPqPY7yLSv5XSpdn/t+cMH6TjpHky3nw\n18rDazc1K3Dqjis8uiq9KHceXtClP3XAYsF1k5V8UE0dqXFtDx4i7FYc9ZFtqEyO\nbnqVWd3oGTwpxk0G9zct+KcQaG4n5PpE6+tG78iuo5pYLA1Mh+eTWGSDV/sHUZoe\njiMwiZhK/Y0s7oJ+WndgtrDk7ALf/5y70nYDZv68LF1qdU8T+8uPN97k+LDWocCm\nHR9XI+gHzxCsx7V4E9oa9lzRPEO0wMqOBUNFMY930YsursI9ud58T/afxnsG/rl7\npzTohia13JuA1xDbssV850BEA9JaN48SK1ON89+5QOsCAwEAATANBgkqhkiG9w0B\nAQsFAAOCAgEABpdG65k8ojCUG3vRAJRqoTJz24eIRLfldSG/OeZVTtRC6EHpJodj\n2ocImcaNYYgLX/XWhm8ZjaIE/8horAUSDNNzw2rmUclyMj04WHJ/9I8TjQzLRgOb\nnr9JFR6KfXqv08I/myJAGcG5por/q1y/owdhkNOPd0Eup2ZBxP14fGCv/Rup/572\nlNWeGBaHXKqg8TskzOeAAbcy3agLd1bAUbi99gHdCVbiX5oyk2JqtOOFwk27tnUH\nxnJXHj5NkXqadaxAWfdOfCNdE/d+Z3zVy4L0zLJIJZZoB9Kday9QL0hSNCKoP/n8\nks8AtvkYAA7MyMDGykL+V7GurcRjFjRA3/brwvxgHSFPbWGP6/HhJ8x4uqTcbaI4\nSh5aW1NKd7mrtgKhePdE3MmjZFxNP7NawFslkQCt5RnEk4ZCk6mPF/J5rtc0wGNV\nuN2LSPhykZfFSzeT9HTR2f8FFgWio5Q9SDkWcdA2XbvgO0XRQBVUlr7bciLyXcv8\nR0t+OwiOo2aXy584GRq9rWLF12LQC4FX7bbCy65txMUEm4JXbYnHDjL5jSM4klfP\nNybE9Ux07SsL5SEUcoZmnNIJ4tkwbjQiUrVvXdiWX5c8ofMoSavr8d6f6j8V3Q8c\nUf0U/Q6HejqUm8o0r8+hviANoRMhkwk8shUjHD8SyySKr/7JStInfw4=\n-----END CERTIFICATE-----\n",
    "internal_key": "-----BEGIN RSA PRIVATE KEY-----\nMIIJJwIBAAKCAgEAqbaV8ZocTMF541CWuLp9YoUXat7XJWUWGFfI4kWyr0SZjpIu\nRwVHVveM3SNRvbG5dB/b2ejTg7M2MjMWrq4ZB2kapXKw+7Lh1FXNwlWM6gUVtZ+t\nyio4VoDPR2fNWYgjnnBrSe3XzR14/zNElSjAX13i8U9yuiy2hjwq2jEpvIT1FgFe\ng55diLYhQS2EikCgfly3Yg5ln7Q1XkUvPOd/yC5y7WLOMKiA2FMerSFk7Rvx3d1W\nJlBNHEqii2KWtLV7jV6euZTfyLa7B0DKolcYItZoGDDJhOWK8y/RFBSuduxY5T9J\nRGZoHaZmMlQYcUzyB6fZw+2SuEht/St8UCWHPTMBIixsZhP5pPqPY7yLSv5XSpdn\n/t+cMH6TjpHky3nw18rDazc1K3Dqjis8uiq9KHceXtClP3XAYsF1k5V8UE0dqXFt\nDx4i7FYc9ZFtqEyObnqVWd3oGTwpxk0G9zct+KcQaG4n5PpE6+tG78iuo5pYLA1M\nh+eTWGSDV/sHUZoejiMwiZhK/Y0s7oJ+WndgtrDk7ALf/5y70nYDZv68LF1qdU8T\n+8uPN97k+LDWocCmHR9XI+gHzxCsx7V4E9oa9lzRPEO0wMqOBUNFMY930YsursI9\nud58T/afxnsG/rl7pzTohia13JuA1xDbssV850BEA9JaN48SK1ON89+5QOsCAwEA\nAQKCAgBICMjCIMCMT77VnjorNHTN4WHcKbO2Gp7zPCd261B5lit7WU6tNG9gWXh/\n0GL8mjf2MyOU7X8Bsop5ajfhcuIKxDDcMr8uRnIWN0k7iCZkmj3ptloEqkD5bnkM\nfOGrc95yfJL9cSec1zqpT3B3wzFMCUSvWiJ/JUVf2p/xttZZPzHr4i7kvM5EndGl\noZVVPTMiD2aDB0tZKxtP5Ru0xSn2pMiBO+P6wTrXFwi5Qahd//N8UVskrgbc0E0H\nzpPbJgDIM3Y5nRgTUIQ4Auc/WqpS9yB9zA9tCiUdLZmX5WNb9NuSinclwjXFCADu\nscUiKh+84iDLScZx08RjphaAyj0JKtOHwQFGBWj28yZuAJjYRneYYV3dRiOzRr7b\nn8Q6pd7eyznJ9XRB7JQeDwss6f2e9VNIklJCa3xKXdiz9LgPfb1gTO4h0LREGRYr\nYX11hOVUPptPpyp3q7LtS9lQIz0qDOeVp03lBOgYKPAbiuF79hwvkxkp6d89bHxP\nMEK18CE46HGtePKx21xPGODObhNIEle97znpUrtcX1n5YNCwjRYc1FtWkLJKR3em\n0hr55UjN6mYxPk21f3jAefQ9TO8tx18H76s8BDoW7IvqUGbQzVPLlo7Ve7S4sMxR\nCjUjmTMPtI7dzG4q1rqsNrqnya4NWyp29aNgfnOjtPNGzqCSWQKCAQEA1/hzmamJ\n3zgKo0r/eSwV4jDFIXe57K8bJOFTJH7/7SgqQrEGTMZ76Tz00QjWx5bpmekGIsqG\nxwsaDslNqr1mPoR5JCxFIvv/GgBlLFdWeYlCYpDOOO0cTRBSXShkQj3l+i5qduVr\nbLTbfQVWms0UdVRw1dlozmdjEEWQfpDRBGozrtSnibN1zknkBZaf84E61Q/+2fiP\nf2gbbN4jv1ZXFb73JwnNIFuQYhfeRJ57U0Gsxix1hp2CVgH6zmYTwd+1s+FVkn1P\n3x1GSxDfHkPx9bWsN8dNdLuJcUApFaPu+whZhblIfBcO37K2S3j/e+nf2ZK30GRn\nM1OU5bTfpeXXdQKCAQEAyStHprHTPsmknEIzLuyahjKpV/Px081Bbb03lXy+XHHn\n4wwia/soJ8E7fUqlzJxk60Syrc9W9UUu+8WS8TcfO9womJW8LZVyiX9Hxu9c+/mX\n9CFPyvzblKylUod8c0rSNSeww0thXosmL7EWncVfLqhwvkawc0SJbSWpQh3k2AK8\nKB2nMFZ525lGUJ8H/LOvdEf/jDS15SCN9Mavll2Vd+frpkHoPz4eSDmc+pLDTKHl\nCmD5FgGZVVSiFXALJVdhLaMSVe4tyemzHpK8qQ3yJ3tppelJK3ly0vbGkx1zpg5u\nIN+KIau0KyqCID0jW8eDaN26VRQi91RKm/uXrrgK3wKCAQA6qVB093jseaNiETft\nKM1U39xbp9KHeFSOIunbaueG+jboYH8OkYcMpjL1KEp2cgZHeOTixFHxdJGCXKlM\n7B7+cisZaTDqPLpgzKSuc5aYcnDmpuBs0/Kw9/L3PMZmu7tgxgTDALO6FjHb9nw8\nleGtsN7pJyFxluFwhQSnbBxp75LUNQzAuU8RVj6qSexuTra1MqANgpcviw6P9pKN\nIR2MWY92OhJObLB+BG+qAcYLqjYMqfzOMLA7PlRqhY1uRp5rGpSMsp7kQmZac123\nMcth6xO5HthqEZpWeY/vQdTiuLTgPqBynCy9FCSxwU7b0H2t8k0dPHhPl69E6Wkp\n/ZEVAoIBAFjvHk0OfnJamMBP7+rFxQag7QaqHPXi3xMRvLoEnO+nl7ljivAr57Oz\nlIYucyAC4Aa2pzt511q1TDEYRn8HPHKtQPE7+SY51Jn+wA+tkHEBBfFyrKDzqmuO\n68ORjC44HLhNJLMh5xjx8V7SLkpvkEXDR5yHCcjbutma9bn6F0p74wzlFx2ijVrM\n5y4LMG/CTEXe8pXcU7HI85kMIWIbW1HYIPCuYGtdHewWNFT+fwKo6+XruxLEgDIe\nKU3K69KFT7vqRNfiZTHHdF2Gx4sBVFWqFKm5eZSTq3SijmVJdvApnvw/dwStsQgI\nUeDIxpHzoR/CLncgYNjw1c8hqgwe5wcCggEAQLc5c0On8vMWZNus0CV513H+djIU\nnYcSfvvvpRzuZFmh1I5R6J/Mb+Nz1wc66IXvutEZyhUFOvAEPYUde3Ph0m16qzrw\n550U0+GEgy14iwyZb7ss5k5H97wCCrU91I2/eHo1P8jg7GXk8E/KIBxwnemBRRDP\nZ6QhKV59vMSZXsDe1P6MrzJPTRbzCLgsYxvZ1PBzKlZ5HxiUQyRbV8ZXRPsDPB4C\n5GD5TV1PuBVuYMsrTTx0O0brqmMdxs/9viCpuEr4YpAonycpumSL/sc09dmMCc2J\nEAkKOVM7CnDwNnB0s9eklj0j/4G6LD5x+Jhc4TJF0+P9rKIf3l/lexRnsg==\n-----END RSA PRIVATE KEY-----\n"
  },
  "letsencrypt": {
    "auto_enabled": null
  },
  "mattermost": {
    "email_invite_salt": "cfd03b9055bb69592bdbb609df0113e8",
    "file_public_link_salt": "2aa84a67763e76ab5192fcc2ba551d2d",
    "sql_at_rest_encrypt_key": "4c00d6d2414a4544c7ff59accf10bc78"
  },
  "postgresql": {
    "internal_certificate": "-----BEGIN CERTIFICATE-----\nMIIFBzCCAu+gAwIBAgIBADANBgkqhkiG9w0BAQsFADBHMQwwCgYDVQQGEwNVU0Ex\nDzANBgNVBAoMBkdpdExhYjERMA8GA1UECwwIRGF0YWJhc2UxEzARBgNVBAMMClBv\nc3RncmVTUUwwHhcNMjAwODI2MjMyNzQ5WhcNMzAwODI0MjMyNzQ5WjBHMQwwCgYD\nVQQGEwNVU0ExDzANBgNVBAoMBkdpdExhYjERMA8GA1UECwwIRGF0YWJhc2UxEzAR\nBgNVBAMMClBvc3RncmVTUUwwggIiMA0GCSqGSIb3DQEBAQUAA4ICDwAwggIKAoIC\nAQC9KVqkNFt/angxiimg9eWdEnvmL+u2Gk6oIWSB18M52qhb69kjf3zVfLsyDbZ3\nobyJrTMq02O1Ld+3qVhVE+QGv+L96d8yZSC7S/HecPLBY6XF6Lk6K8+oRVRNPV3J\n6/As/ZJQbghjTQ8mvHeQa7MfnLAg7+lz5yFSK0AS4u/4xc4r8U3q8Crq3czPwkXQ\nFe50pH99m0l0ydsWFJ7NBO+JTbdq0Q2q/IJlJ4afx5ZMkggn8rGM5GgOa4vmRQbs\nVQgU94TeeDnhtXuGskk55BMnJTSITqohJLZLHMOuYFxT38vyg0nN5iRgr8x8JwBw\nFWwA5vqMdPtV3V1SBycRCZNfjwKVAKVyT+wDsGEKOWvKrLbCDkO6i8ph+yMdnmPc\na/M5MYlxMdNw5kvgMukDLemdPXMIexAvesQdTP76iDa8DXFiEIhOLtnaP3Qwl+bM\nYfzKm1CMtw7RgAQ46XKAxkwEKCZ1MiQ+p4iXAgpgskMxZMIiUVMRGXvMGLnWkRR1\nD7vwNLdeh6B5hFYT/AM9paNvoBGdfrU8//I4MLfRc3qDmeT4sh+rNWQVkqLb3yrm\nU34Gbo/2vg6RlD7nzrSMJRMqqEWPURkSIMxDrJ9NoPTmlPJoZqZh7/Wv0vpbas41\nbbmhIjXx7SS2PAIJzHq3nKxMus6fkRpSPeg5M/g2tOw8awIDAQABMA0GCSqGSIb3\nDQEBCwUAA4ICAQCj6vszO3EA5CaLVkdT4C4V1mqL0PdJ/NC6ZqeN/snxDPHIwPVH\nt523UmUbjF9sQx1WGFC7HkiaU3PUodwZEObX5WY9d/8o4eR4GnOvotNT81tdMnzD\n0RIQ+Wh46Mj2jAlnBjn0AeuZ7CKBltsV+wxANwGBS4e/PIMhCyYpAr+i/1RXjLsT\ntEq29lUNJIzYoemcADDh6Ijg+1yILsEBTN+ELC7PtGdvej2SYYJlHaxSfztgBT/O\nOYlF5CvRdyBzx9SiOCO7/OM0RR919qt4iE0awSkYVV6xQzQxWmI8rdLOj4b80JEc\noxMAtANIbYHUZviVOLLWEkJoRLkINbQetSHz2RJ0xcPtWnOlWf2RI0xbsUg6v619\nH66wi3vaF9EFP325oLrTYzMWQsa34HaWYVCuySOfUCkHP6UQSvseiNtjbtptUq0b\n82L2sYbkfPnp2n7grCnl92JLRMeqUisr7tG8jxyZprTrJGryTXi8EEPh6/sudIbI\n803w2i3+QRVG6tu0Evg9dMHtcIkW2qXnUOdlEoCydKlvmn+UIQhB1E2Z3F49SyZE\nfML1uZFgAddIBe2FPizqo90W9mTTYE3zYQEvKk0UyskGZMaKsJtf3E2FI8Y9UX5/\n3NyKfqdm5AZ5xoBFvfX9oVOOQtFz9o4yOsLyRBtuKV0nyD9NYxOJmtDzHQ==\n-----END CERTIFICATE-----\n",
    "internal_key": "-----BEGIN RSA PRIVATE KEY-----\nMIIJKAIBAAKCAgEAvSlapDRbf2p4MYopoPXlnRJ75i/rthpOqCFkgdfDOdqoW+vZ\nI3981Xy7Mg22d6G8ia0zKtNjtS3ft6lYVRPkBr/i/enfMmUgu0vx3nDywWOlxei5\nOivPqEVUTT1dyevwLP2SUG4IY00PJrx3kGuzH5ywIO/pc+chUitAEuLv+MXOK/FN\n6vAq6t3Mz8JF0BXudKR/fZtJdMnbFhSezQTviU23atENqvyCZSeGn8eWTJIIJ/Kx\njORoDmuL5kUG7FUIFPeE3ng54bV7hrJJOeQTJyU0iE6qISS2SxzDrmBcU9/L8oNJ\nzeYkYK/MfCcAcBVsAOb6jHT7Vd1dUgcnEQmTX48ClQClck/sA7BhCjlryqy2wg5D\nuovKYfsjHZ5j3GvzOTGJcTHTcOZL4DLpAy3pnT1zCHsQL3rEHUz++og2vA1xYhCI\nTi7Z2j90MJfmzGH8yptQjLcO0YAEOOlygMZMBCgmdTIkPqeIlwIKYLJDMWTCIlFT\nERl7zBi51pEUdQ+78DS3XoegeYRWE/wDPaWjb6ARnX61PP/yODC30XN6g5nk+LIf\nqzVkFZKi298q5lN+Bm6P9r4OkZQ+5860jCUTKqhFj1EZEiDMQ6yfTaD05pTyaGam\nYe/1r9L6W2rONW25oSI18e0ktjwCCcx6t5ysTLrOn5EaUj3oOTP4NrTsPGsCAwEA\nAQKCAgAt4NTKFKTIb3M9WKwmDN2mze/c8Wxy20iOgKLW1xTTeFPzD223rVkCkmD4\nj9jchQ6sOaS6U1DQhZLIAbuZztw0Qt/0A4ANwfdBVfcQo0ZNXzS6nmomUK/puP7s\nSODxc1bqIooVFcrVAsCU/YrmLSjhlugk5OszIDC1tCWzLvVS2e7aO4lRXPSbyDW/\ngffasycFhUwik8IqIDcR0Oh/Ax5xp7a/onp1KQ8bJ44APLEYWya9QaCMcm1GahEh\nRUablTgDldDVAEXRl2mhTqZx8v4uNVjbYnDi3vuTliNjrJ1X/mSBqhQBazsRdDHd\nPrxdcuSiB2NnI4w91BWpKnDwMelbDU0kaVO0T7Jmaj0/acPNIgWXTXqs4juNPHz9\nN5xWFRlg2Sjh958iTthTXk8v6tg939A9fOsq0waWdxHTPw9/K3V5+mgGvOR8h2VH\n7BIMp8wTgFSunqq569Vn2zKS4pJMnQh4eTLpwfAG8QJNgEp4HcexqUoLx9LH5XTT\nf51bLMzruubaZqj0jLv3aiGcVvgJrZ9t1S7GonQxJ61ujfvNXSqdNVu7tEJ1m8Wq\ng038e/gJfvGUXuMYTxIDMotATdLJxdYL2e2nq9LsiItqfqkWZd38WVpiAf8eBiZq\nmuS47hGbWBvcFQaKd6afX+k/kFyPN+qwgI097iEPPc80HQa50QKCAQEA+Q1+mf+P\ntT5xl3GwouqO92/qXa9Keoa69SavCWsGKqFRNxYkFqctwUq7QanTfVeTk759UBB6\n5m3Wg/m8bZeaxq7CLWoGxf6PUIAiuWJCFByYmWhGBTqQ54DHLZVP6Ge5D+hcGo5s\nf3sDbWf8FQbfIduoCw4kezSp6763PsEtmM+gCky7vvvXJahfteBd9K8REEwDCBYJ\nsL4YwOXpXI/seSR8rKDDQDThm3UDo1+deOVd/mCT8lKZaIyId0o2dO9B7Wj0hf+S\nRsc5KdL1k7uQQsnBopl8B8o9P/CZolEv7eGLhgHS+rArcVMV6+YyRDX2Dh2kLMMJ\n/7hRq1pbaHbQ4wKCAQEAwnAr/bvPk7Fajf8ffpWbzCrYelHylub9I89nujMQX6O5\nU9uAw9y/5kt3+R0SHoFfdQFtZu8GJtPou8bkcggFzQHEmAywb6ZMViVEn3bjFM0v\nkaXPCjIK269ely83QiWRFa4ve/99t3pKt8Xl2lMzcnamEO6Qfu1ZSRsgBewX5uNq\nDObKL6Y9z5ZVGpYFnF2LlR4EK9l1KXBEi+H58aycK2XqhehI3aa917hhmXkNZHPh\nlN9mZWAE070Hs5Ce0qMeTbNEMYYO6SpiaIO5BdaTfbfwt7vdUQQJXh+yZbDWGov2\nVmXy5l2uJAEPHpfY3B/TV1EInGB0ZhTCp1rwUBnk2QKCAQAjzDjCUeWKG6ugJQtK\nn4RlNITval6+NddxnVnTdLqyLfXKgTg2uVjuS5uW2J45ifkAZ4UDmRrRPEB1P9RB\nvGTW4g+vD2ph0zEuVPyowOLWmTWl90L5RW3GmNAIUUnnEeGb075JYudde4UGmMe3\nDgHMkBIbZLEBtJQn+oXEU2gGavGKCXWDAhfupcD8F3/px7AgM4zMAL7r1KciMunU\nECvhTclN1t25wOAcxDj9pqSv1+gmxCL/1bePO4PyAYzKSgmj4k4jZJTV75Tb2iLK\nVU9rCiz2/jDBveQH6MFsf1bwTlcLr/9vYRsdct/XxIK9IzR22vPaKz6orwmuI5K3\n9TwZAoIBAFni82NMZKzZa4yDabLiRPEAyazan3RFercIVeKNYr9j9/QdYIyrS4eS\nUfc3Cj5R/qgfrczNKSHgCxJr4wYYUV4xuAm2rAYhcd7NQckac+YU6S3C4lDLS5u9\nmdP4fuo0ZbsJGGiRdzPP9CS69wSUPA9pbGIdd21GGmWihY5XU8FoVol6U/PtPVvv\nGo681gEweavJAZKn5/LtNLMaF6sy6ctiRSX8eVsGj3LfiTci8B8FNz7UfAjXd8PO\n+nV3oQStZf/zpM3kNJZ0AqRgaLObO/n9g+ncjna6j/4UVyuNsZz6ITpVzRHUMwHv\n/2ZcOmOgztnp2zo3mPfsFwS5FKljHxkCggEBANvHyDRNTHR4/ZIfEp16FhwfHHUB\ncGVJkzYoQdWoZdMMBpAFQngbu+CmxBsc4ZPJQH2Fm5dk8pUW7Ak345Tjzl7uWSTZ\nLSgvGEu2zaNyvK/WrHIjCKPoEdM7k/WMi15xGe7JJN87+BjGCU8xDcspxy+96eH2\nXDjIGlVg+9v+LDtuxtK6ponobjIe/Qq6klSLmosqgZ7BqeI3Ii7NChUbEdh3Zm0z\nPXP4V/jmO2OZeCCYWV9dSGowzR75nmphDqhR18W7R1Tee4yAuwDkmT0B6kin0B58\noarRJhCSC1/9PRKxBpr9vCt4WM3BUNCac2LqtW+czrdHYktQHM2WEJ34Hdo=\n-----END RSA PRIVATE KEY-----\n"
  }
}
