module gitlab.com/gitlab-org/opstrace/tools/xk6-client-tracing

go 1.20

require (
	github.com/dop251/goja v0.0.0-20230919151941-fc55792775de
	go.k6.io/k6 v0.46.0
	go.opencensus.io v0.24.0
	go.opentelemetry.io/collector/component v0.86.0
	go.opentelemetry.io/collector/config/configgrpc v0.86.0
	go.opentelemetry.io/collector/config/confighttp v0.86.0
	go.opentelemetry.io/collector/config/configopaque v0.86.0
	go.opentelemetry.io/collector/config/configtelemetry v0.86.0
	go.opentelemetry.io/collector/config/configtls v0.86.0
	go.opentelemetry.io/collector/exporter v0.86.0
	go.opentelemetry.io/collector/exporter/otlpexporter v0.86.0
	go.opentelemetry.io/collector/exporter/otlphttpexporter v0.86.0
	go.opentelemetry.io/collector/pdata v1.0.0-rcv0015
	go.opentelemetry.io/otel/metric v1.19.0
	go.opentelemetry.io/otel/trace v1.19.0
	go.uber.org/zap v1.26.0
)

require (
	cloud.google.com/go/compute v1.23.0 // indirect
	github.com/Azure/go-ntlmssp v0.0.0-20221128193559-754e69321358 // indirect
	github.com/Soontao/goHttpDigestClient v0.0.0-20170320082612-6d28bb1415c5 // indirect
	github.com/andybalholm/brotli v1.0.5 // indirect
	github.com/cenkalti/backoff/v4 v4.2.1 // indirect
	github.com/dlclark/regexp2 v1.10.0 // indirect
	github.com/fatih/color v1.15.0 // indirect
	github.com/felixge/httpsnoop v1.0.3 // indirect
	github.com/fsnotify/fsnotify v1.6.0 // indirect
	github.com/go-logr/logr v1.2.4 // indirect
	github.com/go-logr/stdr v1.2.2 // indirect
	github.com/go-sourcemap/sourcemap v2.1.4-0.20211119122758-180fcef48034+incompatible // indirect
	github.com/gogo/protobuf v1.3.2 // indirect
	github.com/golang/protobuf v1.5.3 // indirect
	github.com/golang/snappy v0.0.4 // indirect
	github.com/google/pprof v0.0.0-20230926050212-f7f687d19a98 // indirect
	github.com/josharian/intern v1.0.0 // indirect
	github.com/json-iterator/go v1.1.12 // indirect
	github.com/klauspost/compress v1.17.0 // indirect
	github.com/knadh/koanf v1.5.0 // indirect
	github.com/knadh/koanf/v2 v2.0.1 // indirect
	github.com/mailru/easyjson v0.7.7 // indirect
	github.com/mattn/go-colorable v0.1.13 // indirect
	github.com/mattn/go-isatty v0.0.19 // indirect
	github.com/mitchellh/copystructure v1.2.0 // indirect
	github.com/mitchellh/mapstructure v1.5.1-0.20220423185008-bf980b35cac4 // indirect
	github.com/mitchellh/reflectwalk v1.0.2 // indirect
	github.com/modern-go/concurrent v0.0.0-20180306012644-bacd9c7ef1dd // indirect
	github.com/modern-go/reflect2 v1.0.2 // indirect
	github.com/mostynb/go-grpc-compression v1.2.1 // indirect
	github.com/mstoykov/atlas v0.0.0-20220811071828-388f114305dd // indirect
	github.com/nu7hatch/gouuid v0.0.0-20131221200532-179d4d0c4d8d // indirect
	github.com/onsi/ginkgo v1.16.5 // indirect
	github.com/onsi/gomega v1.20.2 // indirect
	github.com/prometheus/client_golang v1.17.0 // indirect
	github.com/prometheus/client_model v0.4.1-0.20230718164431-9a2bf3000d16 // indirect
	github.com/prometheus/procfs v0.12.0 // indirect
	github.com/rs/cors v1.10.0 // indirect
	github.com/serenize/snaker v0.0.0-20201027110005-a7ad2135616e // indirect
	github.com/sirupsen/logrus v1.9.3 // indirect
	github.com/spf13/afero v1.10.0 // indirect
	go.opentelemetry.io/collector v0.86.0 // indirect
	go.opentelemetry.io/collector/config/configauth v0.86.0 // indirect
	go.opentelemetry.io/collector/config/configcompression v0.86.0 // indirect
	go.opentelemetry.io/collector/config/confignet v0.86.0 // indirect
	go.opentelemetry.io/collector/config/internal v0.86.0 // indirect
	go.opentelemetry.io/collector/confmap v0.86.0 // indirect
	go.opentelemetry.io/collector/consumer v0.86.0 // indirect
	go.opentelemetry.io/collector/extension v0.86.0 // indirect
	go.opentelemetry.io/collector/extension/auth v0.86.0 // indirect
	go.opentelemetry.io/collector/featuregate v1.0.0-rcv0015 // indirect
	go.opentelemetry.io/contrib/instrumentation/google.golang.org/grpc/otelgrpc v0.44.0 // indirect
	go.opentelemetry.io/contrib/instrumentation/net/http/otelhttp v0.44.0 // indirect
	go.opentelemetry.io/otel v1.19.0 // indirect
	go.opentelemetry.io/otel/sdk v1.18.0 // indirect
	go.opentelemetry.io/otel/sdk/metric v0.41.0 // indirect
	go.uber.org/multierr v1.11.0 // indirect
	golang.org/x/crypto v0.13.0 // indirect
	golang.org/x/net v0.15.0 // indirect
	golang.org/x/sys v0.12.0 // indirect
	golang.org/x/text v0.13.0 // indirect
	golang.org/x/time v0.3.0 // indirect
	google.golang.org/genproto/googleapis/rpc v0.0.0-20230920204549-e6e6cdab5c13 // indirect
	google.golang.org/grpc v1.58.2 // indirect
	google.golang.org/protobuf v1.31.0 // indirect
	gopkg.in/guregu/null.v3 v3.5.0 // indirect
)
