{
  "type": "panel",
  "name": "Table",
  "id": "table",

  "info": {
    "description": "Table Panel for Grafana",
    "author": {
      "name": "GitLab",
      "url": "https://gitlab.com"
    },
    "logos": {
      "small": "img/icn-table-panel.svg",
      "large": "img/icn-table-panel.svg"
    }
  }
}
