{
  "type": "panel",
  "name": "Pie chart v2",
  "id": "piechart",
  "state": "beta",

  "info": {
    "author": {
      "name": "GitLab",
      "url": "https://gitlab.com"
    },
    "logos": {
      "small": "img/icon_piechart.svg",
      "large": "img/icon_piechart.svg"
    }
  }
}
