{
    "level": "info",
    "event_id": "7979761fb8a24a9c81633f1c92c55d7b",
    "timestamp": "2023-01-12T10:08:37.814591Z",
    "breadcrumbs": {
        "values": []
    },
    "transaction_info": {},
    "contexts": {
        "runtime": {
            "name": "CPython",
            "version": "3.11.1",
            "build": "3.11.1 (v3.11.1:a7a450f84a, Dec  6 2022, 15:24:06) [Clang 13.0.0 (clang-1300.0.29.30)]"
        }
    },
    "modules": {
        "certifi": "2022.6.15",
        "setuptools": "65.5.0",
        "pip": "22.3.1",
        "urllib3": "1.26.11",
        "sentry-sdk": "1.9.0"
    },
    "extra": {
        "sys.argv": [
            "../python/app.py"
        ]
    },
    "release": "v1.0.0",
    "environment": "dev",
    "server_name": "Nicks-MacBook-Pro.local",
    "sdk": {
        "name": "sentry.python",
        "version": "1.9.0",
        "packages": [
            {
                "name": "pypi:sentry-sdk",
                "version": "1.9.0"
            }
        ],
        "integrations": [
            "argv",
            "atexit",
            "dedupe",
            "excepthook",
            "logging",
            "modules",
            "redis",
            "stdlib",
            "threading"
        ]
    },
    "platform": "python",
    "_meta": {
        "threads": {
            "values": {
                "0": {
                    "stacktrace": {
                        "frames": {
                            "0": {
                                "vars": {
                                    "": {
                                        "len": 15
                                    }
                                }
                            }
                        }
                    }
                }
            }
        }
    }
}