{
    "scenarios": {
        "slow": {
            "executor": "constant-arrival-rate",
            "rate": 10,
            "timeUnit": "1s",
            "duration": "30s",
            "preAllocatedVUs": 10,
            "maxVUs": 100
        }
    }
}