module gitlab.com/gitlab-org/opstrace/opstrace/provisioning-api

go 1.22.0

replace (
	gitlab.com/gitlab-org/opstrace/opstrace/clickhouse-operator => ../clickhouse-operator
	gitlab.com/gitlab-org/opstrace/opstrace/go => ../go
	gitlab.com/gitlab-org/opstrace/opstrace/scheduler => ../scheduler
	gitlab.com/gitlab-org/opstrace/opstrace/tenant-operator => ../tenant-operator
)

// Temporary workaround, until https://github.com/kubernetes-sigs/kustomize/pull/5055
// gets merged and new release is made
replace (
	sigs.k8s.io/kustomize/api => gitlab.com/gitlab-org/opstrace/kustomize/api v0.0.0-20231012192427-65bdf61d8949
	sigs.k8s.io/kustomize/kyaml => gitlab.com/gitlab-org/opstrace/kustomize/kyaml v0.0.0-20231012192427-65bdf61d8949
)

require (
	github.com/gin-contrib/zap v0.2.0
	github.com/gin-gonic/gin v1.9.1
	github.com/onsi/ginkgo/v2 v2.13.0
	github.com/onsi/gomega v1.30.0
	github.com/prometheus/client_golang v1.20.4
	github.com/swaggo/files v1.0.1
	github.com/swaggo/gin-swagger v1.6.0
	github.com/swaggo/swag v1.16.3
	gitlab.com/gitlab-org/opstrace/opstrace/go v0.0.0-00010101000000-000000000000
	gitlab.com/gitlab-org/opstrace/opstrace/scheduler v0.0.0-00010101000000-000000000000
	go.uber.org/automaxprocs v1.6.0
	go.uber.org/zap v1.27.0
	k8s.io/apimachinery v0.29.0
	k8s.io/client-go v0.29.0
	sigs.k8s.io/controller-runtime v0.16.2
)

require (
	dario.cat/mergo v1.0.0 // indirect
	github.com/Azure/go-ansiterm v0.0.0-20230124172434-306776ec8161 // indirect
	github.com/ClickHouse/ch-go v0.61.5 // indirect
	github.com/ClickHouse/clickhouse-go/v2 v2.28.3 // indirect
	github.com/KyleBanks/depth v1.2.1 // indirect
	github.com/MakeNowJust/heredoc v1.0.0 // indirect
	github.com/Microsoft/go-winio v0.6.2 // indirect
	github.com/andybalholm/brotli v1.1.0 // indirect
	github.com/beorn7/perks v1.0.1 // indirect
	github.com/blang/semver v3.5.1+incompatible // indirect
	github.com/bytedance/sonic v1.10.2 // indirect
	github.com/cenkalti/backoff/v4 v4.3.0 // indirect
	github.com/cert-manager/cert-manager v1.8.0 // indirect
	github.com/cespare/xxhash/v2 v2.3.0 // indirect
	github.com/chai2010/gettext-go v1.0.2 // indirect
	github.com/chenzhuoyu/base64x v0.0.0-20230717121745-296ad89f973d // indirect
	github.com/chenzhuoyu/iasm v0.9.1 // indirect
	github.com/containerd/log v0.1.0 // indirect
	github.com/containerd/platforms v0.2.1 // indirect
	github.com/cpuguy83/dockercfg v0.3.1 // indirect
	github.com/davecgh/go-spew v1.1.2-0.20180830191138-d8f796af33cc // indirect
	github.com/decred/dcrd/dcrec/secp256k1/v4 v4.2.0 // indirect
	github.com/dgryski/go-rendezvous v0.0.0-20200823014737-9f7001d12a5f // indirect
	github.com/distribution/reference v0.6.0 // indirect
	github.com/docker/docker v27.2.0+incompatible // indirect
	github.com/docker/go-connections v0.5.0 // indirect
	github.com/docker/go-units v0.5.0 // indirect
	github.com/emicklei/go-restful/v3 v3.11.0 // indirect
	github.com/evanphx/json-patch v5.7.0+incompatible // indirect
	github.com/evanphx/json-patch/v5 v5.7.0 // indirect
	github.com/exponent-io/jsonpath v0.0.0-20210407135951-1de76d718b3f // indirect
	github.com/fatih/camelcase v1.0.0 // indirect
	github.com/felixge/httpsnoop v1.0.4 // indirect
	github.com/fluxcd/kustomize-controller/api v0.32.0 // indirect
	github.com/fluxcd/pkg/apis/kustomize v0.7.0 // indirect
	github.com/fluxcd/pkg/apis/meta v0.19.0 // indirect
	github.com/fluxcd/pkg/ssa v0.22.0 // indirect
	github.com/gabriel-vasile/mimetype v1.4.3 // indirect
	github.com/gin-contrib/sse v0.1.0 // indirect
	github.com/go-acme/lego/v4 v4.13.2 // indirect
	github.com/go-errors/errors v1.4.2 // indirect
	github.com/go-faster/city v1.0.1 // indirect
	github.com/go-faster/errors v0.7.1 // indirect
	github.com/go-jose/go-jose/v3 v3.0.3 // indirect
	github.com/go-logr/logr v1.4.2 // indirect
	github.com/go-logr/stdr v1.2.2 // indirect
	github.com/go-logr/zapr v1.3.0 // indirect
	github.com/go-ole/go-ole v1.2.6 // indirect
	github.com/go-openapi/jsonpointer v0.20.1 // indirect
	github.com/go-openapi/jsonreference v0.20.3 // indirect
	github.com/go-openapi/spec v0.20.12 // indirect
	github.com/go-openapi/swag v0.22.5 // indirect
	github.com/go-playground/locales v0.14.1 // indirect
	github.com/go-playground/universal-translator v0.18.1 // indirect
	github.com/go-playground/validator/v10 v10.16.0 // indirect
	github.com/go-redis/redis_rate/v10 v10.0.1 // indirect
	github.com/go-task/slim-sprig v0.0.0-20230315185526-52ccab3ef572 // indirect
	github.com/goccy/go-json v0.10.3 // indirect
	github.com/gogo/protobuf v1.3.2 // indirect
	github.com/golang/protobuf v1.5.4 // indirect
	github.com/google/btree v1.1.2 // indirect
	github.com/google/gnostic-models v0.6.9-0.20230804172637-c7be7c783f49 // indirect
	github.com/google/go-cmp v0.6.0 // indirect
	github.com/google/gofuzz v1.2.0 // indirect
	github.com/google/pprof v0.0.0-20230510103437-eeec1cb781c3 // indirect
	github.com/google/shlex v0.0.0-20191202100458-e7afc7fbc510 // indirect
	github.com/google/uuid v1.6.0 // indirect
	github.com/gorilla/mux v1.8.1 // indirect
	github.com/gorilla/websocket v1.5.0 // indirect
	github.com/gregjones/httpcache v0.0.0-20190611155906-901d90724c79 // indirect
	github.com/grpc-ecosystem/grpc-gateway/v2 v2.22.0 // indirect
	github.com/imdario/mergo v0.3.16 // indirect
	github.com/inconshreveable/mousetrap v1.1.0 // indirect
	github.com/josharian/intern v1.0.0 // indirect
	github.com/json-iterator/go v1.1.12 // indirect
	github.com/klauspost/compress v1.17.11 // indirect
	github.com/klauspost/cpuid/v2 v2.2.6 // indirect
	github.com/leodido/go-urn v1.2.4 // indirect
	github.com/lestrrat-go/blackmagic v1.0.2 // indirect
	github.com/lestrrat-go/httpcc v1.0.1 // indirect
	github.com/lestrrat-go/httprc v1.0.5 // indirect
	github.com/lestrrat-go/iter v1.0.2 // indirect
	github.com/lestrrat-go/jwx/v2 v2.0.21 // indirect
	github.com/lestrrat-go/option v1.0.1 // indirect
	github.com/liggitt/tabwriter v0.0.0-20181228230101-89fcab3d43de // indirect
	github.com/lufia/plan9stats v0.0.0-20220913051719-115f729f3c8c // indirect
	github.com/magiconair/properties v1.8.7 // indirect
	github.com/mailru/easyjson v0.7.7 // indirect
	github.com/mattn/go-isatty v0.0.20 // indirect
	github.com/mfridman/interpolate v0.0.2 // indirect
	github.com/miekg/dns v1.1.55 // indirect
	github.com/mitchellh/go-wordwrap v1.0.1 // indirect
	github.com/moby/docker-image-spec v1.3.1 // indirect
	github.com/moby/patternmatcher v0.6.0 // indirect
	github.com/moby/spdystream v0.2.0 // indirect
	github.com/moby/sys/sequential v0.5.0 // indirect
	github.com/moby/sys/user v0.1.0 // indirect
	github.com/moby/sys/userns v0.1.0 // indirect
	github.com/moby/term v0.5.0 // indirect
	github.com/modern-go/concurrent v0.0.0-20180306012644-bacd9c7ef1dd // indirect
	github.com/modern-go/reflect2 v1.0.2 // indirect
	github.com/monochromegane/go-gitignore v0.0.0-20200626010858-205db1a8cc00 // indirect
	github.com/morikuni/aec v1.0.0 // indirect
	github.com/munnerz/goautoneg v0.0.0-20191010083416-a7dc8b61c822 // indirect
	github.com/mxk/go-flowrate v0.0.0-20140419014527-cca7078d478f // indirect
	github.com/opencontainers/go-digest v1.0.0 // indirect
	github.com/opencontainers/image-spec v1.1.0 // indirect
	github.com/patrickmn/go-cache v2.1.0+incompatible // indirect
	github.com/paulmach/orb v0.11.1 // indirect
	github.com/pelletier/go-toml/v2 v2.2.2 // indirect
	github.com/peterbourgon/diskv v2.0.1+incompatible // indirect
	github.com/pierrec/lz4/v4 v4.1.21 // indirect
	github.com/pkg/errors v0.9.1 // indirect
	github.com/power-devops/perfstat v0.0.0-20220216144756-c35f1ee13d7c // indirect
	github.com/pressly/goose/v3 v3.22.1 // indirect
	github.com/prometheus-operator/prometheus-operator/pkg/apis/monitoring v0.64.1 // indirect
	github.com/prometheus/client_model v0.6.1 // indirect
	github.com/prometheus/common v0.59.1 // indirect
	github.com/prometheus/procfs v0.15.1 // indirect
	github.com/redis/go-redis/v9 v9.0.3 // indirect
	github.com/rjeczalik/notify v0.9.3 // indirect
	github.com/russross/blackfriday/v2 v2.1.0 // indirect
	github.com/segmentio/asm v1.2.0 // indirect
	github.com/sethvargo/go-retry v0.3.0 // indirect
	github.com/shirou/gopsutil/v3 v3.24.5 // indirect
	github.com/shoenig/go-m1cpu v0.1.6 // indirect
	github.com/shopspring/decimal v1.4.0 // indirect
	github.com/sirupsen/logrus v1.9.3 // indirect
	github.com/spf13/cobra v1.8.1 // indirect
	github.com/spf13/pflag v1.0.5 // indirect
	github.com/spotahome/redis-operator v1.2.3 // indirect
	github.com/testcontainers/testcontainers-go v0.33.0 // indirect
	github.com/testcontainers/testcontainers-go/modules/clickhouse v0.31.0 // indirect
	github.com/tklauser/go-sysconf v0.3.12 // indirect
	github.com/tklauser/numcpus v0.6.1 // indirect
	github.com/traefik/paerser v0.2.0 // indirect
	github.com/traefik/traefik/v2 v2.10.4 // indirect
	github.com/twitchyliquid64/golang-asm v0.15.1 // indirect
	github.com/ugorji/go/codec v1.2.12 // indirect
	github.com/xlab/treeprint v1.2.0 // indirect
	github.com/yusufpapurcu/wmi v1.2.4 // indirect
	gitlab.com/gitlab-org/opstrace/opstrace/clickhouse-operator v0.0.0-00010101000000-000000000000 // indirect
	gitlab.com/gitlab-org/opstrace/opstrace/tenant-operator v0.0.0-00010101000000-000000000000 // indirect
	go.opentelemetry.io/collector/pdata v1.16.0 // indirect
	go.opentelemetry.io/contrib/instrumentation/net/http/otelhttp v0.55.0 // indirect
	go.opentelemetry.io/contrib/propagators/jaeger v1.26.0 // indirect
	go.opentelemetry.io/otel v1.30.0 // indirect
	go.opentelemetry.io/otel/exporters/otlp/otlpmetric/otlpmetrichttp v1.30.0 // indirect
	go.opentelemetry.io/otel/exporters/otlp/otlptrace v1.30.0 // indirect
	go.opentelemetry.io/otel/exporters/otlp/otlptrace/otlptracehttp v1.30.0 // indirect
	go.opentelemetry.io/otel/exporters/prometheus v0.52.0 // indirect
	go.opentelemetry.io/otel/metric v1.30.0 // indirect
	go.opentelemetry.io/otel/sdk v1.30.0 // indirect
	go.opentelemetry.io/otel/sdk/metric v1.30.0 // indirect
	go.opentelemetry.io/otel/trace v1.30.0 // indirect
	go.opentelemetry.io/proto/otlp v1.3.1 // indirect
	go.starlark.net v0.0.0-20230525235612-a134d8f9ddca // indirect
	go.uber.org/multierr v1.11.0 // indirect
	golang.org/x/arch v0.6.0 // indirect
	golang.org/x/crypto v0.28.0 // indirect
	golang.org/x/exp v0.0.0-20240506185415-9bf2ced13842 // indirect
	golang.org/x/mod v0.19.0 // indirect
	golang.org/x/net v0.29.0 // indirect
	golang.org/x/oauth2 v0.22.0 // indirect
	golang.org/x/sync v0.8.0 // indirect
	golang.org/x/sys v0.26.0 // indirect
	golang.org/x/term v0.25.0 // indirect
	golang.org/x/text v0.19.0 // indirect
	golang.org/x/time v0.7.0 // indirect
	golang.org/x/tools v0.23.0 // indirect
	google.golang.org/genproto/googleapis/api v0.0.0-20240903143218-8af14fe29dc1 // indirect
	google.golang.org/genproto/googleapis/rpc v0.0.0-20240903143218-8af14fe29dc1 // indirect
	google.golang.org/grpc v1.66.2 // indirect
	google.golang.org/protobuf v1.34.2 // indirect
	gopkg.in/inf.v0 v0.9.1 // indirect
	gopkg.in/yaml.v2 v2.4.0 // indirect
	gopkg.in/yaml.v3 v3.0.1 // indirect
	k8s.io/api v0.29.0 // indirect
	k8s.io/apiextensions-apiserver v0.29.0 // indirect
	k8s.io/cli-runtime v0.29.0 // indirect
	k8s.io/component-base v0.29.0 // indirect
	k8s.io/klog/v2 v2.110.1 // indirect
	k8s.io/kube-openapi v0.0.0-20231010175941-2dd684a91f00 // indirect
	k8s.io/kubectl v0.29.0 // indirect
	k8s.io/utils v0.0.0-20230726121419-3b25d923346b // indirect
	sigs.k8s.io/cli-utils v0.34.0 // indirect
	sigs.k8s.io/gateway-api v0.4.1 // indirect
	sigs.k8s.io/json v0.0.0-20221116044647-bc3834ca7abd // indirect
	sigs.k8s.io/kustomize/api v0.13.5-0.20230601165947-6ce0bf390ce3 // indirect
	sigs.k8s.io/kustomize/kyaml v0.14.3 // indirect
	sigs.k8s.io/structured-merge-diff/v4 v4.4.1 // indirect
	sigs.k8s.io/yaml v1.4.0 // indirect
)

// ambiguous import error:
// cloud.google.com/go/compute/metadata: ambiguous import: found package cloud.google.com/go/compute/metadata in multiple modules:
// cloud.google.com/go/compute v1.6.1 (/home/joe/.asdf/installs/golang/1.19.2/packages/pkg/mod/cloud.google.com/go/compute@v1.6.1/metadata)
// cloud.google.com/go/compute/metadata v0.2.1 (/home/joe/.asdf/installs/golang/1.19.2/packages/pkg/mod/cloud.google.com/go/compute/metadata@v0.2.1)
replace cloud.google.com/go => cloud.google.com/go v0.110.0
