{
  "user_intention": "Live Test",
  "language": "javascript",
  "prompt": "function reverseString(str) {",
  "anthropic": {
    "result": "    function reverseString(str) {\n        let newStr = '';\n        for (let i = str.length - 1; i >= 0; i--) {\n            newStr += str[i];\n        }\n        return newStr;\n    }",
    "duration": 1.509707821009215,
    "result_length": 179
  },
  "anthropic_fast": {
    "result": "function reverseString(str) {\n      return str.split('').reverse().join('');\n    }",
    "duration": 1.1712502089940244,
    "result_length": 82,
    "avg_duration": 0.7334669620002388
  },
  "vertex_combined": {
    "result": "function reverseString(str) {\n  var reversed = \"\";\n  for (var i = str.length - 1; i >= 0; i--) {\n    reversed += str[i];\n  }\n  return reversed;\n}",
    "duration": 2.3985960370046087,
    "result_length": 145,
    "avg_duration": 2.4741890600009357
  },
  "vertex_code_bison": {
    "result": "function reverseString(str) {\n  var reversed = \"\";\n  for (var i = str.length - 1; i >= 0; i--) {\n    reversed += str[i];\n  }\n  return reversed;\n}",
    "duration": 2.468556752006407,
    "result_length": 145,
    "avg_duration": 2.2564342292025685
  },
  "vertex_text_bison": {
    "result": "let rev = \"\";\n     for (let i = str.length - 1; i >= 0; i--) {\n         rev += str[i];\n     }\n     return rev;\n }",
    "duration": 0.7098111859959317,
    "result_length": 113,
    "avg_duration": 0.6645998552980018
  },
  "vertex_gecko": {
    "result": ""
  },
  "gitlab_model": {
    "result": "\n  return str.split(\"\").reverse().join(\"\");\n}\n\nreverseString(\"hello\");",
    "duration": 0.8114875920000486,
    "result_length": 70,
    "avg_duration": 0.6206113039996126
  }
}