{
  "anthropic": {
    "result": "// type BankAccount struct {\n    Balance float64\n}",
    "duration": 1.1131274730432779,
    "result_length": 50,
    "average_duration": 1.470356198819354,
    "raw_durations": [
      1.1131274730432779,
      1.2921798879979178,
      1.9034175149863586,
      1.3559308809926733,
      2.1993454720359296,
      1.4186903350055218,
      1.2898030030773953,
      1.2971476670354605,
      1.3634600690566003,
      1.4704596849624068
    ],
    "uuid": "b0a441ca-d11c-424e-8ab7-841868dff3d5"
  },
  "anthropic_fast": {
    "result": "// type BankAccount struct {\n   balance int\n}",
    "duration": 0.49306789599359035,
    "result_length": 45,
    "average_duration": 0.6737495716195554,
    "raw_durations": [
      0.49306789599359035,
      0.6768242219695821,
      0.51017308793962,
      0.8799704960547388,
      0.5919933670666069,
      0.5689314610790461,
      0.9466787889832631,
      0.8050721960607916,
      0.6692254670197144,
      0.5955587340286002
    ],
    "uuid": "40f9d681-ae83-4421-9ca8-d47909d55b8f"
  },
  "vertex_combined": {
    "result": "",
    "uuid": "0eb6c6d5-fb8a-4a70-94af-56b59f31e108"
  },
  "vertex_code_bison": {
    "result": "",
    "uuid": "7a00c890-aee2-45fb-bb39-eaab9652c9cc"
  },
  "vertex_text_bison": {
    "result": "type BankAccount struct {\n\t\tName string\n\t\tBalance float64\n\t}",
    "duration": 0.8270034869201481,
    "result_length": 60,
    "average_duration": 0.781633659475483,
    "raw_durations": [
      0.8270034869201481,
      0.8048341820249334,
      0.8028825300280005,
      0.7974079959094524,
      0.8193814619444311,
      0.7990501039894298,
      0.7623384109465405,
      0.7335998740745708,
      0.7332760869758204,
      0.736562461941503
    ],
    "uuid": "96207f30-0c51-4133-b292-36db9599865a"
  },
  "vertex_gecko": {
    "result": "\n// \tbalance float64\n// \trate    float64\n// }",
    "duration": 1.5046243750257418,
    "result_length": 45,
    "average_duration": 1.4200464167282916,
    "raw_durations": [
      1.5046243750257418,
      1.3825604170560837,
      1.395531165995635,
      1.349093042081222,
      1.282349833054468,
      1.5788524170638993,
      1.496255417005159,
      1.354484208044596,
      1.5831794580444694,
      1.2735338339116424
    ],
    "uuid": "64dff438-8cd2-4b0c-a9a7-99f543cc5ff7"
  },
  "user_intention": "Live Test",
  "language": "golang",
  "prompt": "type BankAccount struct {",
  "gitlab_model": {
    "result": "\n    Balance int\n}\n\nfunc (b *BankAccount) Deposit(amount int) {\n    b.Balance += amount\n}",
    "duration": 0.6292425069841556,
    "result_length": 89,
    "average_duration": 0.5344704192131757,
    "uuid": "05c1a933-968a-4df7-b683-8733a81a70cd"
  }
}