{
  "anthropic": {
    "result": "// class Person { \nconstructor(name, age, address) {\n    this.name = name;\n    this.age = age;\n    this.address = address;\n}\n\nsayHello() {\n    console.log(`Hello! My name is ${this.name}. I'm ${this.age} years old and I live in ${this.address}.`); \n}\n}",
    "duration": 4.448875772068277,
    "result_length": 252,
    "average_duration": 3.2665222069015725,
    "raw_durations": [
      4.448875772068277,
      3.6837421460077167,
      3.1370089299743995,
      2.7994668759638444,
      2.776115996995941,
      3.713603966985829,
      3.5671745020663366,
      3.0494945079553872,
      2.7464320140425116,
      2.7433073569554836
    ],
    "uuid": "2bbfed11-c2ac-4431-b3c4-727fc827ae09"
  },
  "anthropic_fast": {
    "result": "// class Person { \nconstructor(name, age, address) {\n   this.name = name;\n   this.age = age;\n   this.address = address;\n}\n}",
    "duration": 0.7430742230499163,
    "result_length": 123,
    "average_duration": 1.0023591802714185,
    "raw_durations": [
      0.7430742230499163,
      1.0294439380522817,
      1.7189801790518686,
      0.810815870994702,
      1.141649704077281,
      0.9045127540593967,
      0.795237548998557,
      1.17373302008491,
      0.7037853840738535
    ],
    "uuid": "c59c5b25-ea73-452d-bb69-ade7525784b1"
  },
  "vertex_combined": {
    "result": "new Person(\"John Smith\", 25, \"123 Main Street\")",
    "duration": 3.077166825067252,
    "result_length": 47,
    "average_duration": 3.2913076651101516,
    "raw_durations": [
      3.077166825067252,
      3.571738934959285,
      3.5502198709873483,
      2.907518437015824,
      3.0502191859995946,
      3.5037871359381825,
      3.49256638600491,
      3.539541353005916,
      2.929010857013054
    ],
    "uuid": "0ea4836a-f9e7-4581-859a-077d5ed5c11d"
  },
  "vertex_code_bison": {
    "result": "new Person(\"John Smith\", 25, \"123 Main Street\")",
    "duration": 3.012294040992856,
    "result_length": 47,
    "average_duration": 3.225520824175328,
    "raw_durations": [
      3.012294040992856,
      2.9308738010004163,
      2.9498985660029575,
      3.3443761859089136,
      2.9439884240273386,
      3.596611408982426,
      2.933328811894171,
      3.5280056429328397,
      3.5216069479938596,
      3.494224412017502
    ],
    "uuid": "c49d8d9f-4aff-42ad-8c11-5b9d84749d3c"
  },
  "vertex_text_bison": {
    "result": "this.name = name;\n     this.age = age;\n     this.address = address;\n    }\n }",
    "duration": 0.9231227119453251,
    "result_length": 76,
    "average_duration": 0.9151720960973762,
    "raw_durations": [
      0.9231227119453251,
      0.9372778219403699,
      0.9335975500289351,
      0.936668780981563,
      0.8410172950243577,
      0.8614469920285046,
      0.9269984780112281,
      0.9329540639882907,
      0.9285916710505262,
      0.9300455959746614
    ],
    "uuid": "eaa1cc63-a788-4566-bafd-04e704b72fa9"
  },
  "vertex_gecko": {
    "result": " this.name = name; this.age = age; this.address = address; } }\n// let person = new Person('\u5f20\u4e09', 18, '\u5317\u4eac');\n// console.log(person);\n\n// \u5b9e",
    "duration": 1.2899605829734355,
    "result_length": 136,
    "average_duration": 1.3786861125845462,
    "raw_durations": [
      1.2899605829734355,
      1.3448527089785784,
      1.2700197919039056,
      1.2379139999393374,
      1.4487926670117304,
      1.3854240409564227,
      1.3471030000364408,
      1.4432751249987632,
      1.5157715840032324,
      1.5037476250436157
    ],
    "uuid": "e47c4324-816a-4c9b-af41-605e71a20a94"
  },
  "user_intention": "Live Test",
  "language": "javascript",
  "prompt": "class Person { constructor(name, age, address) {",
  "gitlab_model": {
    "result": "\n    this.name = name;\n    this.age = age;\n    this.address = address;\n  }",
    "duration": 0.5693890870024916,
    "result_length": 74,
    "average_duration": 0.6521382432023529,
    "uuid": "c03ca2d1-35ec-4f31-9473-cd5d68157d7c"
  }
}