{
  "user_intention": "Live Test",
  "language": "javascript",
  "prompt": "// Write a program to calculate the sum of all numbers in a given list.",
  "anthropic": {
    "result": "function sum(nums) {\n  let total = 0;\n  for (let i = 0; i < nums.length; i++) {\n    total += nums[i];\n  }\n  return total;\n}",
    "duration": 1.5313401899766177,
    "result_length": 123
  },
  "anthropic_fast": {
    "result": "function sum(list) {\n  let total = 0; \n  for (let i = 0; i < list.length; i++) {\n    total += list[i];  \n  }\n  return total;\n}",
    "duration": 0.8672793379519135,
    "result_length": 126,
    "avg_duration": 0.8677828658896033
  },
  "vertex_combined": {
    "result": "# Initialize a variable to store the sum of all numbers.\nsum = 0\n\n# Iterate through the list of numbers.\nfor number in list_of_numbers:\n\n    # Add the number to the sum variable.\n    sum += number\n\n# After iterating through the entire list, the sum variable will contain the sum of all numbers in the list.\nprint(sum)",
    "duration": 3.092801465012599,
    "result_length": 317,
    "avg_duration": 3.0863251471018884
  },
  "vertex_code_bison": {
    "result": "# Initialize a variable to store the sum.\nsum = 0\n\n# Iterate over the list, adding each number to the sum.\nfor number in list:\n    sum += number\n\n# Print the sum.\nprint(sum)",
    "duration": 3.0986596810398623,
    "result_length": 173,
    "avg_duration": 3.122250085615087
  },
  "vertex_text_bison": {
    "result": "const numbers = [1, 2, 3, 4, 5];\n    const sum = numbers.reduce((a, b) => a + b);\n    console.log(sum);",
    "duration": 0.7077312779729255,
    "result_length": 103,
    "avg_duration": 0.676368954195641
  },
  "vertex_gecko": {
    "result": ""
  },
  "gitlab_model": {
    "result": "```js\nfunction sum(array) {\n  let total = 0;\n  for (let number of array) {\n   ",
    "duration": 0.5812484929920174,
    "result_length": 78,
    "avg_duration": 0.6510383553919382
  }
}