{
  "user_intention": "Live Test",
  "language": "python",
  "prompt": "# Write a program to calculate the average of a list of numbers.",
  "anthropic": {
    "result": "# Write a program to calculate the average of a list of numbers.\nnums = [1, 2, 3, 4, 5]\nsum = 0\nfor num in nums:\n    sum += num\navg = sum / len(nums)\nprint(avg)",
    "duration": 2.944294943998102,
    "result_length": 160,
    "avg_duration": 3.2308350579987746
  },
  "anthropic_fast": {
    "result": "def average(list): \n    return sum(list) / len(list)",
    "duration": 0.6449794360087253,
    "result_length": 52,
    "avg_duration": 0.7770110891025979
  },
  "vertex_combined": {
    "result": "# Initialize a variable to store the sum of the numbers.\nsum = 0\n\n# Iterate through the list of numbers.\nfor number in numbers:\n\n    # Add each number to the sum variable.\n    sum += number\n\n# Divide the sum by the number of numbers in the list.\naverage = sum / len(numbers)\n\n# Print the average.\nprint(average)",
    "duration": 3.869316135009285,
    "result_length": 311,
    "avg_duration": 3.4784406868042423
  },
  "vertex_code_bison": {
    "result": "# Initialize a variable to store the sum of the numbers.\nsum = 0\n\n# Iterate through the list of numbers.\nfor number in numbers:\n\n    # Add each number to the sum variable.\n    sum += number\n\n# Divide the sum by the number of numbers in the list.\naverage = sum / len(numbers)\n\n# Print the average.\nprint(average)",
    "duration": 3.1302528950036503,
    "result_length": 311,
    "avg_duration": 3.424450625007739
  },
  "vertex_text_bison": {
    "result": "def average(nums):\n        \"\"\"\n        Calculates the average of a list of numbers.\n\n        Args:\n            nums: A list of numbers.\n\n        Returns:\n            The average of the numbers in the list.\n        \"\"\"\n        total = 0\n        for num in nums:\n            total += num\n        return total / len(nums)\n\n\nprint(average([1, 2, 3, 4, 5]))",
    "duration": 1.0512664819834754,
    "result_length": 352,
    "avg_duration": 1.2387184296909255
  },
  "vertex_gecko": {
    "result": ""
  },
  "gitlab_model": {
    "result": "```python\ndef average(nums):\n  \"\"\"Calculates the average of a list of numbers.\"\"\"\n  total = sum(nums)\n",
    "duration": 0.6286843300331384,
    "result_length": 102,
    "avg_duration": 0.8749004070064984
  }
}