{
  "anthropic": {
    "result": "type Car struct {\n    Make string\n    Model string\n    Year int\n}",
    "duration": 1.0973386440891773,
    "result_length": 65,
    "average_duration": 1.0456579716061243,
    "raw_durations": [
      1.0973386440891773,
      0.9705353759927675,
      0.9181240069447085,
      1.1475849190028384,
      1.0454074000008404,
      0.9664909339044243,
      0.9701463939854875,
      1.1276503370609134,
      1.1279076570644975,
      1.085394048015587
    ],
    "uuid": "42918caa-912c-40ad-93af-416db8866d5b"
  },
  "anthropic_fast": {
    "result": "type Car struct {\n    Make    string\n    Model   string \n    Year    int\n}",
    "duration": 0.7948943229857832,
    "result_length": 74,
    "average_duration": 1.045085810206365,
    "raw_durations": [
      0.7948943229857832,
      0.7472620770568028,
      0.6020824769511819,
      0.6995936559978873,
      0.8499592810403556,
      2.377819248009473,
      2.3882630550069734,
      0.66704510897398,
      0.6520510889822617,
      0.6718877870589495
    ],
    "uuid": "86c8b176-bc8a-4faa-b161-a9cfdfab100a"
  },
  "vertex_combined": {
    "result": "class Car {\n  private String make;\n  private String model;\n  private int year;\n\n  public Car(String make, String model, int year) {\n    this.make = make;\n    this.model = model;\n    this.year = year;\n  }\n\n  public String getMake() {\n    return make;\n  }\n\n  public void setMake(String make) {\n    this.make = make;\n  }\n\n  public String getModel() {\n    return model;\n  }\n\n  public void setModel(String model) {\n    this.model = model;\n  }\n\n  public int getYear() {\n    return year;\n  }\n\n  public void setYear(int year) {\n    this.year = year;\n  }\n\n  @Override\n  public String toString() {\n    return \"Car{\" +\n      \"make='\" + make + '\\'' +\n      \",",
    "duration": 3.829368054983206,
    "result_length": 647,
    "average_duration": 3.872423256619368,
    "raw_durations": [
      3.829368054983206,
      3.8884972790256143,
      3.8294184390688315,
      3.923680877080187,
      3.9269428020343184,
      3.932823885930702,
      3.8571983829606324,
      3.8340177329955623,
      3.8419369000475854,
      3.860348212067038
    ],
    "uuid": "4e67b93d-2435-4c4d-9dcb-138e017a1024"
  },
  "vertex_code_bison": {
    "result": "class Car {\n  private String make;\n  private String model;\n  private int year;\n\n  public Car(String make, String model, int year) {\n    this.make = make;\n    this.model = model;\n    this.year = year;\n  }\n\n  public String getMake() {\n    return make;\n  }\n\n  public void setMake(String make) {\n    this.make = make;\n  }\n\n  public String getModel() {\n    return model;\n  }\n\n  public void setModel(String model) {\n    this.model = model;\n  }\n\n  public int getYear() {\n    return year;\n  }\n\n  public void setYear(int year) {\n    this.year = year;\n  }\n\n  @Override\n  public String toString() {\n    return \"Car{\" +\n      \"make='\" + make + '\\'' +\n      \",",
    "duration": 3.914618984097615,
    "result_length": 647,
    "average_duration": 3.879109738289844,
    "raw_durations": [
      3.914618984097615,
      3.8380012259585783,
      3.92494937509764,
      3.8565081499982625,
      3.8756226449040696,
      3.930296123959124,
      3.8368611169280484,
      3.914539273013361,
      3.9200872239889577,
      3.7796132649527863
    ],
    "uuid": "4391c18b-e6c1-4318-9f02-f2e9496500dc"
  },
  "vertex_text_bison": {
    "result": "type Car struct {\n  Make string\n  Model string\n  Year int\n}\n```",
    "duration": 0.5346107661025599,
    "result_length": 63,
    "average_duration": 0.8340221786173061,
    "raw_durations": [
      0.5346107661025599,
      1.302643736009486,
      0.5241651739925146,
      0.5233631680021062,
      1.2856674690265208,
      1.3189666020916775,
      1.1450437199091539,
      0.5380615569883958,
      0.5748406150378287,
      0.5928589790128171
    ],
    "uuid": "6de2c297-8734-43e2-bd18-f3cee1e102c4"
  },
  "vertex_gecko": {
    "result": "// Create a class that represents a motorcycle with attributes like make, model, and year.\n// Create a class that represents a truck with attributes like make, model, and year.\n// Create a class that represents a cargo vehicle with attributes like make,",
    "duration": 1.3977230829186738,
    "result_length": 253,
    "average_duration": 1.3963397790677845,
    "raw_durations": [
      1.3977230829186738,
      1.3221235419623554,
      1.4296267499448732,
      1.4199097079690546,
      1.3176267920061946,
      1.475758958957158,
      1.3888899579178542,
      1.3523919580038637,
      1.4710234999656677,
      1.3883235410321504
    ],
    "uuid": "6428e38e-d7be-4c1b-8fa1-c054f24d904d"
  },
  "user_intention": "Live Test",
  "language": "golang",
  "prompt": "// Create a class that represents a car with attributes like make, model, and year.",
  "prompt_type": "generation",
  "gitlab_model": {
    "result": "type Car struct {\n  Make string\n  Model string\n  Year int\n}\n```",
    "duration": 0.5594365290016867,
    "result_length": 63,
    "average_duration": 0.5785703658999409,
    "uuid": "735373a0-b68c-4096-a919-a075504c3d32"
  }
}