{
  "anthropic": {
    "result": "// void count_elements(int numbers[], int numbers_count, int elements[], int elements_count, int counts[]) {\n    int i, j;\n    for (i = 0; i < elements_count; i++) {\n        counts[i] = 0;\n    }\n    for (i = 0; i < numbers_count; i++) {\n        for (j = 0; j < elements_count; j++) {\n            if (numbers[i] == elements[j]) {\n                counts[j]++;\n            }\n        }\n    }\n}",
    "duration": 2.9090027189813554,
    "result_length": 389,
    "average_duration": 3.1288646480767057,
    "raw_durations": [
      2.9090027189813554,
      3.0090921379160136,
      2.9263359749456868,
      3.5688017869833857,
      3.1851643699919805,
      2.886946197017096,
      3.02428096299991,
      2.908987354952842,
      4.072194651933387,
      2.7978403250453994
    ],
    "uuid": "cdd528b0-9a74-47a7-a406-e0c18fa8a60d"
  },
  "anthropic_fast": {
    "result": "void count_elements(int numbers[], int numbers_count, int elements[], int elements_count, int counts[]) {\n     for (int i = 0; i < elements_count; i++) {\n         counts[i] = 0;\n         for (int j = 0; j < numbers_count; j++) {\n             if (elements[i] == numbers[j]) {\n                 counts[i]++;\n             }\n         }\n     }\n}",
    "duration": 1.1315841589821503,
    "result_length": 339,
    "average_duration": 1.21375419665128,
    "raw_durations": [
      1.1315841589821503,
      1.244008851936087,
      1.2656695790356025
    ],
    "uuid": "c4f486d3-f9ea-4c4b-a7c3-84fefa93c013"
  },
  "vertex_combined": {
    "result": "void count_elements(int numbers[], int numbers_count, int elements[], int elements_count, int counts[]) {\n  for (int i = 0; i < elements_count; i++) {\n    counts[i] = 0;\n  }\n\n  for (int i = 0; i < numbers_count; i++) {\n    int index = find_element(elements, elements_count, numbers[i]);\n    if (index != -1) {\n      counts[index]++;\n    }\n  }\n}",
    "duration": 3.8978580930270255,
    "result_length": 344,
    "average_duration": 3.8978580930270255,
    "raw_durations": [
      3.8978580930270255
    ],
    "uuid": "c8a278bb-11fe-4323-8622-e94dd80c0574"
  },
  "vertex_code_bison": {
    "result": "void count_elements(int numbers[], int numbers_count, int elements[], int elements_count, int counts[]) {\n  for (int i = 0; i < elements_count; i++) {\n    counts[i] = 0;\n  }\n\n  for (int i = 0; i < numbers_count; i++) {\n    int index = find_element(elements, elements_count, numbers[i]);\n    if (index != -1) {\n      counts[index]++;\n    }\n  }\n}",
    "duration": 3.768145967973396,
    "result_length": 344,
    "average_duration": 3.768145967973396,
    "raw_durations": [
      3.768145967973396
    ],
    "uuid": "9d83a40e-b0a9-4d45-8522-b5326f403fdf"
  },
  "vertex_text_bison": {
    "result": "void count_elements(int numbers[], int numbers_count, int elements[], int elements_count, int counts[]) {\n        int i, j;\n        for (i = 0; i < elements_count; i++) {\n            counts[i] = 0;\n        }\n        for (i = 0; i < numbers_count; i++) {\n            for (j = 0; j < elements_count; j++) {\n                if (numbers[i] == elements[j]) {\n                    counts[j]++;\n                }\n            }\n        }\n    }",
    "duration": 1.6077972830971703,
    "result_length": 434,
    "average_duration": 1.5727750787278638,
    "raw_durations": [
      1.6077972830971703,
      1.531884349999018,
      1.486766995047219,
      1.5124846909893677,
      1.6275983660016209,
      1.5234398359898478,
      1.6317771690664813,
      1.6152907330542803,
      1.5959349389886484,
      1.5947764250449836
    ],
    "uuid": "06d6c111-8b46-4f72-a7ff-485a2b76b47e"
  },
  "vertex_gecko": {
    "result": "//     int i;\n//     for (i = 0; i < numbers_count; i++) {\n//         counts[numbers[i]]++;\n//     }",
    "duration": 1.5047068339772522,
    "result_length": 100,
    "average_duration": 1.3985399708035402,
    "raw_durations": [
      1.5047068339772522,
      1.3309384579770267,
      1.3491742910118774,
      1.3865667909849435,
      1.3203027499839664,
      1.3471878749551252,
      1.517117292038165,
      1.458385832956992,
      1.324890167103149,
      1.4461294170469046
    ],
    "uuid": "ac9980e8-aa2a-4f27-bc7a-a22e68bd71b5"
  },
  "user_intention": "Live Test",
  "language": "c",
  "prompt": "void count_elements(int numbers[], int numbers_count, int elements[], int elements_count, int counts[]) {",
  "prompt_type": "completion",
  "gitlab_model": {
    "result": "for (int i = 0; i < elements_count; i++) {\n    counts[i] = 0;\n",
    "duration": 0.623283207998611,
    "result_length": 62,
    "average_duration": 0.6512275351909921,
    "uuid": "51b52538-ed3f-4afe-a9c8-a13c3db64240"
  }
}