{
  "anthropic": {
    "result": "// Implement a function to check if a given string is a palindrome.\nint is_palindrome(char *str) {\n    int i = 0;\n    int j = strlen(str) - 1;\n    while (i < j) {\n        if (str[i] != str[j])\n            return 0;\n        i++;\n        j--;\n    }\n    return 1;\n}",
    "duration": 2.327564861974679,
    "result_length": 262,
    "average_duration": 2.3386067803832704,
    "raw_durations": [
      2.327564861974679,
      2.460529899923131,
      2.296454373979941,
      2.4636019840836525,
      2.203502901014872,
      2.254646647023037,
      2.219581346027553,
      2.5247879748931155,
      2.425873234984465,
      2.2095245799282566
    ],
    "uuid": "cebbea5c-b702-4f1c-95a7-d2352f4559c6"
  },
  "anthropic_fast": {
    "result": "#include <stdio.h>\n#include <string.h>\n\nint isPalindrome(char str[]) \n{\n    int i = 0, j = strlen(str)-1;\n      \n    while (i < j) {\n        if (str[i++] != str[j--])\n            return 0;    \n    }\n      \n    return 1;\n}\n\nint main() \n{\n    char str[100];\n      \n    printf(\"Enter a string: \");\n    scanf(\"%s\", str);",
    "duration": 1.3815949009731412,
    "result_length": 316,
    "average_duration": 2.029414634301793,
    "raw_durations": [
      1.3815949009731412,
      1.3925956300226972,
      1.583268160931766,
      1.1099875980289653,
      2.1710954300360754,
      3.1251633290667087,
      1.3538167079677805,
      4.372123381006531,
      1.905090022017248,
      1.8994111829670146
    ],
    "uuid": "80637788-f706-418c-af2a-9378552b1a33"
  },
  "vertex_combined": {
    "result": "def is_palindrome(string):\n  \"\"\"\n  Checks if a given string is a palindrome.\n\n  Args:\n    string: The string to check.\n\n  Returns:\n    True if the string is a palindrome, False otherwise.\n  \"\"\"\n\n  # Reverse the string.\n  reversed_string = string[::-1]\n\n  # Compare the original string to the reversed string.\n  if string == reversed_string:\n    return True\n  else:\n    return False",
    "duration": 3.1804622639901936,
    "result_length": 381,
    "average_duration": 3.102199110784568,
    "raw_durations": [
      3.1804622639901936,
      3.1180726389866322,
      3.0883021670160815,
      3.077593571972102,
      3.083522376953624,
      3.171242373995483,
      3.0954731960082427,
      3.13077342195902,
      3.0317373980069533,
      3.0448116989573464
    ],
    "uuid": "c775f0b7-0f26-453e-ab50-c303f11cda71"
  },
  "vertex_code_bison": {
    "result": "def is_palindrome(string):\n  # Reverse the string.\n  reversed_string = string[::-1]\n\n  # Compare the original string to the reversed string.\n  if string == reversed_string:\n    return True\n  else:\n    return False",
    "duration": 3.1199006049428135,
    "result_length": 213,
    "average_duration": 3.150475457799621,
    "raw_durations": [
      3.1199006049428135,
      3.178665854036808,
      3.1138579139951617,
      3.112035294994712,
      3.179343521944247,
      3.073871033033356,
      3.2609224520856515,
      3.1238883329788223,
      3.17453795298934,
      3.1677316169952974
    ],
    "uuid": "5d3cc1d7-499d-48f8-827f-2899c8463f1d"
  },
  "vertex_text_bison": {
    "result": "int isPalindrome(char str[]) {\n        int n = strlen(str);\n        int i = 0, j = n - 1;\n        while (i < j) {\n            if (str[i] != str[j])\n                return 0;\n            i++;\n            j--;\n        }\n        return 1;\n    }",
    "duration": 0.9177590849576518,
    "result_length": 241,
    "average_duration": 0.9313750673900358,
    "raw_durations": [
      0.9177590849576518,
      0.942671159049496,
      0.9362863259157166,
      0.9339615509379655,
      0.927236343966797,
      0.9525024510221556,
      0.9714295539306477,
      0.9417485650628805,
      0.8945886009605601,
      0.8955670380964875
    ],
    "uuid": "43ece9e6-9322-42b4-a74d-66329816bd95"
  },
  "vertex_gecko": {
    "result": "// Example\n// \"A man, a plan, a canal: Panama\" is a palindrome.",
    "duration": 1.278667499893345,
    "result_length": 63,
    "average_duration": 1.3813181915902533,
    "raw_durations": [
      1.278667499893345,
      1.3210149999940768,
      1.4782944170292467,
      1.3170439160894603,
      1.3308089999482036,
      1.4447484170086682,
      1.5142993750050664,
      1.3462977500166744,
      1.3780650409171358,
      1.4039415000006557
    ],
    "uuid": "4ca73c2d-8105-4d5f-ba50-a26c92007e43"
  },
  "user_intention": "Live Test",
  "language": "c",
  "prompt": "// Implement a function to check if a given string is a palindrome.",
  "prompt_type": "generation",
  "gitlab_model": {
    "result": "def is_palindrome(string):\n  \"\"\"Return True if the given string is a palindrome, False otherwise.\"\"\"\n\n  #",
    "duration": 0.6416194060002454,
    "result_length": 105,
    "average_duration": 0.6147732727928087,
    "uuid": "b7e1f8b3-4ad0-464d-911b-67b4653ec91d"
  }
}