{
  "anthropic": {
    "result": "// struct Rectangle { int length; int width; };\n\nstruct Rectangle { \n    int length; \n    int width; \n};\n\nint area(struct Rectangle rect) {\n    return rect.length * rect.width; \n}\n\nint perimeter(struct Rectangle rect) {\n    return 2 * rect.length + 2 * rect.width;\n}\n\nint main() {\n    struct Rectangle rect = {10, 5};\n    printf(\"Area: %d\\n\", area(rect));\n    printf(\"Perimeter: %d\\n\", perimeter(rect));\n}",
    "duration": 3.3079694600310177,
    "result_length": 405,
    "average_duration": 3.364756573911291,
    "raw_durations": [
      3.3079694600310177,
      3.690975480945781,
      3.3700956139946356,
      3.1860829890938476,
      3.4318530430318788,
      3.4062166549265385,
      3.2990474620601162,
      3.314410194987431,
      3.422001461032778,
      3.2189133790088817
    ],
    "uuid": "f475ebdc-f8fe-4a76-a1f2-a97fab902cad"
  },
  "anthropic_fast": {
    "result": "// struct Rectangle { \nint length;  \nint width; \n};",
    "duration": 0.7387741759885103,
    "result_length": 51,
    "average_duration": 0.889907983985419,
    "raw_durations": [
      0.7387741759885103,
      1.238479480962269,
      0.692470295005478
    ],
    "uuid": "dcb179de-f3ce-4f07-ac20-1fac5d29d439"
  },
  "vertex_combined": {
    "result": "struct Rectangle { int length; int width; };",
    "duration": 3.853520015021786,
    "result_length": 44,
    "average_duration": 3.7688390005147085,
    "raw_durations": [
      3.853520015021786,
      3.7916052690707147,
      3.9114373449701816,
      3.8595868110423908,
      3.849330759025179,
      3.832212161971256,
      3.895399676053785,
      3.071971253026277,
      3.8380326660117134,
      3.7852940489538014
    ],
    "uuid": "d9af17a1-13be-400c-b817-a2954ee05e1f"
  },
  "vertex_code_bison": {
    "result": "struct Rectangle { int length; int width; };",
    "duration": 3.872743578045629,
    "result_length": 44,
    "average_duration": 3.7826955762109717,
    "raw_durations": [
      3.872743578045629,
      3.8501046480378136,
      3.8533263290300965,
      3.923202270991169,
      3.8511210310971364,
      3.8386991570005193,
      3.933816852979362,
      3.849220854928717,
      2.9292570090619847,
      3.9254640309372917
    ],
    "uuid": "0a166fbd-cbe0-4ae1-91fe-e15544dcfe04"
  },
  "vertex_text_bison": {
    "result": "int area(struct Rectangle r) {\n        return r.length * r.width;\n    }",
    "duration": 0.8353926099371165,
    "result_length": 71,
    "average_duration": 0.877196668786928,
    "raw_durations": [
      0.8353926099371165,
      0.8380873900605366,
      0.9000138759147376,
      0.9058816909091547,
      0.8991358379134908,
      0.8950967070413753,
      0.8274766840040684,
      0.8960832620505244,
      0.8953176870709285,
      0.8794809429673478
    ],
    "uuid": "33262a61-330b-4ac7-ab2b-2e62d3e0db78"
  },
  "vertex_gecko": {
    "result": "\n// Rectangle rectangle;\n// rectangle.length = 10;\n// rectangle.width = 15;\n// printf(\"%d\", rectangle.length);",
    "duration": 1.2869570829207078,
    "result_length": 110,
    "average_duration": 1.3382316955947318,
    "raw_durations": [
      1.2869570829207078,
      1.3585085830418393,
      1.2825188749702647,
      1.308252040995285,
      1.2562172079924494,
      1.4003777080215514,
      1.4695133329369128,
      1.3550987500930205,
      1.3524247499881312,
      1.3124486249871552
    ],
    "uuid": "b652a8b9-0547-42d0-b9f8-ba216a46a777"
  },
  "user_intention": "Live Test",
  "language": "c",
  "prompt": "struct Rectangle { int length; int width; };",
  "gitlab_model": {
    "result": "\n\nint main() {\n  Rectangle rectangle;\n  rectangle.length = 10;\n  rectangle.width = 5;\n",
    "duration": 0.5604424210032448,
    "result_length": 86,
    "average_duration": 0.6522653442982118,
    "uuid": "5cfa3fc5-8879-43b7-a882-7f637d41af74"
  }
}