{
  "anthropic": {
    "result": "function calculateSum(numbers) {\n        let sum = 0;\n        for (let i = 0; i < numbers.length; i++) {\n            sum += numbers[i];\n        }\n        return sum;\n    }",
    "duration": 1.7150529000209644,
    "result_length": 171,
    "average_duration": 2.103336107986979,
    "raw_durations": [
      1.7150529000209644,
      2.1024516889592633,
      2.1580252679996192,
      1.6940977029735222,
      1.635802960023284,
      3.494238984072581,
      1.9131541699171066,
      2.1271825609728694,
      1.8539248430170119,
      2.33943000191357
    ],
    "uuid": "ef0ec161-95ed-4a8c-a1a3-c906edf8e665"
  },
  "anthropic_fast": {
    "result": "// function calculateSum(numbers) { \n    let sum = 0;  \n    for (let number of numbers) {\n        sum += number;\n    }\n    return sum;\n}",
    "duration": 0.9627392309485003,
    "result_length": 136,
    "average_duration": 0.9077144392067567,
    "raw_durations": [
      0.9627392309485003,
      0.7980300330091268,
      1.0489754680311307,
      0.8491797249298543,
      0.903441390953958,
      0.8797383250202984,
      1.1578878950094804,
      0.758809517021291,
      0.8649255550699309,
      0.8534172520739958
    ],
    "uuid": "795c7569-af67-4930-9726-cac2c82f1ae8"
  },
  "vertex_combined": {
    "result": "function calculateSum(numbers) {\n  // Initialize the sum to 0.\n  let sum = 0;\n\n  // Iterate over the numbers array.\n  for (let i = 0; i < numbers.length; i++) {\n    // Add the current number to the sum.\n    sum += numbers[i];\n  }\n\n  // Return the sum.\n  return sum;\n}",
    "duration": 2.644338235957548,
    "result_length": 267,
    "average_duration": 2.6355639400077053,
    "raw_durations": [
      2.644338235957548,
      2.665022731060162,
      2.637767708976753,
      2.670383514952846,
      2.630739444983192,
      2.6275862380862236,
      2.6246216259896755,
      2.5781581059563905,
      2.6218651990639046,
      2.6551565950503573
    ],
    "uuid": "a2e50fb4-e530-4354-8a5d-76b9bad71f7f"
  },
  "vertex_code_bison": {
    "result": "function calculateSum(numbers) {\n  // Initialize the sum to 0.\n  let sum = 0;\n\n  // Iterate over the numbers array.\n  for (let i = 0; i < numbers.length; i++) {\n    // Add the current number to the sum.\n    sum += numbers[i];\n  }\n\n  // Return the sum.\n  return sum;\n}",
    "duration": 2.730654940009117,
    "result_length": 267,
    "average_duration": 2.6939524769200944,
    "raw_durations": [
      2.730654940009117,
      2.754372366005555,
      2.7369761210866272,
      2.658146720030345,
      2.668272144976072,
      2.646656092023477,
      2.74424181797076,
      2.655210254015401,
      2.6313775699818507,
      2.7136167431017384
    ],
    "uuid": "2db82125-ef15-44c9-9bf3-c30aeac6e963"
  },
  "vertex_text_bison": {
    "result": "function calculateSum(numbers) {\n      const sum = numbers.reduce((a, b) => a + b);\n      return sum;\n    }",
    "duration": 1.0686489730142057,
    "result_length": 107,
    "average_duration": 1.0075208701076916,
    "raw_durations": [
      1.0686489730142057,
      1.0144171540159732,
      0.9636882670456544,
      1.0128956290427595,
      1.02781172899995,
      1.0581022369442508,
      1.0291266570566222,
      0.9416352839907631,
      1.017005959060043,
      0.9418768119066954
    ],
    "uuid": "3b6e6893-5ebb-4502-9a3f-b025b10131d8"
  },
  "vertex_gecko": {
    "result": "//     let sum = 0;\n//     for (let i = 0; i < numbers.length; i++) {\n//         sum += numbers[i];\n//     }",
    "duration": 1.4307895840611309,
    "result_length": 108,
    "average_duration": 1.3893295582034626,
    "raw_durations": [
      1.4307895840611309,
      1.4021079998929054,
      1.482299582916312,
      1.3824651660397649,
      1.4836019159993157,
      1.2842086250893772,
      1.2892857079859823,
      1.41294316702988,
      1.4588472910691053,
      1.2667465419508517
    ],
    "uuid": "d810fd99-11c4-4113-8a8b-c569ed93e352"
  },
  "user_intention": "Live Test",
  "language": "javascript",
  "prompt": "function calculateSum(numbers) {",
  "prompt_type": "completion",
  "gitlab_model": {
    "result": "let sum = 0;\n  for (let i = 0; i < numbers.length; i++) {\n    sum += numbers[i];\n  }",
    "duration": 0.5485346310015302,
    "result_length": 84,
    "average_duration": 0.6122938726999564,
    "uuid": "0c54db52-a39d-472c-974f-e1d8202b2846"
  }
}