{
  "user_intention": "Live Test",
  "language": "javascript",
  "prompt": "// Create a class for a rectangle with attributes like length and width.",
  "anthropic": {
    "result": "class Rectangle {\n  constructor(length, width) {\n    this.length = length;\n    this.width = width;\n  }\n  \n  getArea() {\n    return this.length * this.width;\n  }\n  \n  getPerimeter() {\n    return 2 * (this.length + this.width);\n  }\n}",
    "duration": 1.8439541109837592,
    "result_length": 231,
    "avg_duration": 1.8935499137907754
  },
  "anthropic_fast": {
    "result": "class Rectangle {\n  constructor(length, width) {\n    this.length = length; \n    this.width = width;\n  }\n}",
    "duration": 0.6977478120243177,
    "result_length": 105,
    "avg_duration": 0.7808777750120498
  },
  "vertex_combined": {
    "result": "class Rectangle {\n\n  // The length of the rectangle.\n  private int length;\n\n  // The width of the rectangle.\n  private int width;\n\n  // Constructs a new rectangle with the given length and width.\n  public Rectangle(int length, int width) {\n    this.length = length;\n    this.width = width;\n  }\n\n  // Gets the length of the rectangle.\n  public int getLength() {\n    return length;\n  }\n\n  // Sets the length of the rectangle.\n  public void setLength(int length) {\n    this.length = length;\n  }\n\n  // Gets the width of the rectangle.\n  public int getWidth() {\n    return width;\n  }\n\n  // Sets the width of the rectangle.\n  public void setWidth(int width) {\n    this.width = width;\n  }\n\n  // Calculates the area of the rectangle.\n  public int getArea() {\n    return length *",
    "duration": 3.813490337051917,
    "result_length": 770,
    "avg_duration": 3.8303838723979426
  },
  "vertex_code_bison": {
    "result": "class Rectangle {\n  // Define the attributes of the rectangle.\n  private int length;\n  private int width;\n\n  // Define the constructor for the rectangle.\n  public Rectangle(int length, int width) {\n    this.length = length;\n    this.width = width;\n  }\n\n  // Define the getters and setters for the attributes of the rectangle.\n  public int getLength() {\n    return this.length;\n  }\n\n  public void setLength(int length) {\n    this.length = length;\n  }\n\n  public int getWidth() {\n    return this.width;\n  }\n\n  public void setWidth(int width) {\n    this.width = width;\n  }\n\n  // Define a method to calculate the area of the rectangle.\n  public int getArea() {\n    return this.length * this.width;\n  }\n\n  // Define a method to calculate the perimeter of the rectangle.\n  public int getPer",
    "duration": 3.9130837119882926,
    "result_length": 783,
    "avg_duration": 3.8345865742885508
  },
  "vertex_text_bison": {
    "result": "class Rectangle {\n        constructor(length, width) {\n            this.length = length;\n            this.width = width;\n        }\n\n        getArea() {\n            return this.length * this.width;\n        }\n\n        getPerimeter() {\n            return 2 * (this.length + this.width);\n        }\n    }",
    "duration": 0.9480213479837403,
    "result_length": 299,
    "avg_duration": 0.9338456147990655
  },
  "vertex_gecko": {
    "result": ""
  },
  "gitlab_model": {
    "result": "```js\nclass Rectangle {\n  constructor(length, width) {\n    this.length = length;\n    this.",
    "duration": 0.601752030022908,
    "result_length": 90,
    "avg_duration": 0.6780620336998254
  }
}