{
  "anthropic": {
    "result": "// int average(int numbers[], int count) {\n    int sum = 0;\n    for (int i = 0; i < count; i++) {\n        sum += numbers[i];\n    }\n    return sum / count; \n}",
    "duration": 1.8048405359731987,
    "result_length": 157,
    "average_duration": 1.7052340142661706,
    "raw_durations": [
      1.8048405359731987,
      1.5610896929865703,
      2.0808370750164613,
      1.6887676969636232,
      1.5927582039730623,
      1.5694069039309397,
      1.7208222119370475,
      1.8395730128977448,
      1.610965737956576,
      1.5832790710264817
    ],
    "uuid": "7dbbe0a4-8acc-44a8-a52a-f4da59112186"
  },
  "anthropic_fast": {
    "result": "// int average(int numbers[], int count) { \n    int total = 0;\n    for (int i = 0; i < count; i++) {\n        total += numbers[i]; \n    }\n    return total / count;\n}",
    "duration": 1.6966019130777568,
    "result_length": 164,
    "average_duration": 1.6966019130777568,
    "raw_durations": [
      1.6966019130777568
    ],
    "uuid": "cacd5cf3-84ee-46b8-9364-c2d29cc66bdf"
  },
  "vertex_combined": {
    "result": "int average(int numbers[], int count) {\n  int sum = 0;\n  for (int i = 0; i < count; i++) {\n    sum += numbers[i];\n  }\n  return sum / count;\n}",
    "duration": 3.774137464002706,
    "result_length": 141,
    "average_duration": 2.4174382045166567,
    "raw_durations": [
      3.774137464002706,
      2.1944581610150635,
      2.1882911870488897,
      2.1737795950612053,
      2.4762386990478262,
      2.229793003993109,
      2.1911014680517837,
      2.2683545930776745,
      2.4108906479086727,
      2.2673372259596363
    ],
    "uuid": "f43d3a9a-6f90-48dd-8c08-66e3ed83c893"
  },
  "vertex_code_bison": {
    "result": "int average(int numbers[], int count) {\n  int sum = 0;\n  for (int i = 0; i < count; i++) {\n    sum += numbers[i];\n  }\n  return sum / count;\n}",
    "duration": 2.195731420069933,
    "result_length": 141,
    "average_duration": 2.5902578375069423,
    "raw_durations": [
      2.195731420069933,
      2.218918867991306,
      3.275839840993285,
      3.458392011001706,
      2.4941652979468927,
      2.443175112013705,
      2.4816884259926155,
      2.4993595430860296,
      2.3580832459265366,
      2.477224610047415
    ],
    "uuid": "d1c6c69f-6157-4b80-8c2c-543444c1a7b4"
  },
  "vertex_text_bison": {
    "result": "```\n    int average(int numbers[], int count) {\n        int sum = 0;\n        for (int i = 0; i < count; i++) {\n            sum += numbers[i];\n        }\n        return sum / count;\n    }\n    ```",
    "duration": 1.0919558320892975,
    "result_length": 193,
    "average_duration": 1.083807762514334,
    "raw_durations": [
      1.0919558320892975,
      1.0959951960248873,
      1.0123909160029143,
      1.017611047020182,
      1.0949004919966683,
      1.0960320520680398,
      1.0968858789419755,
      1.1024898240575567,
      1.1272859079763293,
      1.102530478965491
    ],
    "uuid": "f86fc6ce-a848-4d62-bc41-c03639dd935b"
  },
  "vertex_gecko": {
    "result": "\n//     int sum = 0;\n//     for (int i = 0; i < count; i++) {\n//         sum += numbers[i];\n//     }",
    "duration": 1.3999991670716554,
    "result_length": 100,
    "average_duration": 1.3719419667031616,
    "raw_durations": [
      1.3999991670716554,
      1.3315164590021595,
      1.4305185000412166,
      1.4534156669396907,
      1.3673521659802645,
      1.336050207959488,
      1.424996166024357,
      1.348665582947433,
      1.2668663340155035,
      1.3600394170498475
    ],
    "uuid": "c38a7a0c-57e8-4efc-b5ca-01d611fc1e12"
  },
  "user_intention": "Live Test",
  "language": "c",
  "prompt": "int average(int numbers[], int count) {",
  "gitlab_model": {
    "result": "\n    int sum = 0;\n    for (int i = 0; i < count; i++) {\n        sum += numbers",
    "duration": 0.624125184956938,
    "result_length": 78,
    "average_duration": 0.6598343621881213,
    "uuid": "ef065a1c-c690-4e8f-a297-02cc4a3f449d"
  }
}