{
  "anthropic": {
    "result": "// func countElements(nums []int) map[int]int {\n    counts := make(map[int]int)\n    for _, num := range nums {\n        counts[num]++\n    }\n    return counts\n}",
    "duration": 1.4284586739959195,
    "result_length": 158,
    "average_duration": 1.7283687534159982,
    "raw_durations": [
      1.4284586739959195,
      1.7640129158971831,
      1.9498615210177377,
      1.7950269900029525,
      1.6658727580215782,
      1.6118067180505022,
      1.7078571550082415,
      1.7059149080887437,
      1.7831715390784666,
      1.8717043549986556
    ],
    "uuid": "3c1fd9a9-cbc6-48f5-a803-9bfb94e03cef"
  },
  "anthropic_fast": {
    "result": "",
    "uuid": "39255b2c-9b5e-46b0-b168-6ae03749e247"
  },
  "vertex_combined": {
    "result": "func countElements(nums []int) map[int]int {\n\tcount := make(map[int]int)\n\tfor _, num := range nums {\n\t\tcount[num]++\n\t}\n\treturn count\n}",
    "duration": 2.2020881259813905,
    "result_length": 134,
    "average_duration": 2.307151509902906,
    "raw_durations": [
      2.2020881259813905,
      3.517827287898399,
      2.1386517790379003,
      1.4858337370678782,
      3.9105959800072014,
      2.5848291229922324,
      2.822334600961767,
      1.4065812280168757,
      1.5569050060585141,
      1.445868231006898
    ],
    "uuid": "b7f9c06c-016f-4aeb-947f-1d65b567ca70"
  },
  "vertex_code_bison": {
    "result": "func countElements(nums []int) map[int]int {\n\tresult := make(map[int]int)\n\tfor _, num := range nums {\n\t\tresult[num]++\n\t}\n\treturn result\n}",
    "duration": 2.4511793560814112,
    "result_length": 137,
    "average_duration": 2.1900034837191926,
    "raw_durations": [
      2.4511793560814112,
      2.062550727976486,
      2.1572607179405168,
      1.4424657189520076,
      2.19935696804896,
      3.541850776062347,
      2.132699134061113,
      1.5434574719984084,
      2.0105777620337903,
      2.358636204036884
    ],
    "uuid": "ce25688e-54a4-488e-a237-2232e3c13ac6"
  },
  "vertex_text_bison": {
    "result": "func countElements(nums []int) map[int]int {\n        m := make(map[int]int)\n        for _, v := range nums {\n            m[v]++\n        }\n        res := make(map[int]int)\n        for k, v := range m {\n            if m[k+1] > 0 {\n                res[k+1] = v\n            }\n        }\n        return res\n    }",
    "duration": 1.1093312720768154,
    "result_length": 306,
    "average_duration": 1.129356711707078,
    "raw_durations": [
      1.1093312720768154,
      1.1374172320356593,
      1.135283428011462,
      1.1276315749855712,
      1.1100382099393755,
      1.121044410043396,
      1.1286356240743771,
      1.1569833318935707,
      1.1217352990061045,
      1.1454667350044474
    ],
    "uuid": "9b0448f0-22ca-4043-9c2a-93f295575447"
  },
  "vertex_gecko": {
    "result": "\n// \tm := make(map[int]int)\n// \tfor _, n := range nums {\n// \t\tm[n]++\n// \t}",
    "duration": 1.334660041029565,
    "result_length": 74,
    "average_duration": 1.3611010793130844,
    "raw_durations": [
      1.334660041029565,
      1.3710920420708135,
      1.2703505419194698,
      1.4734555840259418,
      1.268583916942589,
      1.2533695000456646,
      1.4927464589709416,
      1.4749521249905229,
      1.3702843750361353,
      1.3015162080992013
    ],
    "uuid": "6427911b-6cfa-4f6a-ac96-5e76ade6f76c"
  },
  "user_intention": "Live Test",
  "language": "golang",
  "prompt": "func countElements(nums []int) map[int]int {",
  "gitlab_model": {
    "result": "\n\tm := make(map[int]int)\n\tfor _, v := range nums {\n\t\tm[v]++",
    "duration": 0.6479523939779028,
    "result_length": 59,
    "average_duration": 0.6298774203925859,
    "uuid": "014c0fce-91e3-49f0-b3c3-3ac937894154"
  }
}