{
  "anthropic": {
    "result": "# name_to_ages_map = {\n'John': 30,\n'Amy': 12, \n'Lisa': 35\n}",
    "duration": 1.5405757969710976,
    "result_length": 59,
    "average_duration": 1.5988024995313026,
    "raw_durations": [
      1.5405757969710976,
      1.6570292020915076
    ],
    "uuid": "32a54070-e108-4db2-93b8-98cb4a5790f2"
  },
  "anthropic_fast": {
    "result": "# name_to_ages_map = {  \n'John' : 30,  \n'Jane' : 25,\n'Dave' : 32  \n}",
    "duration": 0.8385481659788638,
    "result_length": 68,
    "average_duration": 0.8987474545836449,
    "raw_durations": [
      0.8385481659788638,
      0.7805052519543096,
      0.7715356859844178,
      0.774405775940977,
      0.7800423480803147,
      1.7195077899377793,
      0.8107529659755528,
      0.8041393290041015,
      0.9397314629750326,
      0.7683057700050995
    ],
    "uuid": "876d49c4-ee29-4591-b8b4-15e8f456c2ed"
  },
  "vertex_combined": {
    "result": "name_to_ages_map = {\n    \"Alice\": 20,\n    \"Bob\": 21,\n    \"Carol\": 22,\n}",
    "duration": 1.3676708319690078,
    "result_length": 71,
    "average_duration": 1.6771112880203873,
    "raw_durations": [
      1.3676708319690078,
      1.3959249870385975,
      1.4524934539804235,
      1.578466485021636,
      1.468188152066432,
      1.4845428200205788,
      1.3492864449508488,
      1.489357247017324,
      3.655666694045067,
      1.5295157640939578
    ],
    "uuid": "b4cc3217-778a-429f-9c4c-98bc2e06d9e0"
  },
  "vertex_code_bison": {
    "result": "name_to_ages_map = {\n    \"Alice\": 20,\n    \"Bob\": 21,\n    \"Carol\": 22,\n}",
    "duration": 1.441120287985541,
    "result_length": 71,
    "average_duration": 1.7866686528082938,
    "raw_durations": [
      1.441120287985541,
      1.51426081196405,
      1.4192545040277764,
      1.4219172280281782,
      1.427094706101343,
      1.6906454960117117,
      3.9142484259791672,
      1.3801782140508294,
      2.2373019800288603,
      1.42066487390548
    ],
    "uuid": "9536bedd-1051-4b88-8a54-4227918c708a"
  },
  "vertex_text_bison": {
    "result": "name_to_ages_map = {\n        \"John\": 20,\n        \"Jane\": 21,\n        \"Mary\": 22,\n    }",
    "duration": 0.9571991630364209,
    "result_length": 86,
    "average_duration": 0.9285165093839168,
    "raw_durations": [
      0.9571991630364209,
      0.8721283529885113,
      0.8718658270081505,
      0.8419377850368619,
      0.9728006909135729,
      0.9556615869514644,
      0.9397002760088071,
      0.9634225709596649,
      0.9569750839145854,
      0.9534737570211291
    ],
    "uuid": "1f94ff98-da01-4020-9e6d-a7f5c04d4598"
  },
  "vertex_gecko": {
    "result": "\n#     'John': 25,\n#     'James': 30,\n#     'John': 28,\n#     'James': 32,",
    "duration": 1.3689891659887508,
    "result_length": 74,
    "average_duration": 1.4563080331892706,
    "raw_durations": [
      1.3689891659887508,
      1.4454273750307038,
      1.3759127499070019,
      1.441732709063217,
      1.4400227499427274,
      1.4002300419379026,
      1.4156943750567734,
      1.6160467909649014,
      1.398771291016601,
      1.660253082984127
    ],
    "uuid": "65feeb08-a727-475b-b285-b73801d9bdbd"
  },
  "user_intention": "Live Test",
  "language": "python",
  "prompt": "name_to_ages_map = {",
  "gitlab_model": {
    "result": "\"John\": 20, \"Jane\": 21}\n\nfor name, age in name_to_ages_map.items():\n",
    "duration": 0.6303898789919913,
    "result_length": 68,
    "average_duration": 0.6353794530965388,
    "uuid": "3a3da4ff-30ff-490c-b633-8f95b0bc24b1"
  }
}