{
  "anthropic": {
    "result": "def email_validator(email):\n    import re\n    regex = r'\\b[A-Za-z0-9._%+-]+@[A-Za-z0-9.-]+\\.[A-Z|a-z]{2,}\\b'\n    if re.fullmatch(regex, email):\n        return True\n    else: \n        return False",
    "duration": 2.6666502790758386,
    "result_length": 195,
    "average_duration": 2.5330108190343403,
    "raw_durations": [
      2.6666502790758386,
      2.547850258066319,
      2.384531919960864
    ],
    "uuid": "b74d2192-aea8-43fa-8ef4-015241344039"
  },
  "anthropic_fast": {
    "result": "# def email_validator(email):  \ndef email_validator(email):\n    if len(email) > 7:\n        if email.count(\"@\") == 1: \n            if email.count(\".\") > 0:\n                return True",
    "duration": 0.9992243919987231,
    "result_length": 182,
    "average_duration": 1.560335273097735,
    "raw_durations": [
      0.9992243919987231,
      1.2266481718979776,
      1.0050715160323307,
      1.1314387399470434,
      1.0989248679252341,
      2.117063021985814,
      1.2258320299442858,
      1.0898351920768619,
      1.7474093660712242,
      3.9619054330978543
    ],
    "uuid": "22413d8b-732d-4060-ba3b-00be863830a3"
  },
  "vertex_combined": {
    "result": "def email_validator(email):\n    # Check if the email address is in the correct format.\n    if not \"@\" in email:\n        return False\n    if not \".\" in email:\n        return False\n\n    # Check if the domain name exists.\n    try:\n        domain = email.split(\"@\")[1]\n        socket.gethostbyname(domain)\n    except socket.gaierror:\n        return False\n\n    # Return True if the email address is valid.\n    return True",
    "duration": 2.789550447021611,
    "result_length": 416,
    "average_duration": 2.8475282834959215,
    "raw_durations": [
      2.789550447021611,
      3.019775827997364,
      2.525102106970735,
      2.406096137012355,
      3.9245790080167353,
      2.4217703270260245,
      3.4070770809194073,
      2.361252075061202,
      3.0203278879635036,
      2.5997519369702786
    ],
    "uuid": "eb673284-0c1d-4959-bce4-f84ebcbb7fa3"
  },
  "vertex_code_bison": {
    "result": "def email_validator(email):\n    # Check if the email address is in the correct format.\n    if not \"@\" in email:\n        return False\n    if not \".\" in email:\n        return False\n\n    # Check if the domain name exists.\n    try:\n        domain = email.split(\"@\")[1]\n        socket.gethostbyname(domain)\n    except socket.gaierror:\n        return False\n\n    # Return True if the email address is valid.\n    return True",
    "duration": 2.883043175097555,
    "result_length": 416,
    "average_duration": 2.8898811441962606,
    "raw_durations": [
      2.883043175097555,
      2.8266888689249754,
      2.3900244350079447,
      2.8363839919911698,
      3.084521385957487,
      2.398343014996499,
      3.1015506400726736,
      3.3872314719483256,
      2.9827622399898246,
      3.008262217976153
    ],
    "uuid": "35298f0f-7925-4d01-893f-19ca2eacb58e"
  },
  "vertex_text_bison": {
    "result": "def email_validator(email):\n        \"\"\"\n        Validates an email address.\n\n        Args:\n            email (str): The email address to validate.\n\n        Returns:\n            bool: True if the email address is valid, False otherwise.\n        \"\"\"\n\n        # Check if the email address is in the correct format.\n\n        if not re.match(r\"[^@]+@[^@]+\\.[^@]+\", email):\n            return False\n\n        # Check if the email address is in the blacklist.\n\n        if email in BLACKLIST:\n            return False\n\n        # Check if the email address is in the whitelist.\n\n        if email in WHITELIST:\n            return True\n\n        # Otherwise, the email address is valid.\n\n        return True",
    "duration": 1.5227234879275784,
    "result_length": 694,
    "average_duration": 1.7044380801962689,
    "raw_durations": [
      1.5227234879275784,
      1.4540265300311148,
      1.5173207150073722,
      1.502155172987841,
      3.673278460977599,
      1.4782365009887144,
      1.528072300949134,
      1.4734194030752406,
      1.4592503380263224,
      1.4358978919917718
    ],
    "uuid": "2d266faf-bcb5-470c-8d80-5630d95bf80c"
  },
  "vertex_gecko": {
    "result": "#     if not re.match(r\"(^[a-zA-Z0-9_.+-]+@[a-zA-Z0-9-]+\\.[a-zA-Z0-9-.]+$)\", email):\n#         raise Validation",
    "duration": 1.5449684169143438,
    "result_length": 111,
    "average_duration": 1.4028789873817005,
    "raw_durations": [
      1.5449684169143438,
      1.3824677499942482,
      1.4765045829117298,
      1.3751334589906037,
      1.3279857080196962,
      1.3260577080072835,
      1.4406487080268562,
      1.3189042919548228,
      1.3920740409521386,
      1.4440452080452815
    ],
    "uuid": "134f7f17-3bc9-486f-8ea9-49856f1c0d60"
  },
  "user_intention": "Live Test",
  "language": "python",
  "prompt": "def email_validator(email):",
  "prompt_type": "completion",
  "gitlab_model": {
    "result": "if not re.match(r\"^[a-zA-Z0-9.+_-]+@[a-zA",
    "duration": 0.6475206410395913,
    "result_length": 41,
    "average_duration": 0.6834672492113896,
    "uuid": "7d2b0101-045d-4a32-9ab2-7ad98e84fa9e"
  }
}