{
  "anthropic": {
    "result": "// void remove_duplicates(int list[], int* list_count) {\n    int i, j; \n    for (i = 0; i < *list_count; i++) { \n        for (j = i + 1; j < *list_count; j++) { \n            if (list[i] == list[j]) \n                j++; \n        } \n    } \n  \n    // Shifting all unique elements left \n    int index = 0; \n    for (i = 0; i < *list_count; i++) { \n        if (list[i] != list[index]) \n            list[",
    "duration": 3.5549728609621525,
    "result_length": 399,
    "average_duration": 3.3436553123610793,
    "raw_durations": [
      3.5549728609621525,
      3.3562451960751787,
      2.995112666976638,
      3.441386486054398,
      3.448753349017352,
      3.0559460489312187,
      3.384712344966829,
      3.5121135459048674
    ],
    "uuid": "a65f510d-df41-4ff6-861e-70e4194e9c68"
  },
  "anthropic_fast": {
    "result": "// void remove_duplicates(int list[], int* list_count) { \n   int i, j;\n   for (i = 0; i < *list_count; i++) {\n       for (j = i + 1; j < *list_count; j++) {\n           if (list[i] == list[j]) {\n               *list_count -= 1;  \n               for (int k = j; k < *list_count; k++) {\n                   list[k] = list[k + 1];\n               }\n               j -= 1;",
    "duration": 1.8670382730197161,
    "result_length": 365,
    "average_duration": 1.8670382730197161,
    "raw_durations": [
      1.8670382730197161
    ],
    "uuid": "1098464d-f902-4150-ae4e-8dd224f8ce79"
  },
  "vertex_combined": {
    "result": "void remove_duplicates(int list[], int* list_count) {\n  // Create a new array to store the unique values.\n  int new_list[list_count];\n\n  // Iterate over the original array, and add each unique value to the new array.\n  int i = 0;\n  int j = 0;\n  while (i < list_count) {\n    // Check if the current value is already in the new array.\n    bool is_duplicate = false;\n    for (int k = 0; k < j; k++) {\n      if (new_list[k] == list[i]) {\n        is_duplicate = true;\n        break;\n      }\n    }\n\n    // If the current value is not in the new array, add it.\n    if (!is_duplicate) {\n      new_list[j] = list[i];\n      j++;\n    }\n\n    i++;\n  }\n\n  // Copy the new array back to the",
    "duration": 3.863740312983282,
    "result_length": 675,
    "average_duration": 3.879551874019671,
    "raw_durations": [
      3.863740312983282,
      3.843438402051106,
      3.9248980870470405,
      3.8664779299870133,
      3.8615053499815986,
      3.9299463600618765,
      3.8216283270157874,
      3.924735713051632,
      3.8338366230018437,
      3.9253116350155324
    ],
    "uuid": "d47b1142-3f05-4fbf-9956-5ce123b7215f"
  },
  "vertex_code_bison": {
    "result": "void remove_duplicates(int list[], int* list_count) {\n  // Create a new array to store the unique elements.\n  int new_list[list_count];\n  int new_list_count = 0;\n\n  // Iterate over the original array.\n  for (int i = 0; i < list_count; i++) {\n    // Check if the current element is already in the new array.\n    bool is_duplicate = false;\n    for (int j = 0; j < new_list_count; j++) {\n      if (new_list[j] == list[i]) {\n        is_duplicate = true;\n        break;\n      }\n    }\n\n    // If the current element is not a duplicate, add it to the new array.\n    if (!is_duplicate) {\n      new_list[new_list_count] = list[i];\n      new_list_count++;\n    }\n  }\n\n  // Copy the new array to the",
    "duration": 3.9466763760428876,
    "result_length": 687,
    "average_duration": 3.8626004546065813,
    "raw_durations": [
      3.9466763760428876,
      3.8522217409918085,
      3.7984377569518983,
      3.8466939760837704,
      3.8681728859664872,
      3.8422884109895676,
      3.8543387369718403,
      3.9330019380431622,
      3.7786743600154296,
      3.905498364008963
    ],
    "uuid": "0302510b-e796-41b5-98d3-4793dae5ff5e"
  },
  "vertex_text_bison": {
    "result": "```c\nvoid remove_duplicates(int list[], int* list_count) {\n    int i, j;\n    for (i = 0; i < *list_count; i++) {\n        for (j = i + 1; j < *list_count; j++) {\n            if (list[i] == list[j]) {\n                for (int k = j; k < *list_count - 1; k++) {\n                    list[k] = list[k + 1];\n                }\n                *list_count = *list_count - 1;\n                j--;\n            }\n        }\n    }\n}\n```",
    "duration": 1.6905374239431694,
    "result_length": 423,
    "average_duration": 1.6625149111729116,
    "raw_durations": [
      1.6905374239431694,
      1.6186322199646384,
      1.6961936749285087,
      1.629647484049201,
      1.6962283509783447,
      1.6976379359839484,
      1.6120181820588186,
      1.6049639239208773,
      1.69667784194462,
      1.6826120739569888
    ],
    "uuid": "8b45d915-5e57-4ba2-ae86-9d39cbdeebcd"
  },
  "vertex_gecko": {
    "result": "\n//     int i = 0;\n//     int j = 0;\n//     int k = 0;\n//     int count = 0;",
    "duration": 1.2767100419150665,
    "result_length": 76,
    "average_duration": 1.3695589875918812,
    "raw_durations": [
      1.2767100419150665,
      1.4892385000130162,
      1.3868185000028461,
      1.385479166987352,
      1.3916029169922695,
      1.27254241600167,
      1.3875995420385152,
      1.389310917002149,
      1.388628749991767,
      1.3276591249741614
    ],
    "uuid": "68ddc4ef-87f9-4901-881d-5ec0bf24e067"
  },
  "user_intention": "Live Test",
  "language": "c",
  "prompt": "void remove_duplicates(int list[], int* list_count) {",
  "gitlab_model": {
    "result": "\n  // Check if the list is empty.\n  if (*list_count == 0) {\n    return;\n  }\n\n ",
    "duration": 0.6475519260275178,
    "result_length": 78,
    "average_duration": 0.7061913090059534,
    "uuid": "e0d02944-2c16-4e11-aee1-019bdcdd4acd"
  }
}