{
  "anthropic": {
    "result": "type Account struct {\n    balance float64\n}\n\nfunc (a *Account) Deposit(amount float64) {\n    a.balance += amount\n}\n\nfunc (a *Account) Withdraw(amount float64) {\n    a.balance -= amount\n}\n\nfunc (a *Account) Balance() float64 {\n    return a.balance\n}",
    "duration": 2.1219531989190727,
    "result_length": 248,
    "average_duration": 2.476551217690576,
    "raw_durations": [
      2.1219531989190727,
      2.4388683380093426,
      2.403511094977148,
      2.540405388106592,
      2.491178232943639,
      2.2747688239905983,
      2.5454839740414172,
      2.556272089947015,
      2.6832085279747844,
      2.7098625079961494
    ],
    "uuid": "a333f08a-ac5e-4580-8e9d-d79be546644d"
  },
  "anthropic_fast": {
    "result": "type BankAccount struct {\n    balance float64\n}\n\nfunc (b *BankAccount) Deposit(amount float64) {\n    b.balance += amount \n}\n\nfunc (b *BankAccount) Withdraw(amount float64) {\n    b.balance -= amount\n}\n\nfunc (b *BankAccount) GetBalance() float64 {\n    return b.balance\n}",
    "duration": 1.3512438199250028,
    "result_length": 268,
    "average_duration": 1.7891243409831077,
    "raw_durations": [
      1.3512438199250028,
      1.240265901084058,
      1.2200819199206308,
      1.8380368739599362,
      1.2321225750492886,
      2.861768195987679,
      3.5473806919762865,
      1.554177780984901,
      0.9762729390058666,
      2.0698927119374275
    ],
    "uuid": "d2574ed3-cfba-474b-a145-423050dc5ba4"
  },
  "vertex_combined": {
    "result": "class BankAccount {\n\n  // The account balance.\n  private double balance;\n\n  // The account holder's name.\n  private String name;\n\n  // The account number.\n  private String accountNumber;\n\n  // Constructs a new bank account with the given balance, name, and account number.\n  public BankAccount(double balance, String name, String accountNumber) {\n    this.balance = balance;\n    this.name = name;\n    this.accountNumber = accountNumber;\n  }\n\n  // Deposits the given amount of money into the account.\n  public void deposit(double amount) {\n    this.balance += amount;\n  }\n\n  // Withdraws the given amount of money from the account.\n  public void withdraw(double amount) {\n    this.balance -= amount;\n  }\n\n  // Gets the account balance.\n  public double getBalance() {\n    return this.balance;\n  }\n\n  // Gets the account holder'",
    "duration": 3.7875770279206336,
    "result_length": 825,
    "average_duration": 3.8621943785925397,
    "raw_durations": [
      3.7875770279206336,
      3.822390864021145,
      4.030777505016886,
      3.835844798013568,
      3.822843511006795,
      3.921291018021293,
      3.9014929140685126,
      3.833376462920569,
      3.8459722669795156,
      3.820377417956479
    ],
    "uuid": "f82d2db0-62cc-4dd3-b46a-8b99af592371"
  },
  "vertex_code_bison": {
    "result": "class BankAccount {\n\n  // The account balance.\n  private double balance;\n\n  // The account holder's name.\n  private String name;\n\n  // The account number.\n  private String accountNumber;\n\n  // Constructs a new bank account with the given balance, name, and account number.\n  public BankAccount(double balance, String name, String accountNumber) {\n    this.balance = balance;\n    this.name = name;\n    this.accountNumber = accountNumber;\n  }\n\n  // Deposits the given amount of money into the account.\n  public void deposit(double amount) {\n    this.balance += amount;\n  }\n\n  // Withdraws the given amount of money from the account.\n  public void withdraw(double amount) {\n    this.balance -= amount;\n  }\n\n  // Gets the account balance.\n  public double getBalance() {\n    return this.balance;\n  }\n\n  // Gets the account holder'",
    "duration": 3.910846630926244,
    "result_length": 825,
    "average_duration": 3.8714009738876483,
    "raw_durations": [
      3.910846630926244,
      3.9391578340437263,
      3.8720275099622086,
      3.865370725048706,
      3.921339719905518,
      3.7842848020372912,
      3.850246943999082,
      3.8299372059991583,
      3.8990432149730623,
      3.841755151981488
    ],
    "uuid": "8b0c64d8-d9d7-4adb-a596-ad50481a747b"
  },
  "vertex_text_bison": {
    "result": "type BankAccount struct {\n\tbalance int\n}\n\nfunc (a *BankAccount) Deposit(amount int) {\n\ta.balance += amount\n}\n\nfunc (a *BankAccount) Withdraw(amount int) {\n\ta.balance -= amount\n}\n```",
    "duration": 2.067093099001795,
    "result_length": 181,
    "average_duration": 1.4364738954813219,
    "raw_durations": [
      2.067093099001795,
      1.0861877609277144,
      1.0094890459440649,
      1.0758227969054133,
      2.046927592018619,
      1.014246239908971,
      1.9663609070703387,
      1.048206727951765,
      2.02428754104767,
      1.0261172440368682
    ],
    "uuid": "01fccce6-2d37-4a8b-a369-97be036c71c0"
  },
  "vertex_gecko": {
    "result": "// Create a class for a bank account with methods like deposit and withdraw.\n// Create a class for a bank account with methods like deposit and withdraw.\n// Create a class for a bank account with methods like deposit and withdraw.\n// Create a",
    "duration": 1.4269585829460993,
    "result_length": 242,
    "average_duration": 1.4005041916156187,
    "raw_durations": [
      1.4269585829460993,
      1.3811843330040574,
      1.378806458087638,
      1.4790076250210404,
      1.3510946250753477,
      1.4022433330537751,
      1.364769542007707,
      1.3758430000161752,
      1.3740044579608366,
      1.4711299589835107
    ],
    "uuid": "93b6d952-cd93-4880-82c2-7ec09287b69b"
  },
  "user_intention": "Live Test",
  "language": "golang",
  "prompt": "// Create a class for a bank account with methods like deposit and withdraw.",
  "prompt_type": "generation",
  "gitlab_model": {
    "result": "package main\n\nimport \"fmt\"\n\ntype BankAccount struct {\n\tbalance int\n}\n\nfunc (a *BankAccount",
    "duration": 0.8368349550291896,
    "result_length": 90,
    "average_duration": 0.6473694926011376,
    "uuid": "c1400e75-8dee-4560-be12-d6779265af78"
  }
}