{
  "anthropic": {
    "result": "#include <stdio.h>\n\nint main() {\n    int n;\n    scanf(\"%d\", &n);\n    int arr[n];\n    for (int i = 0; i < n; i++) {\n        scanf(\"%d\", &arr[i]);\n    }\n\n    int first = arr[0], second = arr[1];\n    for (int i = 2; i < n; i++) {\n        if (arr[i] < first) {\n            second = first;\n            first = arr",
    "duration": 3.1199646489694715,
    "result_length": 308,
    "average_duration": 3.5077855582698247,
    "raw_durations": [
      3.1199646489694715,
      4.2448023579781875,
      3.198523871949874,
      3.0903145170304924,
      2.9802347579970956,
      3.167585762916133,
      3.427396062994376,
      2.952161166933365,
      4.073865222977474,
      4.823007212951779
    ],
    "uuid": "76cbdb0a-16e1-4f74-9894-1fbb8703caf2"
  },
  "anthropic_fast": {
    "result": "#include <stdio.h>\n\nint main() {\n   int n, i, first, second;\n   printf(\"Enter number of elements: \");\n   scanf(\"%d\", &n);\n   int arr[n];\n   printf(\"Enter %d elements: \", n);\n   for (i = 0; i < n; i++) {\n      scanf(\"%d\", &arr[i]);  \n   }\n   first = second = arr[0];\n   for (i = 1; i < n; i++) {\n      if (arr[i] < first",
    "duration": 1.2979895409662277,
    "result_length": 319,
    "average_duration": 1.601211114716716,
    "raw_durations": [
      1.2979895409662277,
      1.400349979987368,
      1.3711108940187842,
      1.8646277090301737,
      1.4530561940046027,
      1.9506345189874992,
      1.4450423860689625,
      1.3856687780935317,
      2.5807361400220543,
      1.2628950059879571
    ],
    "uuid": "061eecb3-376e-48a3-b37f-bdb733c764fc"
  },
  "vertex_combined": {
    "result": "# Create a list of numbers\nnumbers = [1, 2, 3, 4, 5]\n\n# Sort the list in ascending order\nnumbers.sort()\n\n# Print the second smallest element\nprint(numbers[1])",
    "duration": 2.7402024450711906,
    "result_length": 158,
    "average_duration": 2.873033159901388,
    "raw_durations": [
      2.7402024450711906,
      2.6565747190034017,
      2.9963609729893506,
      2.6771633819444105,
      2.6942748739384115,
      2.9801065149949864,
      2.662253460031934,
      2.9605298859532923,
      3.0461826720274985,
      3.316682673059404
    ],
    "uuid": "c084d385-2fcc-4159-988b-f4a2e4e2d978"
  },
  "vertex_code_bison": {
    "result": "def find_second_smallest_element(list):\n  \"\"\"Finds the second smallest element in a list.\n\n  Args:\n    list: The list to search.\n\n  Returns:\n    The second smallest element in the list.\n  \"\"\"\n\n  # Sort the list in ascending order.\n  list.sort()\n\n  # The second smallest element will be the second element in the sorted list.\n  return list[1]",
    "duration": 3.157184334937483,
    "result_length": 341,
    "average_duration": 3.1017519420944155,
    "raw_durations": [
      3.157184334937483,
      3.9393216650933027,
      2.6947642050217837,
      2.6176309710135683,
      2.6749390109907836,
      3.856835401034914,
      3.1470767660066485,
      2.8980143659282476,
      3.344438792904839,
      2.687313908012584
    ],
    "uuid": "be3334b4-3c92-492b-906c-ffd955181263"
  },
  "vertex_text_bison": {
    "result": "#include <stdio.h>\n\nint main()\n{\n    int n, i, j, temp;\n    scanf(\" %d \", &n);\n    int arr[n];\n    for (i = 0; i < n; i++)\n    {\n        scanf(\" %d \", &arr[i]);\n    }\n    for (i = 0; i < n; i++)\n    {\n        for (j = i + 1; j < n; j++)\n        {\n            if (arr[i] > arr[j])\n            {\n                temp = arr[i];\n                arr[i] = arr[j];\n                arr[j] = temp;\n            }\n        }\n    }\n    printf(\" %d \", arr[1]);\n    return 0;\n}\n```",
    "duration": 2.075642857933417,
    "result_length": 466,
    "average_duration": 2.030286582990084,
    "raw_durations": [
      2.075642857933417,
      1.9855823540128767,
      2.00506278895773,
      1.9938889290206134,
      2.0558300799457356,
      2.0590197540586814,
      1.9997209019493312,
      2.0680265580303967,
      1.9879888989962637,
      2.0721027069957927
    ],
    "uuid": "e557098e-6ce4-452e-807d-3ae2fdaee4ec"
  },
  "vertex_gecko": {
    "result": "#include <stdio.h>\n\nint main()",
    "duration": 1.4890490000834689,
    "result_length": 30,
    "average_duration": 1.3922316206269898,
    "raw_durations": [
      1.4890490000834689,
      1.4493776250164956,
      1.3561823749914765,
      1.3272671659942716,
      1.4776206250535324,
      1.2953440410783514,
      1.3825923750409856,
      1.3994053329806775,
      1.3751476659672335,
      1.3703300000634044
    ],
    "uuid": "5146a42b-6f63-4841-ae8e-918f2c1900ff"
  },
  "user_intention": "Live Test",
  "language": "c",
  "prompt": "// Write a program to find the second smallest element in a list.",
  "prompt_type": "generation",
  "gitlab_model": {
    "result": "def find_second_smallest(nums):\n    smallest = nums[0]\n    second_small",
    "duration": 0.5743460910161957,
    "result_length": 71,
    "average_duration": 0.6063905018963851,
    "uuid": "d79d4004-4e3a-40f3-b878-a782cea0aa5b"
  }
}