{
  "user_intention": "Live Test",
  "language": "golang",
  "prompt": "type Car struct { make, model string; year int }",
  "anthropic": {
    "result": "type Car struct { \n    make, model string; \n    year int \n}\n\nfunc NewCar(make, model string, year int) *Car {\n    return &Car{\n        make: make,\n        model: model,\n        year: year,\n    }\n}\n\nfunc (c *Car) Make() string {\n    return c.make \n}\n\nfunc (c *Car) Model() string {\n    return c.model \n}\n\nfunc (c *Car) Year() int {\n    return c.year\n}",
    "duration": 2.9000441000098363,
    "result_length": 350,
    "avg_duration": 2.9809104871121237
  },
  "anthropic_fast": {
    "result": "type Car struct { \n    make, model string\n    year int  \n}\n\nfunc main() {\n\n}",
    "duration": 0.670214826008305,
    "result_length": 76,
    "avg_duration": 0.6315297875029501
  },
  "vertex_combined": {
    "result": ""
  },
  "vertex_code_bison": {
    "result": ""
  },
  "vertex_text_bison": {
    "result": "func main() {\n        var c Car\n        c.make = \"Toyota\"\n        c.model = \"Corolla\"\n        c.year = 2023\n        fmt.Println(c)\n    }",
    "duration": 0.935324534017127,
    "result_length": 136,
    "avg_duration": 1.068727924511768
  },
  "vertex_gecko": {
    "result": ""
  },
  "gitlab_model": {
    "result": "```\n\nThis is a struct declaration for a car. It has three fields: make, model, and year.",
    "duration": 0.5877010960248299,
    "result_length": 88,
    "avg_duration": 0.6101405984954908
  }
}