{
  "anthropic": {
    "result": "package main\n\nimport \"fmt\"\n\nfunc main() {\n    nums := []int{1, 1, 2, 3, 3, 3, 4, 4, 4, 4}\n    counts := make(map[int]int)\n\n    for _, num := range nums {\n        counts[num]++\n    }\n\n    for num, count := range counts {\n        fmt.Printf(\"%d occurs %d times\\n\", num, count)\n    }\n}",
    "duration": 3.8843931639567018,
    "result_length": 282,
    "average_duration": 3.854532848612871,
    "raw_durations": [
      3.8843931639567018,
      3.5255323360906914,
      3.225179192959331,
      3.7487887180177495,
      4.477789574069902,
      4.436966734007001,
      4.730617952998728,
      3.550276968977414,
      3.709270282066427,
      3.2565135629847646
    ],
    "uuid": "1722da04-d95a-43b6-8eef-4df51d7f088e"
  },
  "anthropic_fast": {
    "result": "package main\n\nimport \"fmt\"\n\nfunc main() {\n   list := []string{\"a\", \"b\", \"a\", \"c\", \"a\", \"b\"}\n\n   counts := make(map[string]int)\n\n   for _, value := range list {\n       counts[value]++  \n   }\n\n   fmt.Println(counts)\n}",
    "duration": 1.3388971420936286,
    "result_length": 215,
    "average_duration": 1.442329665692523,
    "raw_durations": [
      1.3388971420936286,
      1.108624284970574,
      1.02633599890396,
      1.3845188550185412,
      1.6978217919822782,
      2.050504226004705,
      1.5240598709788173,
      1.0438158930046484,
      2.0856581840198487,
      1.1630604099482298
    ],
    "uuid": "7f6e1157-f166-446a-997d-39db8861aa1c"
  },
  "vertex_combined": {
    "result": "# Create a list of numbers.\nnumbers = [1, 2, 3, 4, 5, 6, 7, 8, 9, 10]\n\n# Create a dictionary to store the results.\nresults = {}\n\n# Iterate over the list.\nfor number in numbers:\n\n    # Check if the number is already in the dictionary.\n    if number not in results:\n        # If it is not in the dictionary, add it to the dictionary with a count of 1.",
    "duration": 3.8346357860136777,
    "result_length": 349,
    "average_duration": 3.846211755799595,
    "raw_durations": [
      3.8346357860136777,
      3.7848760980414227,
      3.911064986954443,
      3.9303407319821417,
      3.867672792985104,
      3.8370547709055245,
      3.8359311290550977,
      3.819501516991295,
      3.788337545003742,
      3.8527022000635043
    ],
    "uuid": "248e6f73-adae-46f4-88ca-4a135d47ff1c"
  },
  "vertex_code_bison": {
    "result": "# Create a list of numbers.\nnumbers = [1, 2, 3, 4, 5, 6, 7, 8, 9, 10]\n\n# Create a dictionary to store the results.\nresults = {}\n\n# Iterate over the list.\nfor number in numbers:\n\n    # Check if the number is already in the dictionary.\n    if number not in results:\n        # If it is not in the dictionary, add it to the dictionary with",
    "duration": 3.9068148869555444,
    "result_length": 335,
    "average_duration": 3.8581052003079095,
    "raw_durations": [
      3.9068148869555444,
      3.8329477419611067,
      3.911390542052686,
      3.8369761540088803,
      3.847277450026013,
      3.9303003530949354,
      3.839716773945838,
      3.7882795279147103,
      3.8347741020843387,
      3.852574471035041
    ],
    "uuid": "fe3b0ca2-22de-4caa-a609-424ac49610c7"
  },
  "vertex_text_bison": {
    "result": "```\npackage main\n\nimport (\n    \"fmt\"\n)\n\nfunc main() {\n    // Create a list of strings.\n    names := []string{\"Alice\", \"Bob\", \"Carol\", \"Alice\", \"Bob\"}\n\n    // Create a map to store the number of occurrences of each element in the list.\n    counts := make(map[string]int)\n\n    // Iterate over the list and increment the count for each element.\n    for _, name := range names {\n        counts[name]++\n    }\n\n    // Print the map.\n    fmt.Println(counts)\n}\n```",
    "duration": 1.9527034709462896,
    "result_length": 456,
    "average_duration": 1.928912604181096,
    "raw_durations": [
      1.9527034709462896,
      1.8352665290003642,
      1.8252290559466928,
      1.9840024469885975,
      1.8324702479876578,
      1.986760820960626,
      1.9967532969312742,
      1.9532502560177818,
      1.9228168210247532,
      1.9998730960069224
    ],
    "uuid": "af24bbf4-95e8-427e-a388-a827750ac7b8"
  },
  "vertex_gecko": {
    "result": "\n\nimport java.util.ArrayList;\nimport java.util.List;",
    "duration": 1.290080041042529,
    "result_length": 52,
    "average_duration": 1.4125740999937988,
    "raw_durations": [
      1.290080041042529,
      1.518658958026208,
      1.377671500085853,
      1.380471916985698,
      1.4846244578948244,
      1.3775628749281168,
      1.3723831670358777,
      1.4773231250001118,
      1.3635908339638263,
      1.4833741249749437
    ],
    "uuid": "73a5fe8a-e772-4d6f-ace9-22cc28510680"
  },
  "user_intention": "Live Test",
  "language": "golang",
  "prompt": "Write a program to count the number of occurrences of each element in a list.",
  "gitlab_model": {
    "result": "```go\npackage main\n\nimport (\n\t\"fmt\"\n)\n\nfunc main() {\n\t// Create a list of strings.\n",
    "duration": 0.6530663309968077,
    "result_length": 83,
    "average_duration": 0.6417818492045626,
    "uuid": "61ad8f51-1cbc-4f0d-8e9b-ffec3cdbbb9a"
  }
}