{
  "anthropic": {
    "result": "def calculate_circle_area(radius):\n    import math\n    area = math.pi * radius ** 2\n    return area",
    "duration": 1.1348749260650948,
    "result_length": 99,
    "average_duration": 1.4063807032071054,
    "raw_durations": [
      1.1348749260650948,
      1.2887205160222948,
      1.660696835955605,
      1.6556927839992568,
      1.2919184539932758
    ],
    "uuid": "3a9f2dbb-f719-4e59-80ca-3cfe3bf9fb6c"
  },
  "anthropic_fast": {
    "result": "# def calculate_circle_area(radius): \ndef calculate_circle_area(radius):\n    return 3.14 * radius * radius",
    "duration": 0.7366007140371948,
    "result_length": 106,
    "average_duration": 0.7059750907646958,
    "raw_durations": [
      0.7366007140371948,
      0.7561006259638816,
      0.686755188042298,
      0.6444438350154087
    ],
    "uuid": "5c0fd172-11ab-4805-8f06-bcffa48df6a2"
  },
  "vertex_combined": {
    "result": "def calculate_circle_area(radius):\n  \"\"\"Calculates the area of a circle.\n\n  Args:\n    radius: The radius of the circle.\n\n  Returns:\n    The area of the circle.\n  \"\"\"\n\n  # Calculate the area of the circle.\n  area = math.pi * radius ** 2\n\n  # Return the area of the circle.\n  return area",
    "duration": 2.012804882018827,
    "result_length": 285,
    "average_duration": 1.9924099713214674,
    "raw_durations": [
      2.012804882018827,
      1.949026984977536,
      2.033421389060095,
      1.9833886160049587,
      1.9824090430047363,
      2.05493890598882,
      1.9812280460027978,
      1.9013897550757974,
      2.0476293130777776,
      1.9778627780033275
    ],
    "uuid": "6b5ac444-8c17-4a08-95e8-cca3a1667404"
  },
  "vertex_code_bison": {
    "result": "def calculate_circle_area(radius):\n  \"\"\"Calculates the area of a circle.\n\n  Args:\n    radius: The radius of the circle.\n\n  Returns:\n    The area of the circle.\n  \"\"\"\n\n  # Calculate the area of the circle.\n  area = math.pi * radius ** 2\n\n  # Return the area of the circle.\n  return area",
    "duration": 1.9667336380807683,
    "result_length": 285,
    "average_duration": 2.0161797163775192,
    "raw_durations": [
      1.9667336380807683,
      1.9844518098980188,
      2.045639307005331,
      2.0671211779117584,
      2.0511197929736227,
      1.9970175590133294,
      2.0537725560134277,
      1.9468703418970108,
      2.064821786014363,
      1.9842491949675605
    ],
    "uuid": "6b5102dc-37d1-4f2d-baf9-ee1c94cc2e53"
  },
  "vertex_text_bison": {
    "result": "```python\ndef calculate_circle_area(radius):\r\n    area = 3.14 * radius * radius\r\n    return area\n    ```",
    "duration": 0.8554642830276862,
    "result_length": 104,
    "average_duration": 0.8585984432022087,
    "raw_durations": [
      0.8554642830276862,
      0.8223746720468625,
      0.8031305409967899,
      0.8857785899890587,
      0.8774856500094756,
      0.9087700820527971,
      0.9236051830230281,
      0.8000726118916646,
      0.8884129680227488,
      0.8208898509619758
    ],
    "uuid": "ecaf6a0e-fc0e-4e09-8e76-5ba8e4c364da"
  },
  "vertex_gecko": {
    "result": "\n#     return 3.14 * radius ** 2\n\n# print(calculate_circle_area(10))",
    "duration": 6.5196848339401186,
    "result_length": 68,
    "average_duration": 1.9952374291955493,
    "raw_durations": [
      6.5196848339401186,
      1.397954749991186,
      1.4541624580742791,
      1.468680249992758,
      1.487218208028935,
      1.582847416982986,
      1.5914770839735866,
      1.4858520409325138,
      1.5619023749604821,
      1.4025948750786483
    ],
    "uuid": "f38aa97e-228a-47f6-8eaf-603077768c84"
  },
  "user_intention": "Live Test",
  "language": "python",
  "prompt": "def calculate_circle_area(radius):",
  "gitlab_model": {
    "result": "\n  \"\"\"Calculates the area of a circle.\n\n  Args:\n    radius: The radius of the circle in meters.\n\n ",
    "duration": 0.635429562011268,
    "result_length": 98,
    "average_duration": 0.6255256984033621,
    "uuid": "baa84002-ee4c-47fc-9a39-c6738da8f0c6"
  }
}