{
  "anthropic": {
    "result": "def is_valid_email(email):\n    import re\n    regex = r'\\b[A-Za-z0-9._%+-]+@[A-Za-z0-9.-]+\\.[A-Z|a-z]{2,}\\b'\n    if re.fullmatch(regex, email):\n        return True\n    else:\n        return False",
    "duration": 2.0733097350457683,
    "result_length": 193,
    "average_duration": 2.2284194138030418,
    "raw_durations": [
      2.0733097350457683,
      2.047343041980639,
      2.1566459990572184,
      2.221998088993132,
      2.1915246520657092,
      2.216651682043448,
      2.5960039159981534,
      2.3708023669896647,
      2.181495242053643
    ],
    "uuid": "b8c9af6a-6382-4028-9346-7f1d462dddb2"
  },
  "anthropic_fast": {
    "result": "def check_email(email):\n    '''\n    Check if email is valid\n    '''\n    # split email into username and domain\n    username, domain = email.split('@')  \n    \n    # check if username has valid characters\n    valid_username = username.replace('.','').replace('-','').isalnum()\n    \n    # check if domain has at least 2 parts\n    domain_parts = domain.split('.')\n    valid_domain = len(domain_parts) >= 2 and all(part.isalnum() for part in domain_parts)\n    \n    # return True if email is valid\n    return valid",
    "duration": 1.6901074859779328,
    "result_length": 508,
    "average_duration": 2.2600052173947915,
    "raw_durations": [
      1.6901074859779328,
      1.2539815190248191,
      3.513473570928909,
      1.364772200002335,
      1.7772195710567757,
      1.3623343410436064,
      3.228213366935961,
      2.6844520189333707,
      2.798008740064688,
      2.9274893599795178
    ],
    "uuid": "dba952c2-8d47-4843-b757-5ed1de464021"
  },
  "vertex_combined": {
    "result": "def is_valid_email(email):\n    if '@' not in email:\n        return False\n\n    parts = email.split('@'",
    "duration": 3.9183589370222762,
    "result_length": 101,
    "average_duration": 3.8875754344691007,
    "raw_durations": [
      3.9183589370222762,
      3.9109296010574326,
      3.8361539480974898,
      3.8344469589646906,
      3.931642182986252,
      3.938563124043867,
      3.8583973799832165,
      3.8193418090231717,
      3.940344969043508
    ],
    "uuid": "f48926b1-4e98-488a-a6bb-cda76c7f416c"
  },
  "vertex_code_bison": {
    "result": "def is_valid_email(email):\n    if '@' not in email:\n        return False\n\n    parts = email.split('@'",
    "duration": 3.9104995880043134,
    "result_length": 101,
    "average_duration": 3.885376622507465,
    "raw_durations": [
      3.9104995880043134,
      3.8639211100526154,
      3.9197137189330533,
      3.8989375069504604,
      3.925072007928975,
      3.8353935290360823,
      3.8856419110670686,
      3.8438336080871522
    ],
    "uuid": "1241594a-232f-42b5-809c-d1d9e339d123"
  },
  "vertex_text_bison": {
    "result": "def is_valid_email(email):\n        \"\"\"\n        Check if a given string is a valid email address.\n\n        Args:\n            email (str): The string to check.\n\n        Returns:\n            bool: True if the string is a valid email address, False otherwise.\n        \"\"\"\n\n        # Check if the string is a valid email address.\n        # The string must contain an @ symbol and a period.\n\n        if \"@\" not in email or \".\" not in email:\n            return False\n\n        # Split the string into the local part and the domain part.\n\n        local_part, domain_part = email.split(\"@\")\n\n        # Check if the local part is valid.\n\n        if not local_part.isalnum():\n            return False\n\n        # Check if the domain part is valid.\n\n        if not domain_part.isalnum():\n            return False\n\n        # The string is a valid email address.\n\n        return True",
    "duration": 2.3628269230248407,
    "result_length": 867,
    "average_duration": 2.364913736912422,
    "raw_durations": [
      2.3628269230248407,
      2.2685668440535665,
      2.3606310130562633,
      2.3666216160636395,
      2.304062334005721,
      2.3705199619289488,
      2.50595237291418,
      2.36703170707915,
      2.382032781955786,
      2.360891815042123
    ],
    "uuid": "e8d2f5e8-e53c-463d-8e0a-d9f0ecb40f86"
  },
  "vertex_gecko": {
    "result": "def is_valid_email(email):\n    if '@' in email:",
    "duration": 1.4234751249896362,
    "result_length": 47,
    "average_duration": 1.4834602374001407,
    "raw_durations": [
      1.4234751249896362,
      1.441312124952674,
      1.3803972500609234,
      1.4799805409274995,
      1.600495291990228,
      1.471945874975063,
      1.5805696670431644,
      1.4067735829157755,
      1.5578485410660505,
      1.4918043750803918
    ],
    "uuid": "1dff7a22-1229-4e7e-8fd8-4c44e7d6acb9"
  },
  "user_intention": "Live Test",
  "language": "python",
  "prompt": "# Implement a function to check if a given string is a valid email address.",
  "prompt_type": "generation",
  "gitlab_model": {
    "result": "def is_valid_email(email):\n  \"\"\"\n  Check if the given string is a valid email address.\n\n  ",
    "duration": 0.5516841239877976,
    "result_length": 90,
    "average_duration": 0.6338337242952548,
    "uuid": "3e519033-bf12-4a32-8483-734262973034"
  }
}