{
  "user_intention": "Live Test",
  "language": "c",
  "prompt": "void sort_numbers_ascending(int numbers[], int count) {",
  "anthropic": {
    "result": "void sort_numbers_ascending(int numbers[], int count) {\n    int i, j, temp;\n    for (i = 0; i < count; i++) {\n        for (j = i + 1; j < count; j++) {\n            if (numbers[i] > numbers[j]) {\n                temp = numbers[i];\n                numbers[i] = numbers[j];\n                numbers[j] = temp;\n            }\n        }\n    }\n}",
    "duration": 2.593667526030913,
    "result_length": 337,
    "avg_duration": 2.6176558088103774
  },
  "anthropic_fast": {
    "result": "void sort_numbers_ascending(int numbers[], int count) {\n   int i, j, temp;\n   for (i = 0; i < count; i++) {\n       for (j = i + 1; j < count; j++) {\n           if (numbers[i] > numbers[j]) {\n               temp = numbers[i];\n               numbers[i] = numbers[j];\n               numbers[j] = temp;\n           }\n       }\n   }\n}",
    "duration": 1.1092725310008973,
    "result_length": 327,
    "avg_duration": 1.495271164010046
  },
  "vertex_combined": {
    "result": "void sort_numbers_ascending(int numbers[], int count) {\n  // Sort the numbers in ascending order.\n  for (int i = 0; i < count - 1; i++) {\n    for (int j = i + 1; j < count; j++) {\n      if (numbers[i] > numbers[j]) {\n        // Swap the numbers if they are not in ascending order.\n        int temp = numbers[i];\n        numbers[i] = numbers[j];\n        numbers[j] = temp;\n      }\n    }\n  }\n}",
    "duration": 2.498698575014714,
    "result_length": 391,
    "avg_duration": 2.5779958063038064
  },
  "vertex_code_bison": {
    "result": "void sort_numbers_ascending(int numbers[], int count) {\n  // Sort the array in ascending order.\n  for (int i = 0; i < count - 1; i++) {\n    for (int j = i + 1; j < count; j++) {\n      if (numbers[i] > numbers[j]) {\n        // Swap the values at indices `i` and `j`.\n        int temp = numbers[i];\n        numbers[i] = numbers[j];\n        numbers[j] = temp;\n      }\n    }\n  }\n}",
    "duration": 2.547808226023335,
    "result_length": 376,
    "avg_duration": 2.6023458291136192
  },
  "vertex_text_bison": {
    "result": "for (int i = 0; i < count - 1; i++) {\n        for (int j = i + 1; j < count; j++) {\n            if (numbers[i] > numbers[j]) {\n                int temp = numbers[i];\n                numbers[i] = numbers[j];\n                numbers[j] = temp;\n            }\n        }\n    }\n}",
    "duration": 1.000209778023418,
    "result_length": 273,
    "avg_duration": 0.9841703134938143
  },
  "vertex_gecko": {
    "result": ""
  },
  "gitlab_model": {
    "result": "\n  for (int i = 0; i < count; i++) {\n    for (int j = i + 1; j",
    "duration": 0.5710364609840326,
    "result_length": 62,
    "avg_duration": 0.6714633324067109
  }
}