{
  "anthropic": {
    "result": "// function isPrime(number) {\n    if (number <= 1) return false;\n    for (let i = 2; i < number; i++) {\n        if (number % i === 0) return false;\n    }\n    return true;\n}",
    "duration": 2.454843867919408,
    "result_length": 172,
    "average_duration": 2.0062224812689236,
    "raw_durations": [
      2.454843867919408,
      1.9946196639211848,
      2.4374445129651576,
      1.8389719489496201,
      2.050150019931607,
      1.6981257890583947,
      1.6965334319975227,
      1.847395073971711,
      2.0101782929850742,
      2.033962210989557
    ],
    "uuid": "cdaa32ba-5a71-4568-893b-d1dc8fefae3d"
  },
  "anthropic_fast": {
    "result": "// function isPrime(number) { \nfunction isPrime(number) {\n    for(let i = 2; i <= Math.sqrt(number); i++) {\n        if(number % i === 0) {\n            return false;\n        }\n    }\n    return number > 1;\n}",
    "duration": 2.227160928887315,
    "result_length": 205,
    "average_duration": 2.7653071616892704,
    "raw_durations": [
      2.227160928887315,
      3.113945674034767,
      2.0190550020197406,
      2.7331525569316,
      1.0851952399825677,
      3.3715344390366226,
      3.6683638610411435,
      2.4484591439832,
      3.0772434680256993,
      3.908961302950047
    ],
    "uuid": "daf073ac-257c-40f6-b8db-c88b692c9528"
  },
  "vertex_combined": {
    "result": "function isPrime(number) {\n  // Check if the number is divisible by 2.\n  if (number % 2 == 0) {\n    return false;\n  }\n\n  // Check if the number is divisible by any number from 3 to the square root of the number.\n  for (var i = 3; i <= Math.sqrt(number); i += 2) {\n    if (number % i == 0) {\n      return false;\n    }\n  }\n\n  // The number is prime if it is not divisible by any number from 2 to the square root of the number.\n  return true;\n}",
    "duration": 2.7817074010381475,
    "result_length": 441,
    "average_duration": 2.8256504907039925,
    "raw_durations": [
      2.7817074010381475,
      3.013349032960832,
      2.7586113159777597,
      2.971750581986271,
      2.786258962005377,
      2.6947282010223716,
      2.7714718320639804,
      2.7706849089590833,
      2.9409913920098916,
      2.7669512790162116
    ],
    "uuid": "cb094c71-1a44-42bd-b767-5740e63a3aa0"
  },
  "vertex_code_bison": {
    "result": "function isPrime(number) {\n  // Check if the number is divisible by 2.\n  if (number % 2 == 0) {\n    return false;\n  }\n\n  // Check if the number is divisible by any number from 3 to the square root of the number.\n  for (var i = 3; i <= Math.sqrt(number); i += 2) {\n    if (number % i == 0) {\n      return false;\n    }\n  }\n\n  // The number is prime if it is not divisible by any number from 2 to the square root of the number.\n  return true;\n}",
    "duration": 2.757968927035108,
    "result_length": 441,
    "average_duration": 2.7512375512043947,
    "raw_durations": [
      2.757968927035108,
      2.6806696839630604,
      2.9162583110155538,
      2.6790058249607682,
      2.780120066017844,
      2.7548824419500306,
      2.8107229369925335,
      2.7653040820732713,
      2.6495529860258102,
      2.7178902520099655
    ],
    "uuid": "721fc4b5-72b0-4118-be3f-d37ef0c0e649"
  },
  "vertex_text_bison": {
    "result": "function isPrime(number) {\n        if (number <= 1) {\n            return false;\n        }\n        for (let i = 2; i <= Math.sqrt(number); i++) {\n            if (number % i === 0) {\n                return false;\n            }\n        }\n        return true;\n    }",
    "duration": 1.206363040022552,
    "result_length": 261,
    "average_duration": 1.2574125952203759,
    "raw_durations": [
      1.206363040022552,
      1.0996087969979271,
      1.1700501480372623,
      1.1806095129577443,
      1.1759856700664386,
      1.255920286057517,
      1.9682500279741362,
      1.2065007500350475,
      1.1187832760624588,
      1.1920544439926744
    ],
    "uuid": "167111ac-fccd-4722-b54f-f67fe2a16b6a"
  },
  "vertex_gecko": {
    "result": "//     for (let i = 2; i < number; i++) {\n//         if (number % i === 0) {\n//             return false;\n//         }",
    "duration": 1.3041302079800516,
    "result_length": 118,
    "average_duration": 1.355606874905061,
    "raw_durations": [
      1.3041302079800516,
      1.350581125007011,
      1.487901790998876,
      1.490689208963886,
      1.3351359999505803,
      1.2530558330472559,
      1.2674470420461148,
      1.3828791250707582,
      1.3957092079799622,
      1.2885392080061138
    ],
    "uuid": "4adce314-3a16-4f5d-b949-730e98a94684"
  },
  "user_intention": "Live Test",
  "language": "javascript",
  "prompt": "function isPrime(number) {",
  "prompt_type": "completion",
  "gitlab_model": {
    "result": "if (number < 2) {\n    return false;\n  }\n  for (let i = 2; i < number; i++) {",
    "duration": 0.6070211030018982,
    "result_length": 76,
    "average_duration": 0.6544475215021521,
    "uuid": "4331311e-8c80-4bbe-b678-5574e6839df3"
  }
}