{
  "anthropic": {
    "result": "def sort_list(nums):\n    nums.sort()\n\nnums = [5, 3, 1, 4, 2]\nsort_list(nums)\nprint(nums)\n# [1, 2, 3, 4, 5]",
    "duration": 1.981743480078876,
    "result_length": 106,
    "average_duration": 1.7965007339112669,
    "raw_durations": [
      1.981743480078876,
      1.9357571320142597,
      1.9677069700555876,
      1.7174107059836388,
      1.920662428950891,
      1.8562342920340598,
      0.9493611170910299,
      2.0183310610009357,
      1.8212994179921225
    ],
    "uuid": "df903dec-524e-4436-8b63-ee442b04abe8"
  },
  "anthropic_fast": {
    "result": "numbers = [5,2,1,8,4]  \n\nnumbers.sort()\n\nprint(numbers)",
    "duration": 0.7167507179547101,
    "result_length": 55,
    "average_duration": 0.9053327298024669,
    "raw_durations": [
      0.7167507179547101,
      0.7099123060470447,
      0.7195255650440231,
      0.7324107410386205,
      2.2000429430045187,
      0.7327841800870374,
      0.7168707440141588,
      0.7197060199687257,
      0.7156737298937514,
      1.0896503509720787
    ],
    "uuid": "f51b495d-f3c5-400a-bb69-d3fe501ae506"
  },
  "vertex_combined": {
    "result": "# Create a list of numbers.\nnumbers = [10, 5, 2, 7, 3]\n\n# Sort the list in ascending order.\nnumbers.sort()\n\n# Print the sorted list.\nprint(numbers)",
    "duration": 2.6687248799717054,
    "result_length": 147,
    "average_duration": 2.6283871560008265,
    "raw_durations": [
      2.6687248799717054,
      2.6085808610077947,
      2.53330128302332,
      2.6278143329545856,
      2.5930936340009794,
      2.6663359340745956,
      2.6027192880865186,
      2.696206326945685,
      2.652363416971639,
      2.634731602971442
    ],
    "uuid": "0bfa2050-4868-4730-b0bd-ae642ed65a61"
  },
  "vertex_code_bison": {
    "result": "# Create a list of numbers.\nnumbers = [10, 5, 2, 7, 3]\n\n# Sort the list in ascending order.\nnumbers.sort()\n\n# Print the sorted list.\nprint(numbers)",
    "duration": 2.6214220540132374,
    "result_length": 147,
    "average_duration": 2.6352078341995364,
    "raw_durations": [
      2.6214220540132374,
      2.608743040007539,
      2.666782201966271,
      2.655759704997763,
      2.6696806689724326,
      2.8034797760192305,
      2.5358576310100034,
      2.5759609290398657,
      2.6091693099588156,
      2.605223026010208
    ],
    "uuid": "910fecc8-d189-4d02-be67-022d1b7f5e04"
  },
  "vertex_text_bison": {
    "result": "def sort_list(nums):\n        nums.sort()\n        return nums\n",
    "duration": 1.525524764903821,
    "result_length": 61,
    "average_duration": 1.5778207321069204,
    "raw_durations": [
      1.525524764903821,
      1.6181191529612988,
      1.6283696840982884,
      1.6237445370061323,
      1.6389848359394819,
      1.5378075051121414,
      1.5890552380587906,
      1.533362707006745,
      1.6125363749451935,
      1.4707025210373104
    ],
    "uuid": "82af4eaf-63fe-4f2e-8053-d9593304e913"
  },
  "vertex_gecko": {
    "result": "def sort_list(l):\n    \"\"\"",
    "duration": 1.4743076249724254,
    "result_length": 25,
    "average_duration": 1.5030369419138878,
    "raw_durations": [
      1.4743076249724254,
      1.4849477079696953,
      1.4329379590926692,
      1.5186930840136483,
      1.5223454589722678,
      1.4780567080015317,
      1.4942842919845134,
      1.5947152089793235,
      1.4848401671042666,
      1.5452412080485374
    ],
    "uuid": "7d86e96a-c4ad-4255-918d-60b368d300c4"
  },
  "user_intention": "Live Test",
  "language": "python",
  "prompt": "# Write a program to sort a list of numbers in ascending order.",
  "prompt_type": "generation",
  "gitlab_model": {
    "result": "def sort_list(nums):\n  # Sort the list in ascending order.\n  nums.sort()\n\n  #",
    "duration": 0.6066709339793306,
    "result_length": 77,
    "average_duration": 0.6267550468997797,
    "uuid": "0c9b3c44-eb9b-4a45-867f-7fd5895b842f"
  }
}