{
  "user_intention": "Live Test",
  "language": "golang",
  "prompt": "type BankAccount struct {",
  "anthropic": {
    "result": "type BankAccount struct {\n    AccountNumber string\n    Balance       float64\n    Name          string\n}",
    "duration": 1.0931752619799227,
    "result_length": 103,
    "avg_duration": 1.2362673712021206
  },
  "anthropic_fast": {
    "result": "type BankAccount struct {\n   balance int\n   accountNumber int\n}",
    "duration": 0.575052461004816,
    "result_length": 63,
    "avg_duration": 0.6594802931125742
  },
  "vertex_combined": {
    "result": ""
  },
  "vertex_code_bison": {
    "result": ""
  },
  "vertex_text_bison": {
    "result": "balance int\n    }",
    "duration": 0.380342731019482,
    "result_length": 17,
    "avg_duration": 0.40005383470561356
  },
  "vertex_gecko": {
    "result": ""
  },
  "gitlab_model": {
    "result": "\n    Balance int\n}\n\nfunc (b *BankAccount) Deposit(amount int) {\n    b.Balance += amount\n}",
    "duration": 0.6292425069841556,
    "result_length": 89,
    "avg_duration": 0.5344704192131757
  }
}