{
  "anthropic": {
    "result": "func isLeapYear(year int) bool {\n    if year%400 == 0 {\n        return true\n    } else if year%100 == 0 {\n        return false\n    } else if year%4 == 0 {\n        return true\n    }\n    return false\n}",
    "duration": 1.8293795209610835,
    "result_length": 199,
    "average_duration": 1.880986807809677,
    "raw_durations": [
      1.8293795209610835,
      1.7119505120208487,
      1.8176962160505354,
      1.909949098015204,
      2.042022717068903,
      1.9991966789821163,
      1.8578048170311376,
      2.03596833802294,
      1.7483686079503968,
      1.8575315719936043
    ],
    "uuid": "6ee84c7d-9dd4-49a0-b9c7-a30b69f1aeb9"
  },
  "anthropic_fast": {
    "result": "func isLeapYear(year int) bool {\n   if year%400 == 0 {\n       return true\n   } \n   if year%100 == 0 {\n       return false\n   }\n   if year%4 == 0{\n       return true\n   }\n   return false\n}",
    "duration": 1.107721479027532,
    "result_length": 187,
    "average_duration": 1.2059962356695906,
    "raw_durations": [
      1.107721479027532,
      1.396837714011781,
      1.1137848389334977,
      1.0623247199691832,
      1.1834263699129224,
      1.5812610710272565,
      1.155046989908442,
      1.1310404760297388,
      0.9688193529145792,
      1.3596993449609727
    ],
    "uuid": "77f54fb6-a4ea-4f3d-8791-5c8c2e8957ce"
  },
  "vertex_combined": {
    "result": "function isLeapYear(year) {\n  if (year % 4 == 0) {\n    if (year % 100 == 0) {\n      return year % 400 == 0;\n    } else {\n      return true;\n    }\n  } else {\n    return false;\n  }\n}",
    "duration": 3.675728879054077,
    "result_length": 180,
    "average_duration": 3.707131590012328,
    "raw_durations": [
      3.675728879054077,
      3.547390452004038,
      3.8547464890871197,
      3.6755571770481765,
      3.895794327952899,
      3.6087801839457825,
      3.691923620994203
    ],
    "uuid": "49563907-6edf-407d-bb35-363537455623"
  },
  "vertex_code_bison": {
    "result": "function isLeapYear(year) {\n  if (year % 4 == 0) {\n    if (year % 100 == 0) {\n      return year % 400 == 0;\n    } else {\n      return true;\n    }\n  } else {\n    return false;\n  }\n}",
    "duration": 3.5807738449657336,
    "result_length": 180,
    "average_duration": 3.660865718353307,
    "raw_durations": [
      3.5807738449657336,
      3.68239074095618,
      3.6681233750423416,
      3.673729740898125,
      3.6851162700913846,
      3.6217323269229382,
      3.6710236449725926,
      3.7040358029771596
    ],
    "uuid": "b447b61b-3d02-496b-9d7b-b1b7a2d808b4"
  },
  "vertex_text_bison": {
    "result": "func isLeapYear(year int) bool {\n        if year%4 == 0 {\n            if year%100 == 0 {\n                if year%400 == 0 {\n                    return true\n                }\n                return false\n            }\n            return true\n        }\n        return false\n    }",
    "duration": 1.3481251049088314,
    "result_length": 277,
    "average_duration": 1.295273651496973,
    "raw_durations": [
      1.3481251049088314,
      1.3743850579485297,
      1.1852872560266405,
      1.3529800950782374,
      1.1773232140112668,
      1.3537199259735644,
      1.1980962000088766,
      1.1884893840178847,
      1.5275693360017613,
      1.246760940994136
    ],
    "uuid": "cb43113d-9a02-45b2-91f9-775b0cbe2b36"
  },
  "vertex_gecko": {
    "result": "// Note that a year is a leap year if it is divisible by 4 but not by 100, or it is divisible by 400.\n\n// Hints:",
    "duration": 1.4625330829294398,
    "result_length": 112,
    "average_duration": 1.4333441041992045,
    "raw_durations": [
      1.4625330829294398,
      1.4633169169537723,
      1.4811343329492956,
      1.3613196660298854,
      1.4891147500602528,
      1.4442274579778314,
      1.3977970419218764,
      1.4867956670932472,
      1.3779209170024842,
      1.3692812090739608
    ],
    "uuid": "9bbf53fe-3120-4400-9589-3a6ed133efed"
  },
  "user_intention": "Live Test",
  "language": "golang",
  "prompt": "// Implement a function to check if a given year is a leap year.",
  "prompt_type": "generation",
  "gitlab_model": {
    "result": "func isLeapYear(year int) bool {\n  return year%4 == 0 && (year%100 != ",
    "duration": 0.6116494589950889,
    "result_length": 70,
    "average_duration": 0.637183613202069,
    "uuid": "9d9618d2-fae2-4406-beb2-3fdc3b2da1b0"
  }
}