{
  "anthropic": {
    "result": "class Rectangle {\n  constructor(length, width) {\n    this.length = length;\n    this.width = width;\n  }\n  \n  getArea() {\n    return this.length * this.width;\n  }\n  \n  getPerimeter() {\n    return 2 * this.length + 2 * this.width;\n  }\n}",
    "duration": 2.3612737130606547,
    "result_length": 233,
    "average_duration": 3.094614864210598,
    "raw_durations": [
      2.3612737130606547,
      1.914534121984616,
      2.0205934470286593,
      2.468742166995071,
      2.752958373981528,
      4.818670230917633,
      2.563846437027678,
      2.766083320020698,
      4.490959160029888,
      4.788487671059556
    ],
    "uuid": "6fdc3f03-4acd-4c99-b274-286b4f38b991"
  },
  "anthropic_fast": {
    "result": "class Rectangle {\n  constructor(length, width) {\n    this.length = length;\n    this.width = width;\n  }\n}",
    "duration": 1.2201390550471842,
    "result_length": 104,
    "average_duration": 1.267071640107315,
    "raw_durations": [
      1.2201390550471842,
      0.9421389700146392,
      0.8053465950069949,
      0.7690523579949513,
      1.5273969969712198,
      0.697619058075361,
      0.7909020750084892,
      0.7329802729655057,
      3.708573504933156,
      1.476567515055649
    ],
    "uuid": "06626f1d-e927-43e2-82a0-5283568980f8"
  },
  "vertex_combined": {
    "result": "class Rectangle {\n\n  // The length of the rectangle.\n  private int length;\n\n  // The width of the rectangle.\n  private int width;\n\n  // Constructs a new rectangle with the given length and width.\n  public Rectangle(int length, int width) {\n    this.length = length;\n    this.width = width;\n  }\n\n  // Gets the length of the rectangle.\n  public int getLength() {\n    return length;\n  }\n\n  // Sets the length of the rectangle.\n  public void setLength(int length) {\n    this.length = length;\n  }\n\n  // Gets the width of the rectangle.\n  public int getWidth() {\n    return width;\n  }\n\n  // Sets the width of the rectangle.\n  public void setWidth(int width) {\n    this.width = width;\n  }\n\n  // Calculates the area of the rectangle.\n  public int getArea() {\n    return length *",
    "duration": 3.840280561009422,
    "result_length": 770,
    "average_duration": 3.8829166359966623,
    "raw_durations": [
      3.840280561009422,
      3.9242110699415207,
      3.8391658330801874,
      3.94594932498876,
      3.8269733251072466,
      3.9375456179259345,
      3.805376540054567,
      3.9060829379595816,
      3.939549333998002,
      3.8640318159013987
    ],
    "uuid": "7e603622-3bf0-4ac8-94f1-1c6cdbc01d05"
  },
  "vertex_code_bison": {
    "result": "class Rectangle {\n\n  // The length of the rectangle.\n  private int length;\n\n  // The width of the rectangle.\n  private int width;\n\n  // Constructs a new rectangle with the given length and width.\n  public Rectangle(int length, int width) {\n    this.length = length;\n    this.width = width;\n  }\n\n  // Gets the length of the rectangle.\n  public int getLength() {\n    return length;\n  }\n\n  // Sets the length of the rectangle.\n  public void setLength(int length) {\n    this.length = length;\n  }\n\n  // Gets the width of the rectangle.\n  public int getWidth() {\n    return width;\n  }\n\n  // Sets the width of the rectangle.\n  public void setWidth(int width) {\n    this.width = width;\n  }\n\n  // Calculates the area of the rectangle.\n  public int getArea() {\n    return length *",
    "duration": 3.782594899996184,
    "result_length": 770,
    "average_duration": 3.8633143628016113,
    "raw_durations": [
      3.782594899996184,
      3.821561362943612,
      3.8579142990056425,
      3.8711636090883985,
      3.9272954569896683,
      3.8380365750053898,
      3.8284757420187816,
      3.937528091017157,
      3.837979838019237,
      3.930593753932044
    ],
    "uuid": "7603ace5-8cca-4ef6-950b-fa13e419b151"
  },
  "vertex_text_bison": {
    "result": "class Rectangle {\n        constructor(length, width) {\n            this.length = length;\n            this.width = width;\n        }\n\n        getArea() {\n            return this.length * this.width;\n        }\n\n        getPerimeter() {\n            return 2 * (this.length + this.width);\n        }\n    }",
    "duration": 1.2230659049237147,
    "result_length": 299,
    "average_duration": 1.2153809390962125,
    "raw_durations": [
      1.2230659049237147,
      1.1718989500077441,
      1.2463190869893879,
      1.1690338819753379,
      1.1715011779451743,
      1.197325045010075,
      1.2357492190785706,
      1.173905010917224,
      1.3257795290555805,
      1.239231585059315
    ],
    "uuid": "478d910d-ece8-4a2b-bdb3-8743cfa9f302"
  },
  "vertex_gecko": {
    "result": "class Rectangle {\n  constructor(length, width) {\n    this.length = length;",
    "duration": 1.3539259999524802,
    "result_length": 74,
    "average_duration": 1.3632980253081768,
    "raw_durations": [
      1.3539259999524802,
      1.3324275420745835,
      1.3237685000058264,
      1.3739789590472355,
      1.3234524170402437,
      1.2919567920034751,
      1.496321416925639,
      1.3287514169933274,
      1.4346135000232607,
      1.3737837090156972
    ],
    "uuid": "4edc2145-023b-45e7-b4b1-5ede67387712"
  },
  "user_intention": "Live Test",
  "language": "javascript",
  "prompt": "// Create a class for a rectangle with attributes like length and width.",
  "prompt_type": "generation",
  "gitlab_model": {
    "result": "class Rectangle {\n  constructor(length, width) {\n    this.length = length;\n    this.",
    "duration": 0.601752030022908,
    "result_length": 84,
    "average_duration": 0.6780620336998254,
    "uuid": "a678e3c0-db2c-4480-b67b-a1c9127f8753"
  }
}