{
  "anthropic": {
    "result": "struct Rectangle {\n    int length;\n    int width;\n};",
    "duration": 1.1182476300746202,
    "result_length": 52,
    "average_duration": 1.0676550901029258,
    "raw_durations": [
      1.1182476300746202,
      0.9264084380120039,
      1.3238985730567947,
      1.116085254936479,
      1.0182852799771354,
      1.0251192470313981,
      0.9833581709535792,
      1.0292920609936118,
      1.0355869659688324,
      1.1002692800248042
    ],
    "uuid": "bd3f8574-14c4-4f23-8c26-3e3e9fc9316c"
  },
  "anthropic_fast": {
    "result": "typedef struct Rectangle{\n   int length;\n   int width;  \n}Rectangle;",
    "duration": 0.6583030530018732,
    "result_length": 68,
    "average_duration": 1.1952241844148375,
    "raw_durations": [
      0.6583030530018732,
      0.7143536490621045,
      1.9503086910117418,
      1.4040970699861646,
      1.3022389800753444,
      0.9132529030321166,
      0.816883280989714,
      1.8248172929743305,
      1.1631749300286174,
      1.2048119939863682
    ],
    "uuid": "6923be26-3bb1-4170-9c4a-01a6f52aa2e2"
  },
  "vertex_combined": {
    "result": "class Rectangle {\n\n  // The length of the rectangle.\n  private int length;\n\n  // The width of the rectangle.\n  private int width;\n\n  // Constructs a new rectangle with the given length and width.\n  public Rectangle(int length, int width) {\n    this.length = length;\n    this.width = width;\n  }\n\n  // Gets the length of the rectangle.\n  public int getLength() {\n    return length;\n  }\n\n  // Sets the length of the rectangle.\n  public void setLength(int length) {\n    this.length = length;\n  }\n\n  // Gets the width of the rectangle.\n  public int getWidth() {\n    return width;\n  }\n\n  // Sets the width of the rectangle.\n  public void setWidth(int width) {\n    this.width = width;\n  }\n\n  // Calculates the area of the rectangle.\n  public int getArea() {\n    return length *",
    "duration": 3.8201064449967816,
    "result_length": 770,
    "average_duration": 3.8881333422847093,
    "raw_durations": [
      3.8201064449967816,
      3.9303710269741714,
      3.9223735940176994,
      3.7755156389903277,
      3.8770942429546267,
      3.9190321809146553,
      3.833418534952216,
      3.93396501801908,
      3.927544142003171,
      3.941912599024363
    ],
    "uuid": "81974f4c-4fe2-4413-a632-132b189338f7"
  },
  "vertex_code_bison": {
    "result": "class Rectangle {\n\n  // The length of the rectangle.\n  private int length;\n\n  // The width of the rectangle.\n  private int width;\n\n  // Constructs a new rectangle with the given length and width.\n  public Rectangle(int length, int width) {\n    this.length = length;\n    this.width = width;\n  }\n\n  // Gets the length of the rectangle.\n  public int getLength() {\n    return length;\n  }\n\n  // Sets the length of the rectangle.\n  public void setLength(int length) {\n    this.length = length;\n  }\n\n  // Gets the width of the rectangle.\n  public int getWidth() {\n    return width;\n  }\n\n  // Sets the width of the rectangle.\n  public void setWidth(int width) {\n    this.width = width;\n  }\n\n  // Calculates the area of the rectangle.\n  public int getArea() {\n    return length *",
    "duration": 3.7773506270023063,
    "result_length": 770,
    "average_duration": 3.870333513291553,
    "raw_durations": [
      3.7773506270023063,
      3.771421917947009,
      3.89558282494545,
      3.869764442089945,
      3.90836847294122,
      3.8781768480548635,
      3.9532801869791,
      3.905671213986352,
      3.7948649619938806,
      3.9488536369754
    ],
    "uuid": "a04d0700-31f2-4fe1-8689-6a8bd3759f53"
  },
  "vertex_text_bison": {
    "result": "```c\n#include <stdio.h>\n\n// Define a class for a rectangle\nclass Rectangle {\n  // Define the attributes of the rectangle\n  public:\n    int length;\n    int width;\n\n  // Define the constructor for the rectangle\n  public:\n    Rectangle(int length, int width) {\n      this->length = length;\n      this->width = width;\n    }\n\n  // Define the method to calculate the area of the rectangle\n  public:\n    int getArea() {\n      return this->length * this->width;\n    }\n};\n\n// Define the main function\nint main() {\n  // Create a rectangle object\n  Rectangle rectangle(10, 5);\n\n  // Print the area of the rectangle\n  printf(\"The area of the rectangle is %d\\n\", rectangle.getArea());\n\n  return 0;\n}\n```",
    "duration": 2.043546185013838,
    "result_length": 690,
    "average_duration": 2.144302297802642,
    "raw_durations": [
      2.043546185013838,
      2.2859255759976804,
      2.0776422190247104,
      2.380411222926341,
      2.292775688925758,
      2.2952243720646948,
      2.0838893100153655,
      2.0119670249987394,
      1.994390583015047,
      1.9772507960442454
    ],
    "uuid": "5599e756-3310-4f84-8337-6ca3ca7e2671"
  },
  "vertex_gecko": {
    "result": "\n\npublic class Rectangle {\n    double length;\n    double width;",
    "duration": 1.3987573749618605,
    "result_length": 63,
    "average_duration": 1.4173397122882307,
    "raw_durations": [
      1.3987573749618605,
      1.484267249936238,
      1.388647917076014,
      1.2848047079751268,
      1.4235527080018073,
      1.4440287080360577,
      1.4931717499857768,
      1.3183099159505218,
      1.4531684999819845,
      1.4846882909769192
    ],
    "uuid": "f9534f1e-a8a1-4d03-8605-3584b2e2b862"
  },
  "user_intention": "Live Test",
  "language": "c",
  "prompt": "Create a class for a rectangle with attributes like length and width.",
  "gitlab_model": {
    "result": "```python\nclass Rectangle:\n\n    def __init__(self, length, width):\n        self.length = length\n        self.width",
    "duration": 0.6233276749844663,
    "result_length": 114,
    "average_duration": 0.5985931532864924,
    "uuid": "5880e794-2cf1-4fcf-8fc5-29ac5e76f222"
  }
}