{
  "user_intention": "Live Test",
  "language": "python",
  "prompt": "# Create a class for a basic calculator that can perform addition, subtraction, multiplication, and division.",
  "anthropic": {
    "result": "class Calculator:\n    def __init__(self):\n        pass\n\n    def add(self, a, b):\n        return a + b\n\n    def subtract(self, a, b):\n        return a - b\n\n    def multiply(self, a, b):\n        return a * b\n\n    def divide(self, a, b):\n        return a / b",
    "duration": 2.2063582910050172,
    "result_length": 255,
    "avg_duration": 2.57990055650007
  },
  "anthropic_fast": {
    "result": "# Create a class for a basic calculator that can perform addition, subtraction, multiplication, and division.\n\nclass Calculator:\n    def __init__(self):\n        pass\n    \n    def add(self, x, y):\n        return x + y\n    \n    def subtract(self, x, y):\n        return x - y\n    \n    def multiply(x, y): \n        return x * y\n    \n    def divide(x, y):\n        return x / y",
    "duration": 1.092375690001063,
    "result_length": 371,
    "avg_duration": 1.1257100584974977
  },
  "vertex_combined": {
    "result": "class Calculator:\n\n    def __init__(self):\n        self.number1 = 0\n        self.number2 = 0\n\n    def add(self, number1, number2):\n        self.number1 = number1\n        self.number2 = number2\n        self.result = number1 + number2\n\n    def subtract(self, number1, number2):\n        self.number1 = number1\n        self.number2 = number2\n        self.result = number1 - number2\n\n    def multiply(self, number1, number2):\n        self.number1 = number1\n        self.number2 = number2\n        self.result = number1 * number2\n\n    def divide(self, number1, number2):\n        self.number1 = number1\n        self.number2 = number2\n        self.result = number1 / number2\n\n    def get_result(self):\n        return self.result",
    "duration": 3.912456515012309,
    "result_length": 719,
    "avg_duration": 3.8274158442975024
  },
  "vertex_code_bison": {
    "result": "class Calculator:\n\n    def __init__(self):\n        self.number1 = 0\n        self.number2 = 0\n\n    def add(self, number1, number2):\n        self.number1 = number1\n        self.number2 = number2\n        self.result = number1 + number2\n\n    def subtract(self, number1, number2):\n        self.number1 = number1\n        self.number2 = number2\n        self.result = number1 - number2\n\n    def multiply(self, number1, number2):\n        self.number1 = number1\n        self.number2 = number2\n        self.result = number1 * number2\n\n    def divide(self, number1, number2):\n        self.number1 = number1\n        self.number2 = number2\n        self.result = number1 / number2\n\n    def get_result(self):\n        return self.result",
    "duration": 3.8234911329927854,
    "result_length": 719,
    "avg_duration": 3.805956489703385
  },
  "vertex_text_bison": {
    "result": "```python\nclass Calculator:\n\n    def __init__(self):\n        self.result = 0\n\n    def add(self, num):\n        self.result += num\n\n    def subtract(self, num):\n        self.result -= num\n\n    def multiply(self, num):\n        self.result *= num\n\n    def divide(self, num):\n        self.result /= num\n\n    def get_result(self):\n        return self.result\n\n```",
    "duration": 1.1697479410213418,
    "result_length": 356,
    "avg_duration": 1.1666435030056164
  },
  "vertex_gecko": {
    "result": ""
  },
  "gitlab_model": {
    "result": "```python\nclass Calculator:\n\n    def __init__(self):\n        self.result = 0\n\n    def add(self,",
    "duration": 0.629961316997651,
    "result_length": 95,
    "avg_duration": 0.6055016869999236
  }
}