{
  "user_intention": "Live Test",
  "language": "python",
  "prompt": "# Write a program to sort a list of numbers in ascending order.",
  "anthropic": {
    "result": "def sort_list(nums):\n    nums.sort()\n\nnums = [5, 3, 1, 4, 2]\nsort_list(nums)\nprint(nums)\n# [1, 2, 3, 4, 5]",
    "duration": 2.7614737820113078,
    "result_length": 106,
    "avg_duration": 2.2908058840985177
  },
  "anthropic_fast": {
    "result": "numbers = [5,2,1,8,4]  \n\nnumbers.sort()\n\nprint(numbers)",
    "duration": 0.7175465960172005,
    "result_length": 55,
    "avg_duration": 0.9135922787041636
  },
  "vertex_combined": {
    "result": "# Create a list of numbers.\nnumbers = [10, 5, 2, 7, 3]\n\n# Sort the list in ascending order.\nnumbers.sort()\n\n# Print the sorted list.\nprint(numbers)",
    "duration": 2.644935329997679,
    "result_length": 147,
    "avg_duration": 2.605940796199138
  },
  "vertex_code_bison": {
    "result": "# Create a list of numbers.\nnumbers = [10, 5, 2, 7, 3]\n\n# Sort the list in ascending order.\nnumbers.sort()\n\n# Print the sorted list.\nprint(numbers)",
    "duration": 2.549307820008835,
    "result_length": 147,
    "avg_duration": 2.5985807476041374
  },
  "vertex_text_bison": {
    "result": "def sort_list(nums):\n        nums.sort()\n        return nums\n",
    "duration": 1.3141901940107346,
    "result_length": 61,
    "avg_duration": 1.306698015704751
  },
  "vertex_gecko": {
    "result": ""
  },
  "gitlab_model": {
    "result": "```python\ndef sort_list(nums):\n  # Sort the list in ascending order.\n  nums.sort()\n\n  #",
    "duration": 0.6066709339793306,
    "result_length": 87,
    "avg_duration": 0.6267550468997797
  }
}