{
  "anthropic": {
    "result": "def find_common_elements(list1, list2):\n    common = []\n    for element in list1:\n        if element in list2:\n            common.append(element)\n    return common",
    "duration": 1.3726556570036337,
    "result_length": 163,
    "average_duration": 1.4336930073797702,
    "raw_durations": [
      1.3726556570036337,
      1.487680427962914,
      1.3034592909971252,
      1.5369078039657325,
      1.467761856969446
    ],
    "uuid": "fda3ef24-87a3-4094-83ba-2633839f5a63"
  },
  "anthropic_fast": {
    "result": "# def find_common_elements(list1, list2): \ndef find_common_elements(list1, list2):    \n    result = []    \n    for x in list1:        \n        for y in list2:           \n            if x == y:               \n                result.append(x)               \n                break    \n    return result",
    "duration": 1.0980760629754514,
    "result_length": 299,
    "average_duration": 1.0729874907061459,
    "raw_durations": [
      1.0980760629754514,
      1.0759739179629833,
      1.2743284821044654,
      1.0051081710262224,
      1.0757236260687932,
      1.0005210939561948,
      1.036961399950087,
      1.1286780600203201,
      0.9901167689822614,
      1.0443873240146786
    ],
    "uuid": "c960ef5c-5364-4ca0-89b9-e638ddc6d9e3"
  },
  "vertex_combined": {
    "result": "def find_common_elements(list1, list2):\n  \"\"\"\n  This function takes two lists as input and returns a list of the elements that are common to both lists.\n\n  Args:\n    list1: The first list.\n    list2: The second list.\n\n  Returns:\n    A list of the elements that are common to both lists.\n  \"\"\"\n\n  # Create a set of the elements in the first list.\n  set1 = set(list1)\n\n  # Create a set of the elements in the second list.\n  set2 = set(list2)\n\n  # Find the intersection of the two sets.\n  intersection = set1.intersection(set2)\n\n  # Return a list of the elements in the intersection.\n  return list(intersection)",
    "duration": 3.183226032066159,
    "result_length": 608,
    "average_duration": 3.189845527790021,
    "raw_durations": [
      3.183226032066159,
      3.152972645009868,
      3.2270058029098436,
      3.2604801299748942,
      3.222366435918957,
      3.1501452659722418,
      3.148371996008791,
      3.1774213849566877,
      3.1567045010160655,
      3.219761084066704
    ],
    "uuid": "0e0f15aa-6d3c-45e1-938a-9f22c8b1d262"
  },
  "vertex_code_bison": {
    "result": "def find_common_elements(list1, list2):\n  \"\"\"\n  This function takes two lists as input and returns a list of the elements that are common to both lists.\n\n  Args:\n    list1: The first list.\n    list2: The second list.\n\n  Returns:\n    A list of the elements that are common to both lists.\n  \"\"\"\n\n  # Create a set of the elements in the first list.\n  set1 = set(list1)\n\n  # Create a set of the elements in the second list.\n  set2 = set(list2)\n\n  # Find the intersection of the two sets.\n  intersection = set1.intersection(set2)\n\n  # Return a list of the elements in the intersection.\n  return list(intersection)",
    "duration": 3.1782989519415423,
    "result_length": 608,
    "average_duration": 3.1787859220872634,
    "raw_durations": [
      3.1782989519415423,
      3.128630932071246,
      3.160826202016324,
      3.149749522912316,
      3.157634826027788,
      3.148912381962873,
      3.15708062693011,
      3.2353441410232335,
      3.224818296963349,
      3.246563339023851
    ],
    "uuid": "08b406b3-644d-40d0-b953-f033e1b7ce39"
  },
  "vertex_text_bison": {
    "result": "```python\ndef find_common_elements(list1, list2):\r\n    common_elements = []\r\n    for element in list1:\r\n        if element in list2:\r\n            common_elements.append(element)\r\n    return common_elements\n```",
    "duration": 0.8294919129693881,
    "result_length": 209,
    "average_duration": 0.8340055543812923,
    "raw_durations": [
      0.8294919129693881,
      0.8343282729620114,
      0.8158146089408547,
      0.8323922519339249,
      0.8305173070402816,
      0.8323223131010309,
      0.832496243994683,
      0.8478547899285331,
      0.8431550639215857,
      0.8416827790206298
    ],
    "uuid": "4222e444-12e4-4f76-8e1a-2ecae92eb64d"
  },
  "vertex_gecko": {
    "result": "\n#     common_elements = []\n#     for item in list1:\n#         if item in list2:\n#             common_elements.append(item)",
    "duration": 1.4287077910266817,
    "result_length": 123,
    "average_duration": 1.4189899000222794,
    "raw_durations": [
      1.4287077910266817,
      1.3683885420905426,
      1.3827049160609022,
      1.583975291927345,
      1.4131516249617562,
      1.2986705830553547,
      1.3493673340417445,
      1.510986000066623,
      1.4144300420302898,
      1.439516874961555
    ],
    "uuid": "ea57d35a-4f45-4a6d-a7a0-6698d3532d19"
  },
  "user_intention": "Live Test",
  "language": "python",
  "prompt": "def find_common_elements(list1, list2):",
  "gitlab_model": {
    "result": "\n  \"\"\"Finds common elements in two lists.\n\n  Args:\n    list1: A list of elements.\n    list2:",
    "duration": 0.5986607929808088,
    "result_length": 92,
    "average_duration": 0.6297906297026202,
    "uuid": "a05bf9b2-b0d4-4be1-bc65-ccae6954a5ca"
  }
}