{
  "user_intention": "Live Test",
  "language": "golang",
  "prompt": "// Implement a function to calculate the area of a circle given its radius.",
  "anthropic": {
    "result": "// Implement a function to calculate the area of a circle given its radius.\nfunc circleArea(radius float64) float64 {\n    return math.Pi * radius * radius\n}",
    "duration": 1.7903769219992682,
    "result_length": 156,
    "avg_duration": 2.1390004146029242
  },
  "anthropic_fast": {
    "result": "func areaOfCircle(radius float64) float64 {\n    return math.Pi * radius * radius\n}",
    "duration": 1.5708786369650625,
    "result_length": 82,
    "avg_duration": 0.8662507397995796
  },
  "vertex_combined": {
    "result": "area = \u03c0 * radius^2",
    "duration": 2.9228545980295166,
    "result_length": 19,
    "avg_duration": 3.060101820307318
  },
  "vertex_code_bison": {
    "result": "area = \u03c0 * radius^2",
    "duration": 2.841611350013409,
    "result_length": 19,
    "avg_duration": 2.882704654103145
  },
  "vertex_text_bison": {
    "result": "func Area(radius float64) float64 {\n        return math.Pi * radius * radius\n    }",
    "duration": 0.5267186919809319,
    "result_length": 82,
    "avg_duration": 0.5300108134921174
  },
  "vertex_gecko": {
    "result": ""
  },
  "gitlab_model": {
    "result": "```go\nfunc Area(radius float64) float64 {\n  return math.Pi * radius * radius\n}\n```",
    "duration": 0.6241609970456921,
    "result_length": 82,
    "avg_duration": 0.6141420219035354
  }
}