{
  "anthropic": {
    "result": "class BankAccount:\n    def __init__(self, owner, balance=0):\n        self.owner = owner\n        self.balance = balance\n        \n    def deposit(self, amount):\n        self.balance += amount\n        print(f\"Deposited ${amount}. New balance is ${self.balance}.\")\n        \n    def withdraw(self, amount):\n        if self.balance < amount:\n            print(\"Insufficient funds!\")\n        else:\n            self.balance -= amount\n            print(f\"Withdrew ${amount}. New balance is ${self.balance}.\")",
    "duration": 3.1664374180836603,
    "result_length": 499,
    "average_duration": 3.35633340690078,
    "raw_durations": [
      3.1664374180836603,
      3.4613949779886752,
      3.1831906370352954,
      2.954877967014909,
      2.8205317170359194,
      4.896940310951322,
      3.0911089219152927,
      3.2825859390432015,
      3.349932773038745
    ],
    "uuid": "fc21bd9a-0337-4d19-bb95-349a719fab42"
  },
  "anthropic_fast": {
    "result": "class BankAccount:  \n    def __init__(self, balance=0):  \n        self.balance = balance  \n      \n    def deposit(self, amount):\n        self.balance += amount\n        return self.balance\n      \n    def withdraw(self, amount):\n        if amount > self.balance:\n            print(\"Insufficient funds\")\n            return False\n        self.balance -= amount  \n        return self.balance",
    "duration": 1.1320207790704444,
    "result_length": 386,
    "average_duration": 1.16286953635669,
    "raw_durations": [
      1.1320207790704444,
      1.5878364800009876,
      1.2362974180141464,
      1.0752645150059834,
      1.1680788929807022,
      1.0963751570088789,
      1.0809857710264623,
      1.0705524800578132,
      1.0184143340447918
    ],
    "uuid": "bf0b9fc8-f43f-454a-8d9a-aeb641e886f4"
  },
  "vertex_combined": {
    "result": "class BankAccount:\n\n    def __init__(self, account_number, balance):\n        self.account_number = account_number\n        self.balance = balance\n\n    def deposit(self, amount):\n        self.balance += amount\n\n    def withdraw(self, amount):\n        if self.balance >= amount:\n            self.balance -= amount\n        else:\n            raise ValueError(\"Insufficient funds\")\n\n    def get_balance(self):\n        return self.balance",
    "duration": 2.8645561420125887,
    "result_length": 431,
    "average_duration": 2.870526988385245,
    "raw_durations": [
      2.8645561420125887,
      2.8481802450260147,
      2.846379898954183,
      2.945021059946157,
      2.843640245962888,
      2.76610939798411,
      2.8357473289361224,
      2.936691403039731,
      2.9415460070595145,
      2.877398154931143
    ],
    "uuid": "2635209f-6293-4071-b3ab-2ae4bf2cd293"
  },
  "vertex_code_bison": {
    "result": "class BankAccount:\n\n    def __init__(self, account_number, balance):\n        self.account_number = account_number\n        self.balance = balance\n\n    def deposit(self, amount):\n        self.balance += amount\n\n    def withdraw(self, amount):\n        if self.balance >= amount:\n            self.balance -= amount\n        else:\n            raise ValueError(\"Insufficient funds\")\n\n    def get_balance(self):\n        return self.balance",
    "duration": 2.862226289929822,
    "result_length": 431,
    "average_duration": 2.8933403386734424,
    "raw_durations": [
      2.862226289929822,
      2.858693031943403,
      2.859279679018073,
      3.379580004955642,
      2.7707969000330195,
      2.780293012969196,
      2.897316916962154,
      2.8436701049795374,
      2.8710626430111006,
      2.8104848029324785
    ],
    "uuid": "dd800d84-3382-4c71-af38-9f46601d1414"
  },
  "vertex_text_bison": {
    "result": "```python\nclass BankAccount:\n\n    def __init__(self, name, balance):\n        self.name = name\n        self.balance = balance\n\n    def deposit(self, amount):\n        self.balance += amount\n\n    def withdraw(self, amount):\n        if amount > self.balance:\n            raise ValueError(\"Insufficient funds\")\n        self.balance -= amount\n\n    def get_balance(self):\n        return self.balance\n\n```",
    "duration": 1.3749288360122591,
    "result_length": 397,
    "average_duration": 1.3538896868936718,
    "raw_durations": [
      1.3749288360122591,
      1.3624663579976186,
      1.2776937739690766,
      1.3661912441020831,
      1.3648467669263482,
      1.3790301959961653,
      1.3895191099727526,
      1.3689016819698736,
      1.368870371952653,
      1.2864485300378874
    ],
    "uuid": "15083054-b07f-412f-ae99-3d1f561c75ce"
  },
  "vertex_gecko": {
    "result": "\n# Create a class for a bank account with methods like deposit and withdraw.\n# Create a class for a bank account with methods like deposit and withdraw.\n# Create a class for a bank account with methods like deposit and withdraw.\n# Create a",
    "duration": 1.699762292089872,
    "result_length": 239,
    "average_duration": 1.5033293042215519,
    "raw_durations": [
      1.699762292089872,
      1.368319374974817,
      1.5910533340647817,
      1.4990889170439914,
      1.548980874940753,
      1.438187916064635,
      1.5342086659511551,
      1.4501663750270382,
      1.5777402500389144,
      1.325785042019561
    ],
    "uuid": "1b8fc460-5210-4ee7-85da-41cedc9dee1f"
  },
  "user_intention": "Live Test",
  "language": "python",
  "prompt": "Create a class for a bank account with methods like deposit and withdraw.",
  "gitlab_model": {
    "result": "```python\nclass BankAccount:\n\n    def __init__(self, name, balance):\n        self.name = name\n        self.balance",
    "duration": 0.674687680992065,
    "result_length": 114,
    "average_duration": 0.6523779138020472,
    "uuid": "c0fe1e96-2a1f-4c53-a82e-4371c9f2a332"
  }
}