{
  "anthropic": {
    "result": "struct Person {\n    char *name;\n    int age;\n    char *address;\n};",
    "duration": 1.2307768890168518,
    "result_length": 66,
    "average_duration": 1.1168950794963166,
    "raw_durations": [
      1.2307768890168518,
      1.206620211014524,
      1.0465860690455884,
      1.1737805809825659,
      1.1318130660802126,
      1.0792611819924787,
      0.9978011619532481,
      1.0705205890117213,
      1.1650746109662578,
      1.0667164348997176
    ],
    "uuid": "52d29363-2bec-4e61-8444-9567f81c3ab1"
  },
  "anthropic_fast": {
    "result": "typedef struct Person {\n   char *name;\n   int age; \n   char *address;\n} Person;\n\nPerson *createPerson(char *name, int age, char *address) {\n   Person *person = malloc(sizeof(Person)); \n   person->name = strdup(name);\n   person->age = age;\n   person->address = strdup(address);\n   return person;\n}\n\nvoid deletePerson(Person *person) {\n   free(person->name);\n   free(person->address);\n  ",
    "duration": 1.3087933619972318,
    "result_length": 385,
    "average_duration": 1.7917909208103082,
    "raw_durations": [
      1.3087933619972318,
      1.4703391719376668,
      1.3607301390729845,
      1.590487280045636,
      1.7128900500247255,
      2.9352117500966415,
      1.376724892994389,
      1.5539671479491517,
      3.0504895399790257,
      1.5582758740056306
    ],
    "uuid": "e5a232e4-f879-4d92-9dfe-19382f32f4d5"
  },
  "vertex_combined": {
    "result": "class Person {\n  // The person's name.\n  String name;\n\n  // The person's age.\n  int age;\n\n  // The person's address.\n  String address;\n\n  // Constructs a new person with the given name, age, and address.\n  Person(this.name, this.age, this.address);\n\n  // Returns the person's name.\n  String getName() {\n    return name;\n  }\n\n  // Sets the person's name.\n  void setName(String name) {\n    this.name = name;\n  }\n\n  // Returns the person's age.\n  int getAge() {\n    return age;\n  }\n\n  // Sets the person's age.\n  void setAge(int age) {\n    this.age = age;\n  }\n\n  // Returns the person's address.\n  String getAddress() {\n    return address;\n  }\n\n  // Sets",
    "duration": 3.825694134924561,
    "result_length": 651,
    "average_duration": 3.83605565429898,
    "raw_durations": [
      3.825694134924561,
      3.8410006139893085,
      3.7927405569935217,
      3.922204324044287,
      3.9329389120684937,
      3.8549552869517356,
      3.8240846410626546,
      3.8197677340358496,
      3.7719159389380366,
      3.7752543999813497
    ],
    "uuid": "82d8fc3b-da62-479e-9bc2-45287559ec7f"
  },
  "vertex_code_bison": {
    "result": "class Person {\n  // The person's name.\n  String name;\n\n  // The person's age.\n  int age;\n\n  // The person's address.\n  String address;\n\n  // Constructs a new person with the given name, age, and address.\n  Person(this.name, this.age, this.address);\n\n  // Returns the person's name.\n  String getName() {\n    return name;\n  }\n\n  // Sets the person's name.\n  void setName(String name) {\n    this.name = name;\n  }\n\n  // Returns the person's age.\n  int getAge() {\n    return age;\n  }\n\n  // Sets the person's age.\n  void setAge(int age) {\n    this.age = age;\n  }\n\n  // Returns the person's address.\n  String getAddress() {\n    return address;\n  }\n\n  // Sets",
    "duration": 3.9274342730641365,
    "result_length": 651,
    "average_duration": 3.8523046974209136,
    "raw_durations": [
      3.9274342730641365,
      3.8306194220203906,
      3.875765371019952,
      3.90102259197738,
      3.7854432420572266,
      3.8008934219833463,
      3.851587053039111,
      3.852930865017697,
      3.9206658500479534,
      3.776684883981943
    ],
    "uuid": "e1d676f9-60e8-4c57-a3cd-f4fde8e8790d"
  },
  "vertex_text_bison": {
    "result": "```c\n#include <stdio.h>\n#include <stdlib.h>\n\ntypedef struct Person {\n    char *name;\n    int age;\n    char *address;\n} Person;\n\nvoid printPerson(Person *person) {\n    printf(\"Name: %s\\n\", person->name);\n    printf(\"Age: %d\\n\", person->age);\n    printf(\"Address: %s\\n\", person->address);\n}\n\nint main() {\n    Person *person = malloc(sizeof(Person));\n    person->name = \"John Doe\";\n    person->age = 20;\n    person->address = \"123 Main Street\";\n\n    printPerson(person);\n\n    free(person);\n\n    return 0;\n}\n```",
    "duration": 2.3612207780824974,
    "result_length": 507,
    "average_duration": 2.3290927707101217,
    "raw_durations": [
      2.3612207780824974,
      2.266737189027481,
      2.360951167996973,
      2.2887245579622686,
      2.3574629849754274,
      2.3486558699514717,
      2.300313321989961,
      2.3137609970290214,
      2.342669519013725,
      2.350431321072392
    ],
    "uuid": "b3e82d98-c174-46c6-bbeb-24d7c0a28fdc"
  },
  "vertex_gecko": {
    "result": "\n// Create a class that represents a student with attributes like name, age, and address.\n// Create a class that represents a teacher with attributes like name, age, and address.\n// Create a class that represents a course with attributes like name, price, and",
    "duration": 1.2576761250384152,
    "result_length": 259,
    "average_duration": 1.3366148376022466,
    "raw_durations": [
      1.2576761250384152,
      1.317228916916065,
      1.3873712089844048,
      1.2746114580659196,
      1.2619511249940842,
      1.3610460410127416,
      1.4057939579943195,
      1.360588083975017,
      1.3079372920328751,
      1.4319441670086235
    ],
    "uuid": "db48ff24-dacc-4e2f-aabe-bf68a56e07be"
  },
  "user_intention": "Live Test",
  "language": "c",
  "prompt": "Create a class that represents a person with attributes like name, age, and address.",
  "gitlab_model": {
    "result": "```python\nclass Person:\n    \"\"\"A simple class representing a person.\"\"\"\n\n    def __init__(self, name, age, address):\n",
    "duration": 0.6267812749720179,
    "result_length": 117,
    "average_duration": 0.618090808391571,
    "uuid": "63005057-aeed-4a74-b82f-09f45a3b6102"
  }
}