{
  "user_intention": "Live Test",
  "language": "python",
  "prompt": "# Implement a function to check if a given string is a valid email address.",
  "anthropic": {
    "result": "def is_valid_email(email):\n    import re\n    regex = r'\\b[A-Za-z0-9._%+-]+@[A-Za-z0-9.-]+\\.[A-Z|a-z]{2,}\\b'\n    if re.fullmatch(regex, email):\n        return True\n    else: \n        return False",
    "duration": 2.132086949015502,
    "result_length": 194,
    "avg_duration": 2.7048848506005014
  },
  "anthropic_fast": {
    "result": "def check_email(email):\n    '''\n    Check if email is valid\n    '''\n    # split email into username and domain\n    username, domain = email.split('@')  \n    \n    # check if username has valid characters\n    valid_username = username.replace('.','').replace('-','').isalnum()\n    \n    # check if domain has at least 2 parts\n    domain_parts = domain.split('.')\n    valid_domain = len(domain_parts) >= 2 and all(part.isalnum() for part in domain_parts)\n    \n    # return True if email is valid\n    return valid",
    "duration": 1.4895535940304399,
    "result_length": 508,
    "avg_duration": 1.5081047477957328
  },
  "vertex_combined": {
    "result": "def is_valid_email(email):\n    if '@' not in email:\n        return False\n\n    parts = email.split('@'",
    "duration": 3.8439333509886637,
    "result_length": 101,
    "avg_duration": 3.8457689118979035
  },
  "vertex_code_bison": {
    "result": "def is_valid_email(email):\n    if '@' not in email:\n        return False\n\n    parts = email.split('@'",
    "duration": 3.826433901034761,
    "result_length": 101,
    "avg_duration": 3.8314257438934876
  },
  "vertex_text_bison": {
    "result": "def is_valid_email(email):\n        \"\"\"\n        Check if a given string is a valid email address.\n\n        Args:\n            email (str): The string to check.\n\n        Returns:\n            bool: True if the string is a valid email address, False otherwise.\n        \"\"\"\n        # Check if the string is a valid email address.\n        if not re.match(r\"^[a-zA-Z0-9_.+-]+@[a-zA-Z0-9-]+\\.[a-zA-Z0-9-.]+$\", email):\n            return False\n\n        # Check if the string is a valid email address with a domain that exists.\n        try:\n            socket.gethostbyname(email.split(\"@\")[1])\n        except socket.error:\n            return False\n\n        return True",
    "duration": 2.066264602006413,
    "result_length": 658,
    "avg_duration": 2.0590768139983995
  },
  "vertex_gecko": {
    "result": ""
  },
  "gitlab_model": {
    "result": "```python\ndef is_valid_email(email):\n  \"\"\"\n  Check if the given string is a valid email address.\n\n  ",
    "duration": 0.5516841239877976,
    "result_length": 100,
    "avg_duration": 0.6338337242952548
  }
}