{
  "anthropic": {
    "result": "# Write a program to find the common elements between two lists.\nlist1 = [1, 2, 3, 4, 5]\nlist2 = [2, 3, 4, 6, 7]\n\ncommon = []\nfor num in list1:\n    if num in list2:\n        common.append(num)\nprint(common)",
    "duration": 2.2408163809450343,
    "result_length": 205,
    "average_duration": 2.6984894289053045,
    "raw_durations": [
      2.2408163809450343,
      2.3800967501010746,
      2.03061171900481,
      4.615481585962698,
      2.3074246110627428,
      2.1280649229884148,
      2.563868360943161,
      2.1887486060149968,
      3.9242637930437922,
      2.605517558986321
    ],
    "uuid": "1a853d6b-f4e7-4fd2-8368-32af5fc65b8c"
  },
  "anthropic_fast": {
    "result": "# Write a program to find the common elements between two lists.\n\nlist1 = [1,2,3,4,5]  \nlist2 = [3,4,5,6,7]\n\ncommon_elements = set(list1) & set(list2)\n\nprint(list(common_elements))",
    "duration": 1.1011016039410606,
    "result_length": 180,
    "average_duration": 1.1221066560712643,
    "raw_durations": [
      1.1011016039410606,
      1.291703364928253,
      1.0038756089052185,
      1.092781348968856,
      1.1588158051017672,
      1.0903055449016392,
      1.2042524659773335,
      1.0906082990113646,
      1.1965300369774923,
      0.991092481999658
    ],
    "uuid": "2356391d-f9dd-4e00-a408-18fd5373fbef"
  },
  "vertex_combined": {
    "result": "# Create two lists\nlist1 = [1, 2, 3, 4, 5]\nlist2 = [2, 3, 6, 7, 8]\n\n# Create a new list to store the common elements\ncommon_elements = []\n\n# Iterate over the first list\nfor element in list1:\n\n    # Check if the element is in the second list\n    if element in list2:\n\n        # Add the element to the new list\n        common_elements.append(element)\n\n# After iterating over the first",
    "duration": 3.8296760579105467,
    "result_length": 382,
    "average_duration": 3.8891730196075516,
    "raw_durations": [
      3.8296760579105467,
      3.8053753570420668,
      3.8440862260758877,
      3.9449417990399525,
      4.116054812911898,
      3.8364264559932053,
      3.9221547129563987,
      3.8356685250764713,
      3.83830574399326,
      3.9190405050758272
    ],
    "uuid": "197237e3-3681-4dd8-8ac1-12327e9534e4"
  },
  "vertex_code_bison": {
    "result": "# Create two lists\nlist1 = [1, 2, 3, 4, 5]\nlist2 = [2, 3, 6, 7, 8]\n\n# Create a new list to store the common elements\ncommon_elements = []\n\n# Iterate over the first list\nfor element in list1:\n\n    # Check if the element is in the second list\n    if element in list2:\n\n        # Add the element to the new list\n        common_elements.append(element)\n\n# After iterating over the first",
    "duration": 3.9287201500264928,
    "result_length": 382,
    "average_duration": 3.9119850559858604,
    "raw_durations": [
      3.9287201500264928,
      3.7821909319609404,
      4.091473908978514,
      3.8767969759646803,
      3.7963859610026702,
      3.8546700180741027,
      4.13011554593686,
      3.9142295719357207,
      3.915230819955468,
      3.8300366760231555
    ],
    "uuid": "39c3ae8a-12fe-4b77-b099-78fb4880345a"
  },
  "vertex_text_bison": {
    "result": "def find_common_elements(list1, list2):\n        common_elements = []\n        for element in list1:\n            if element in list2:\n                common_elements.append(element)\n        return common_elements\n\n\nlist1 = ['a', 'b', 'c', 'd']\nlist2 = ['c', 'd', 'e', 'f']\n\nprint(find_common_elements(list1, list2))",
    "duration": 1.7031981300096959,
    "result_length": 313,
    "average_duration": 1.4719528656336478,
    "raw_durations": [
      1.7031981300096959,
      1.4515969700878486,
      1.4424578209873289,
      1.3607524910476059,
      1.456091420026496,
      1.590032925014384,
      1.3715469590388238,
      1.4519401950528845,
      1.459045039024204,
      1.4328667060472071
    ],
    "uuid": "cb92ab17-470e-4030-b133-b3a1017de601"
  },
  "vertex_gecko": {
    "result": "\n\n# Example:\n\n# Input:",
    "duration": 1.5793199579929933,
    "result_length": 22,
    "average_duration": 1.4322330585098826,
    "raw_durations": [
      1.5793199579929933,
      1.5615442920243368,
      1.3823200829792768,
      1.4863543750252575,
      1.3072762499796227,
      1.356398000032641,
      1.4818555840756744,
      1.389774417039007,
      1.3904017920140177,
      1.3870858339359984
    ],
    "uuid": "9d48c154-f0c6-4563-bd74-db15767dce81"
  },
  "user_intention": "Live Test",
  "language": "python",
  "prompt": "Write a program to find the common elements between two lists.",
  "gitlab_model": {
    "result": "```python\ndef find_common_elements(list1, list2):\n  \"\"\"Finds the common elements between two lists.\n\n  ",
    "duration": 0.5984871020191349,
    "result_length": 103,
    "average_duration": 0.6261843634041725,
    "uuid": "1c2a1758-11af-460d-86c3-8a6bee4c6d9f"
  }
}