{
  "anthropic": {
    "result": "function findCommonElements(list1, list2) {\n        let common = [];\n        for (let i = 0; i < list1.length; i++) {\n            for (let j = 0; j < list2.length; j++) {\n                if (list1[i] === list2[j]) {\n                    common.push(list1[i]);\n                }\n            }\n        }\n        return common;\n    }",
    "duration": 3.3150554499588907,
    "result_length": 329,
    "average_duration": 2.9043094531063818,
    "raw_durations": [
      3.3150554499588907,
      2.6684512570500374,
      3.053556493949145,
      3.184870203025639,
      3.2788008959032595,
      2.779700150946155,
      2.464447445003316,
      3.036175383022055,
      2.3577277990989387
    ],
    "uuid": "1f768f71-7da8-43a5-a80d-7c634b6fb737"
  },
  "anthropic_fast": {
    "result": "// function findCommonElements(list1, list2) { \n    let commonElements = [];\n    for (let i = 0; i < list1.length; i++) {\n        for (let j = 0; j < list2.length; j++) {\n            if (list1[i] === list2[j]) {\n                commonElements.push(list1[i]);\n                break;\n            }\n        }\n    }\n    return commonElements;\n}",
    "duration": 1.2966323810396716,
    "result_length": 340,
    "average_duration": 1.6319268383085728,
    "raw_durations": [
      1.2966323810396716,
      1.3443886429304257,
      1.0344885119702667,
      2.277802661061287,
      1.949925504042767,
      1.3647081250092015,
      1.7037351710023358,
      2.930878794984892,
      1.3448381799971685,
      1.071870411047712
    ],
    "uuid": "a76f3c7a-cecc-4a62-ac90-9c7aaf60eaa4"
  },
  "vertex_combined": {
    "result": "function findCommonElements(list1, list2) {\n  // Create a new array to store the common elements.\n  var commonElements = [];\n\n  // Iterate over the first list.\n  for (var i = 0; i < list1.length; i++) {\n    // Check if the current element is in the second list.\n    if (list2.indexOf(list1[i]) > -1) {\n      // If it is, add it to the array of common elements.\n      commonElements.push(list1[i]);\n    }\n  }\n\n  // Return the array of common elements.\n  return commonElements;\n}",
    "duration": 2.6872519890312105,
    "result_length": 477,
    "average_duration": 2.7314254511031324,
    "raw_durations": [
      2.6872519890312105,
      2.7925797570496798,
      2.708569874987006,
      2.6832455549156293,
      2.8016601409763098,
      2.7562861159676686,
      2.7266510830959305,
      2.777190248016268,
      2.695920040947385,
      2.6848997060442343
    ],
    "uuid": "e9dce556-1e21-460e-aa33-59708771297c"
  },
  "vertex_code_bison": {
    "result": "function findCommonElements(list1, list2) {\n  // Create a new array to store the common elements.\n  var commonElements = [];\n\n  // Iterate over the first list.\n  for (var i = 0; i < list1.length; i++) {\n    // Check if the current element is in the second list.\n    if (list2.indexOf(list1[i]) > -1) {\n      // If it is, add it to the array of common elements.\n      commonElements.push(list1[i]);\n    }\n  }\n\n  // Return the array of common elements.\n  return commonElements;\n}",
    "duration": 2.784524915041402,
    "result_length": 477,
    "average_duration": 2.7863762899069116,
    "raw_durations": [
      2.784524915041402,
      2.7386512990342453,
      2.6357984700007364,
      3.205295750987716,
      2.8281857600668445,
      2.7621187560725957,
      2.640775150968693,
      2.721378415939398,
      2.7976980339735746,
      2.7493363469839096
    ],
    "uuid": "95fdafd0-2cbe-4376-9055-25854db2c41c"
  },
  "vertex_text_bison": {
    "result": "function findCommonElements(list1, list2) {\n      var result = [];\n      for (var i = 0; i < list1.length; i++) {\n        for (var j = 0; j < list2.length; j++) {\n          if (list1[i] === list2[j]) {\n            result.push(list1[i]);\n          }\n        }\n      }\n      return result;\n    }",
    "duration": 1.115785627043806,
    "result_length": 293,
    "average_duration": 1.0721765699912793,
    "raw_durations": [
      1.115785627043806,
      1.1101768179796636,
      1.0668160100467503,
      1.043957734014839,
      1.0953812079969794,
      1.0609654480358586,
      1.0310669619357213,
      1.0289293169043958,
      1.082349485019222,
      1.086337090935558
    ],
    "uuid": "8a12577b-2fb8-4e33-aa35-108949c204a5"
  },
  "vertex_gecko": {
    "result": "//     let commonElements = [];\n//     for (let i = 0; i < list1.length; i++) {\n//         for (let j = 0; j < list2.length; j++) {\n//             if (list1[i] === list2[",
    "duration": 1.393953957944177,
    "result_length": 170,
    "average_duration": 1.3817465499974788,
    "raw_durations": [
      1.393953957944177,
      1.373582624946721,
      1.480142749962397,
      1.2917399170110002,
      1.459705541958101,
      1.4163838750682771,
      1.340152750024572,
      1.3439886249834672,
      1.3530711251078174,
      1.3647443329682574
    ],
    "uuid": "7ccfa392-c348-41b5-9750-72f27946fcdb"
  },
  "user_intention": "Live Test",
  "language": "javascript",
  "prompt": "function findCommonElements(list1, list2) {",
  "prompt_type": "completion",
  "gitlab_model": {
    "result": "var commonElements = [];\n    for (var i = 0; i < list1.length; i++) {\n        for (var j = 0; j < list2.length; j++) {\n            if (list1[i] === list2[j]) {",
    "duration": 0.6188972610107157,
    "result_length": 159,
    "average_duration": 0.6093208142032381,
    "uuid": "45e79eed-e5db-414c-a84d-8f2de1d748f5"
  }
}