{
  "anthropic": {
    "result": "function reverseString(str) {\n  var newString = \"\";\n  for (var i = str.length - 1; i >= 0; i--) {\n    newString += str[i];\n  }\n  return newString;\n}",
    "duration": 2.3705293780658394,
    "result_length": 148,
    "average_duration": 2.172439280000981,
    "raw_durations": [
      2.3705293780658394,
      1.9788012199569494,
      1.9894447149708867,
      2.739488529972732,
      2.623476515058428,
      2.0950498819584027,
      2.1512487230356783,
      1.9895464919973165,
      1.5291192890144885,
      2.257688055979088
    ],
    "uuid": "86b1076d-607a-41ef-b91f-c98b42ca989f"
  },
  "anthropic_fast": {
    "result": "function reverseString(str) {\n  return str.split('').reverse().join(''); \n}",
    "duration": 0.807872203993611,
    "result_length": 75,
    "average_duration": 1.0827516953228042,
    "raw_durations": [
      0.807872203993611,
      0.7704166721086949,
      0.6814665429992601,
      0.8676975530106574,
      0.8834940339438617,
      0.7381770210340619,
      0.8261976831126958,
      1.9089042380219325,
      0.9329407180193812,
      2.410350286983885
    ],
    "uuid": "7e9deb08-dbad-438c-9c2d-78a6df8243b9"
  },
  "vertex_combined": {
    "result": "def reverse_string(string):\n  \"\"\"Reverses a string.\n\n  Args:\n    string: The string to reverse.\n\n  Returns:\n    The reversed string.\n  \"\"\"\n  new_string = \"\"\n  for character in string[::-1]:\n    new_string = character + new_string\n  return new_string\n",
    "duration": 3.553710596053861,
    "result_length": 250,
    "average_duration": 3.6674706755904483,
    "raw_durations": [
      3.553710596053861,
      3.55214285699185,
      3.5919677909696475,
      3.8095635659992695,
      3.772363621974364,
      3.814411359024234,
      3.5246883369982243,
      3.8044902629917488,
      3.787568423897028,
      3.463799941004254
    ],
    "uuid": "a317c7dd-c056-4200-a0da-a2415d586dc4"
  },
  "vertex_code_bison": {
    "result": "def reverse_string(string):\n  \"\"\"Reverses a string.\n\n  Args:\n    string: The string to be reversed.\n\n  Returns:\n    The reversed string.\n  \"\"\"\n  new_string = \"\"\n  for character in string[::-1]:\n    new_string += character\n  return new_string\n",
    "duration": 3.67343454901129,
    "result_length": 242,
    "average_duration": 3.7014983082888646,
    "raw_durations": [
      3.67343454901129,
      3.7161122920224443,
      3.815353218000382,
      3.4960148809477687,
      3.5389809369808063,
      3.8059912390308455,
      3.801727966987528,
      3.7504723859019578,
      3.683190267998725,
      3.7337053460069
    ],
    "uuid": "bb54e171-b356-4ff0-8947-f7ad93889e86"
  },
  "vertex_text_bison": {
    "result": "const reverseString = (str) => {\n      const reversed = [];\n      for (let i = str.length - 1; i >= 0; i--) {\n        reversed.push(str[i]);\n      }\n      return reversed.join(\"\");\n    };",
    "duration": 0.8797769040102139,
    "result_length": 187,
    "average_duration": 0.8429555739974604,
    "raw_durations": [
      0.8797769040102139,
      0.8274003500118852,
      0.8687915999908,
      0.7902160939993337,
      0.8805384369334206,
      0.8070047029759735,
      0.8529236529720947,
      0.8284573130076751,
      0.8593714659800753,
      0.8350752200931311
    ],
    "uuid": "3f35781d-b31f-4550-a42e-31d872b2e0a2"
  },
  "vertex_gecko": {
    "result": "\n\n// Example 1:\n\n// Input: \"hello\"",
    "duration": 1.3323972079670057,
    "result_length": 34,
    "average_duration": 1.3660337332752532,
    "raw_durations": [
      1.3323972079670057,
      1.2859725420130417,
      1.254589166957885,
      1.3561975829070434,
      1.397037958027795,
      1.5951237919507548,
      1.3739989589666948,
      1.4025799999944866,
      1.3298364160582423,
      1.332603707909584
    ],
    "uuid": "f897524d-5e54-4b28-851f-faf8d57214ec"
  },
  "user_intention": "Live Test",
  "language": "javascript",
  "prompt": "Write a function to reverse a string.",
  "gitlab_model": {
    "result": "```js\nfunction reverseString(str) {\n  return str.split(\"\").reverse().join(\"\");\n}\n```",
    "duration": 0.6236158279934898,
    "result_length": 84,
    "average_duration": 0.6130883311037906,
    "uuid": "8d2d13b6-d60e-4359-9818-e7872044185d"
  }
}