{
  "anthropic": {
    "result": "// Create a dictionary that maps book titles to their authors.\nlet bookAuthors = {\n    \"The Hobbit\": \"J.R.R. Tolkien\",\n    \"Harry Potter\": \"J.K. Rowling\",\n    \"The Handmaid's Tale\": \"Margaret Atwood\",\n    \"To Kill a Mockingbird\": \"Harper Lee\"\n};",
    "duration": 4.085361959994771,
    "result_length": 245,
    "average_duration": 3.5046543223201296,
    "raw_durations": [
      4.085361959994771,
      3.114847590099089,
      3.368264051969163,
      3.241104815970175,
      5.240436961990781,
      3.1602484640898183,
      2.8051845179870725,
      3.05480613198597,
      3.389720007078722,
      3.586568722035736
    ],
    "uuid": "5482cad0-32cc-43f4-8661-1fc2caa6677e"
  },
  "anthropic_fast": {
    "result": "// Create a dictionary that maps book titles to their authors.\nconst books = {\n  '1984': 'George Orwell',\n  'To Kill a Mockingbird': 'Harper Lee'\n};",
    "duration": 0.8518043190706521,
    "result_length": 148,
    "average_duration": 1.1066275135264731,
    "raw_durations": [
      0.8518043190706521,
      0.9567486360901967,
      1.1968815659638494,
      0.8077264979947358,
      0.9355170190101489,
      2.5885450380155817,
      0.9374396729981527,
      0.921697705052793,
      0.8898508530110121,
      0.9800638280576095
    ],
    "uuid": "7676d1fa-c82c-4a4d-820c-46077fe59457"
  },
  "vertex_combined": {
    "result": "{\n  \"The Hitchhiker's Guide to the Galaxy\": \"Douglas Adams\",\n  \"The Lord of the Rings\": \"J.R.R. Tolkien\",\n  \"Harry Potter and the Sorcerer's Stone\": \"J.K. Rowling\",\n  \"To Kill a Mockingbird\": \"Harper Lee\",\n  \"1984\": \"George Orwell\",\n  \"The Great Gatsby\": \"F. Scott Fitzgerald\",\n  \"Beloved\": \"Toni Morrison\",\n  \"Things Fall Apart\": \"Chinua Achebe\",\n  \"One Hundred Years of Solitude\": \"Gabriel Garc\u00eda M\u00e1rquez\",\n  \"The Color Purple\": \"Alice Walker\"\n}",
    "duration": 2.79617121105548,
    "result_length": 447,
    "average_duration": 2.923249319102615,
    "raw_durations": [
      2.79617121105548,
      2.891993135912344,
      2.939246421097778,
      3.039736566017382,
      2.816300619044341,
      2.9749099229229614,
      2.8913910229457542,
      2.9379158209776506,
      2.991444675019011,
      2.9533837960334495
    ],
    "uuid": "48f93acc-0928-4470-b01d-172cd0cd98ac"
  },
  "vertex_code_bison": {
    "result": "{\n  \"The Lord of the Rings\": \"J.R.R. Tolkien\",\n  \"Harry Potter\": \"J.K. Rowling\",\n  \"The Hunger Games\": \"Suzanne Collins\",\n  \"Twilight\": \"Stephenie Meyer\",\n  \"The Da Vinci Code\": \"Dan Brown\",\n  \"The Girl with the Dragon Tattoo\": \"Stieg Larsson\",\n  \"Gone Girl\": \"Gillian Flynn\",\n  \"The Martian\": \"Andy Weir\",\n  \"The Girl on the Train\": \"Paula Hawkins\",\n  \"The Woman in the Window\": \"A.J. Finn\"\n}",
    "duration": 2.972620852990076,
    "result_length": 393,
    "average_duration": 3.0367200936889276,
    "raw_durations": [
      2.972620852990076,
      2.956314134062268,
      2.9130568739492446,
      3.2011150559410453,
      2.908868202008307,
      2.6947535859653726,
      2.958875607000664,
      3.0149057561066,
      3.829411119921133,
      2.9172797489445657
    ],
    "uuid": "3e55452a-d62c-40de-8452-e5132112a63b"
  },
  "vertex_text_bison": {
    "result": "var bookAuthors = {\n      \"The Great Gatsby\": \"F. Scott Fitzgerald\",\n      \"To Kill a Mockingbird\": \"Harper Lee\",\n      \"1984\": \"George Orwell\",\n      \"The Catcher in the Rye\": \"J.D. Salinger\",\n      \"Fahrenheit 451\": \"Ray Bradbury\"\n    };",
    "duration": 2.2932617201004177,
    "result_length": 239,
    "average_duration": 2.357816233218182,
    "raw_durations": [
      2.2932617201004177,
      2.3883766339858994,
      2.411281535984017,
      2.289070731960237,
      2.2940857430221513,
      2.384810748975724,
      2.389127757982351,
      2.363871704088524,
      2.3969676460837945,
      2.367308109998703
    ],
    "uuid": "2f2fe06b-7238-40a9-a58e-856dbb21d5a1"
  },
  "vertex_gecko": {
    "result": "\n        let books = [\n            \"The Hobbit\": \"J.R.R. Tolkein\",\n            \"The Lord of the Rings\": \"J.R.R. Tolkein\",\n            \"The Hobbit\": \"J.R.",
    "duration": 1.4828537919092923,
    "result_length": 153,
    "average_duration": 1.3842819666606374,
    "raw_durations": [
      1.4828537919092923,
      1.3372421249514446,
      1.4139642498921603,
      1.3735664159758016,
      1.3778516249731183,
      1.3118626669747755,
      1.4387958339648321,
      1.4075474169803783,
      1.3853700830368325,
      1.3137654579477385
    ],
    "uuid": "98556ab9-f306-43d0-810a-2ded08296930"
  },
  "user_intention": "Live Test",
  "language": "javascript",
  "prompt": "Create a dictionary that maps book titles to their authors.",
  "gitlab_model": {
    "result": "```js\nconst bookTitleToAuthor = new Map();\nbookTitleToAuthor.set(\"The Great Gatsby\", \"F. Scott Fitzgerald\");\nbook",
    "duration": 0.5977888429770246,
    "result_length": 113,
    "average_duration": 0.6268438416998834,
    "uuid": "5907f1fd-1a40-4b13-9728-082fa429757f"
  }
}