{
  "anthropic": {
    "result": "// func isPalindrome(str string) bool {\n    str = strings.ToLower(str)\n    str = strings.Replace(str, \" \", \"\", -1)\n    for i := 0; i < len(str)/2; i++ {\n        if str[i] != str[len(str)-i-1] {\n            return false\n        }\n    }\n    return true\n}",
    "duration": 2.5422883209539577,
    "result_length": 252,
    "average_duration": 2.3822609981987624,
    "raw_durations": [
      2.5422883209539577,
      2.5074421080062166,
      2.3447015209821984,
      2.454746812931262,
      2.244385363999754,
      2.3135201489785686,
      2.4279287880053744,
      2.3908262869808823,
      2.0713806480634958,
      2.5253899830859154
    ],
    "uuid": "101ac8ef-849f-421c-a2c5-8a9a17983bbb"
  },
  "anthropic_fast": {
    "result": "// func isPalindrome(str string) bool {\n    for i := 0; i < len(str)/2; i++ {\n        if str[i] != str[len(str)-i-1] {\n            return false\n        }\n    }\n    return true\n}",
    "duration": 1.011042688973248,
    "result_length": 177,
    "average_duration": 1.1335592887247912,
    "raw_durations": [
      1.011042688973248,
      0.9678192010615021,
      2.4771925730165094,
      0.9430277540814131,
      0.9524867240106687,
      1.016162125975825,
      1.12468314205762,
      0.9868339831009507,
      0.8860959579469636,
      0.970248737023212
    ],
    "uuid": "885dc350-1c72-4b5a-87d6-1a272be3c648"
  },
  "vertex_combined": {
    "result": "func isPalindrome(str string) bool {\n    for i := 0; i < len(str) / 2; i++ {\n        if str[i] != str[len(str) - 1 - i] {\n            return false\n        }\n    }\n    return true\n}",
    "duration": 3.7852913819951937,
    "result_length": 180,
    "average_duration": 3.875316091789864,
    "raw_durations": [
      3.7852913819951937,
      3.9213426179485396,
      3.9140717670088634,
      3.839132649009116,
      3.8683806660119444,
      3.93115570791997,
      3.8370029439684004,
      3.9201021200278774,
      3.8216923980508,
      3.914988665957935
    ],
    "uuid": "f9a4140c-64cb-4d13-aeff-6a7939f3f284"
  },
  "vertex_code_bison": {
    "result": "func isPalindrome(str string) bool {\n    for i := 0; i < len(str) / 2; i++ {\n        if str[i] != str[len(str) - 1 - i] {\n            return false\n        }\n    }\n    return true\n}",
    "duration": 3.927704092930071,
    "result_length": 180,
    "average_duration": 3.858606265776325,
    "raw_durations": [
      3.927704092930071,
      3.8480824909638613,
      3.784582699998282,
      3.838539027958177,
      3.8717335319379345,
      3.7862115489551798,
      3.836859536007978,
      3.921457107993774,
      3.911565719055943,
      3.8593269019620493
    ],
    "uuid": "f471b478-a34c-488b-b32f-5a3183c7915c"
  },
  "vertex_text_bison": {
    "result": "func isPalindrome(str string) bool {\n        var revStr string\n        for i := len(str) - 1; i >= 0; i-- {\n            revStr += string(str[i])\n        }\n        return str == revStr\n    }",
    "duration": 1.1805115949828178,
    "result_length": 189,
    "average_duration": 1.4351104079163632,
    "raw_durations": [
      1.1805115949828178,
      1.2874945980729535,
      1.2380526750348508,
      2.0035593200009316,
      1.2386404479620978,
      1.4108628910034895,
      2.02464812702965,
      1.3362936249468476,
      1.22396049706731,
      1.4070803030626848
    ],
    "uuid": "e10da89b-c9c4-4905-9587-54fb73743839"
  },
  "vertex_gecko": {
    "result": "\n// \tfor i := 0; i < len(str)/2; i++ {\n// \t\tif str[i] != str[len(str)-i-1] {\n// \t\t\treturn false\n// \t\t}",
    "duration": 1.3112002920825034,
    "result_length": 102,
    "average_duration": 1.350017446023412,
    "raw_durations": [
      1.3112002920825034,
      1.2792455829912797,
      1.3172209589974955,
      1.323619250091724,
      1.4498764170566574,
      1.411298208986409,
      1.3127856670180336,
      1.405623500002548,
      1.3842592909932137,
      1.3050452920142561
    ],
    "uuid": "08fa6259-d5d8-438d-b19b-a2b9960134df"
  },
  "user_intention": "Live Test",
  "language": "golang",
  "prompt": "func isPalindrome(str string) bool {",
  "gitlab_model": {
    "result": "\n    if len(str) == 0 {\n        return true\n    }\n\n    for i := 0; i",
    "duration": 0.6275801759911701,
    "result_length": 68,
    "average_duration": 0.6279231892956887,
    "uuid": "f0e8e87e-96c4-4d9c-818b-e8c121a6f3f8"
  }
}