{
  "user_intention": "Live Test",
  "language": "javascript",
  "prompt": "// Write a program to find the largest common prefix among a list of strings.",
  "anthropic": {
    "result": "function largestCommonPrefix(strs) {\n  if (strs.length === 0) return \"\";\n  let prefix = strs[0];\n  for (let i = 1; i < strs.length; i++) {\n    while (strs[i].indexOf(prefix) !== 0) {\n      prefix = prefix.substring(0, prefix.length - 1);\n    }\n  }\n  return prefix;\n}",
    "duration": 2.133347816008609,
    "result_length": 266,
    "avg_duration": 2.384357840602752
  },
  "anthropic_fast": {
    "result": "function longestCommonPrefix(strs) {\n  if (strs.length === 0) return \"\";\n  let prefix = strs[0];\n  for (let i = 1; i < strs.length; i++) {    \n    while (strs[i].indexOf(prefix) !== 0) {\n      prefix = prefix.substring(0, prefix.length - 1);\n      if (prefix === \"\") return \"\";\n    }   \n  }\n  return prefix;\n}",
    "duration": 1.0324385529966094,
    "result_length": 309,
    "avg_duration": 1.124003605201142
  },
  "vertex_combined": {
    "result": "def find_largest_common_prefix(strings):\n  \"\"\"\n  Finds the largest common prefix among a list of strings.\n\n  Args:\n    strings: A list of strings.\n\n  Returns:\n    The largest common prefix among the strings.\n  \"\"\"\n\n  # Get the length of the shortest string.\n  shortest_string = min(strings, key=len)\n  shortest_length = len(shortest_string)\n\n  # Iterate over the strings, starting from the beginning.\n  for i in range(shortest_length):\n    # Check if the first character of each string is the same.\n    if strings[0][i] != strings[1][i]:\n      # If not, the common prefix is shorter than `i`.\n      return shortest_string[:i]\n\n  # The common prefix is the entire shortest string.\n  return shortest_string\n",
    "duration": 3.8237432880559936,
    "result_length": 705,
    "avg_duration": 3.8329262510233093
  },
  "vertex_code_bison": {
    "result": "def find_lcp(strings):\n  \"\"\"\n  Finds the longest common prefix among a list of strings.\n\n  Args:\n    strings: A list of strings.\n\n  Returns:\n    The longest common prefix among the strings.\n  \"\"\"\n\n  # Get the length of the shortest string.\n  shortest_length = min(len(string) for string in strings)\n\n  # Initialize the longest common prefix.\n  lcp = \"\"\n\n  # Iterate over the characters of the shortest string.\n  for i in range(shortest_length):\n    # Check if the current character is the same in all strings.\n    if all(string[i] == lcp[i] for string in strings):\n      lcp += string[i]\n    else:\n      break\n\n  return lcp\n",
    "duration": 3.779888581018895,
    "result_length": 624,
    "avg_duration": 3.822258261399111
  },
  "vertex_text_bison": {
    "result": "```\nfunction findLongestCommonPrefix(strs) {\n    if (strs.length === 0) {\n        return \"\";\n    }\n\n    const shortestStr = Math.min(...strs);\n    let commonPrefix = \"\";\n    for (let i = 0; i < shortestStr.length; i++) {\n        const letter = shortestStr[i];\n        for (let j = 0; j < strs.length; j++) {\n            if (strs[j][i] !== letter) {\n                return commonPrefix;\n            }\n        }\n        commonPrefix += letter;\n    }\n    return commonPrefix;\n}\n```",
    "duration": 2.0607006659847684,
    "result_length": 478,
    "avg_duration": 2.064435113297077
  },
  "vertex_gecko": {
    "result": ""
  },
  "gitlab_model": {
    "result": "```js\nfunction findLongestCommonPrefix(strs) {\n  if (strs.length === 0) {\n    return \"\";\n",
    "duration": 0.6021929659764282,
    "result_length": 89,
    "avg_duration": 0.6027079747989774
  }
}