{
  "anthropic": {
    "result": "// func commonElements(a, b []int) []int {\n    var result []int\n    for i := 0; i < len(a); i++ {\n        for j := 0; j < len(b); j++ {\n            if a[i] == b[j] {\n                result = append(result, a[i])\n            }\n        }\n    }\n    return result\n}",
    "duration": 3.1718785029370338,
    "result_length": 261,
    "average_duration": 2.556787767377682,
    "raw_durations": [
      3.1718785029370338,
      2.6783845809986815,
      2.6623150520026684,
      2.389701430918649,
      2.4377567359479144,
      2.384414796018973,
      2.3667497020214796,
      2.5128693890292197,
      2.55345560493879,
      2.410351878963411
    ],
    "uuid": "a2177767-cc8f-4a07-bcfb-ab2c62e17686"
  },
  "anthropic_fast": {
    "result": "",
    "uuid": "cc9c4a7c-ffbb-44ea-99a3-7daca755c421"
  },
  "vertex_combined": {
    "result": "func commonElements(a, b []int) []int {\n\t// Create a map to store the elements of a.\n\tm := make(map[int]bool)\n\tfor _, v := range a {\n\t\tm[v] = true\n\t}\n\n\t// Create a new slice to store the common elements.\n\tc := make([]int, 0)\n\n\t// Iterate over the elements of b and check if they are present in the map.\n\tfor _, v := range b {\n\t\tif m[v] {\n\t\t\tc = append(c, v)\n\t\t}\n\t}\n\n\treturn c\n}",
    "duration": 3.8667215480236337,
    "result_length": 377,
    "average_duration": 3.57310591529822,
    "raw_durations": [
      3.8667215480236337,
      3.9097115449840203,
      3.911430057953112,
      3.77456137095578,
      3.138980595045723,
      3.8322300750296563,
      3.8398671919712797,
      3.1699261179892346,
      3.481596566038206,
      2.806034084991552
    ],
    "uuid": "adcc9eb2-5214-4aca-9c4e-594538eda9c8"
  },
  "vertex_code_bison": {
    "result": "func commonElements(a, b []int) []int {\n\t// Create a map to store the elements of a.\n\tm := make(map[int]bool)\n\tfor _, v := range a {\n\t\tm[v] = true\n\t}\n\n\t// Create a new slice to store the common elements.\n\tc := make([]int, 0)\n\n\t// Iterate over the elements of b and check if they are present in the map.\n\tfor _, v := range b {\n\t\tif m[v] {\n\t\t\tc = append(c, v)\n\t\t}\n\t}\n\n\treturn c\n}",
    "duration": 3.111280797049403,
    "result_length": 377,
    "average_duration": 3.226055052014999,
    "raw_durations": [
      3.111280797049403,
      3.157039814046584,
      3.197144164936617,
      2.786932953982614,
      3.9225852130912244,
      3.2211683720815927,
      3.7952834989409894,
      3.211630482925102,
      2.7251591430976987,
      3.1323260799981654
    ],
    "uuid": "24450d05-eb43-4139-a55e-5bbd352e87b2"
  },
  "vertex_text_bison": {
    "result": "func commonElements(a, b []int) []int {\n        m := make(map[int]bool)\n        for _, v := range a {\n            m[v] = true\n        }\n        var res []int\n        for _, v := range b {\n            if m[v] {\n                res = append(res, v)\n            }\n        }\n        return res\n    }",
    "duration": 1.6250657030614093,
    "result_length": 295,
    "average_duration": 1.5355831452063284,
    "raw_durations": [
      1.6250657030614093,
      1.603521756012924,
      1.5316159599460661,
      1.5964517520042136,
      1.4018510029418394,
      1.6087849279865623,
      1.3444571600994095,
      1.6075734229525551,
      1.421684899018146,
      1.6148248680401593
    ],
    "uuid": "68d0e6ba-32c3-4074-88fa-19d8d5142b8d"
  },
  "vertex_gecko": {
    "result": "// \tvar result []int\n// \tfor i := 0; i < len(a); i++ {\n// \t\tfor j := 0; j < len(b); j++ {\n// \t\t\tif a[i] == b[j] {",
    "duration": 1.3324650001013651,
    "result_length": 113,
    "average_duration": 1.366036924975924,
    "raw_durations": [
      1.3324650001013651,
      1.3790698329685256,
      1.4822251669829711,
      1.343348165974021,
      1.3197974580107257,
      1.3012355829123408,
      1.4072558749467134,
      1.432243083952926,
      1.3737757499329746,
      1.2889533339766786
    ],
    "uuid": "ece86516-e5a1-4db3-a557-e5a1f2963dd9"
  },
  "user_intention": "Live Test",
  "language": "golang",
  "prompt": "func commonElements(a, b []int) []int {",
  "prompt_type": "completion",
  "gitlab_model": {
    "result": "m := make(map[int]bool)\n\tfor _, v := range a {\n\t\tm[v] = true",
    "duration": 0.6666177309816703,
    "result_length": 60,
    "average_duration": 0.6462561809050384,
    "uuid": "5dd55f7d-35b4-4c48-a9e7-52af7b8014f2"
  }
}