{
  "anthropic": {
    "result": "func largestCommonPrefix(strs []string) string {\n    if len(strs) == 0 {\n        return \"\"\n    }\n    prefix := strs[0]\n    for i := 1; i < len(strs); i++ {\n        for strs[i][j] != prefix[j] {\n            prefix = prefix[:j]\n            j--\n        }\n    }\n    return prefix\n}",
    "duration": 2.5645017800852656,
    "result_length": 277,
    "average_duration": 2.7698737805127167,
    "raw_durations": [
      2.5645017800852656,
      2.735294679994695,
      2.7018896110821515,
      2.254710101056844,
      2.278117008972913,
      2.9609399079345167,
      3.2637450910406187,
      3.1768319909460843,
      3.116820766008459,
      2.6458868680056185
    ],
    "uuid": "e0e43c36-f81c-4cf5-9f1f-67c00afb6f38"
  },
  "anthropic_fast": {
    "result": "package main\n\nimport \"fmt\"\n\nfunc longestCommonPrefix(strs []string) string {\n    if len(strs) == 0 {\n        return \"\"\n    }\n    \n    prefix := strs[0]\n    for i := 1; i < len(strs); i++ {\n        for !strings.HasPrefix(strs[i], prefix) {\n            prefix = prefix[:len(prefix)-1]\n            if len(prefix) == 0 {\n                return \"\"\n            }\n        }\n    }\n    return prefix\n}\n\nfunc main() {\n    strs := []string{\"",
    "duration": 1.2902637629304081,
    "result_length": 430,
    "average_duration": 1.3377959252800793,
    "raw_durations": [
      1.2902637629304081,
      1.395522631937638,
      1.3183690758887678,
      1.2422590251080692,
      1.4333056919276714,
      1.3468492690008134,
      1.457796294009313,
      1.303249296033755,
      1.3221970120212063,
      1.2681471939431503
    ],
    "uuid": "6e507a21-cbc6-4807-8df3-2c1847871a97"
  },
  "vertex_combined": {
    "result": "def find_largest_common_prefix(strings):\n  \"\"\"\n  Finds the largest common prefix among a list of strings.\n\n  Args:\n    strings: A list of strings.\n\n  Returns:\n    The largest common prefix among the strings.\n  \"\"\"\n\n  # Get the length of the shortest string.\n  shortest_string = min(strings, key=len)\n  shortest_length = len(shortest_string)\n\n  # Iterate over the strings, starting from the beginning.\n  for i in range(shortest_length):\n    # Check if the first character of each string is the same.\n    if strings[0][i] != strings[1][i]:\n      # If not, the common prefix is shorter than `i`.\n      return shortest_string[:i]\n\n  # The common prefix is the entire shortest string.\n  return shortest_string\n",
    "duration": 3.83643782697618,
    "result_length": 705,
    "average_duration": 3.8695139333140105,
    "raw_durations": [
      3.83643782697618,
      3.9119306850479916,
      3.8609330020844936,
      3.9254462509416044,
      3.842610227991827,
      3.832117262063548,
      3.833556203986518,
      3.825635130982846,
      3.905136183020659,
      3.9213365600444376
    ],
    "uuid": "bdf31559-c2ec-4c27-9fab-e46fb4ccc569"
  },
  "vertex_code_bison": {
    "result": "def find_lcp(strings):\n  \"\"\"\n  Finds the longest common prefix among a list of strings.\n\n  Args:\n    strings: A list of strings.\n\n  Returns:\n    The longest common prefix among the strings.\n  \"\"\"\n\n  # Get the length of the shortest string.\n  shortest_length = min(len(string) for string in strings)\n\n  # Initialize the current prefix and the longest common prefix.\n  current_prefix = \"\"\n  longest_common_prefix = \"\"\n\n  # Iterate over the characters of the shortest string.\n  for i in range(shortest_length):\n    # Check if the current character is the same in all strings.\n    if all(string[i] == current_prefix[i] for string in strings):\n      current_prefix += string[i]\n      longest_common_prefix = current_prefix\n    else:\n      break\n\n  return longest_common_prefix\n",
    "duration": 3.9052815519971773,
    "result_length": 772,
    "average_duration": 3.8632080650771967,
    "raw_durations": [
      3.9052815519971773,
      3.8277393579483032,
      3.8386662519769743,
      3.931419643922709,
      3.819256852963008,
      3.908886071993038,
      3.904785161023028,
      3.819493524963036,
      3.8379988650558516,
      3.8385533689288422
    ],
    "uuid": "b43be09a-430f-4d60-9778-8ee03480c608"
  },
  "vertex_text_bison": {
    "result": "```\npackage main\n\nimport (\n    \"fmt\"\n    \"strings\"\n)\n\nfunc main() {\n    strs := []string{\"geeksforgeeks\", \"geeks\", \"geek\"}\n    fmt.Println(longestCommonPrefix(strs))\n}\n\nfunc longestCommonPrefix(strs []string) string {\n    // Find the length of the shortest string\n    minLen := len(strs[0])\n    for _, str := range strs {\n        if len(str) < minLen {\n            minLen = len(str)\n        }\n    }\n\n    // Initialize a result string\n    result := \"\"\n\n    // Iterate over all characters of the shortest string\n    for i := 0; i < minLen; i++ {\n        // Check if all strings have the same character at ith position\n        for j := 1; j < len(strs); j++ {\n            if strs[j][i] != strs[0][i] {\n                return result\n            }\n        }\n\n        // Append the current character to the result\n       ",
    "duration": 1.9952256960095838,
    "result_length": 815,
    "average_duration": 1.9891230288078077,
    "raw_durations": [
      1.9952256960095838,
      1.9185694579500705,
      1.952289774082601,
      2.0383587500546128,
      1.993288760073483,
      1.9752893520053476,
      2.007697299006395,
      2.024435122963041,
      2.0013370759552345,
      1.9847389999777079
    ],
    "uuid": "74599329-a7d2-462a-921f-f7a288ef6598"
  },
  "vertex_gecko": {
    "result": "\n\n#include <bits/stdc++.h>\nusing namespace std;",
    "duration": 1.5285887089557946,
    "result_length": 47,
    "average_duration": 1.4396152669098228,
    "raw_durations": [
      1.5285887089557946,
      1.4779173750430346,
      1.4826286670286208,
      1.4707287080818787,
      1.4311390420189127,
      1.4149509170092642,
      1.358483333955519,
      1.4115782920271158,
      1.4398474999470636,
      1.3802901250310242
    ],
    "uuid": "7aaaed64-7f07-439f-a38f-c4997e0b7ca2"
  },
  "user_intention": "Live Test",
  "language": "golang",
  "prompt": "Write a program to find the largest common prefix among a list of strings.",
  "gitlab_model": {
    "result": "```go\npackage main\n\nimport (\n\t\"fmt\"\n\t\"strings\"\n)\n\nfunc main() {\n\t// Create a",
    "duration": 0.6584146920358762,
    "result_length": 76,
    "average_duration": 0.6494138839014341,
    "uuid": "01bab8cc-9978-42af-966e-aaea13fa0226"
  }
}