{
  "anthropic": {
    "result": "// const bookAuthorMap = {\n    'The Hobbit': 'J.R.R. Tolkien', \n    'Harry Potter': 'J.K. Rowling',\n    'The Hitchhiker\\'s Guide to the Galaxy': 'Douglas Adams',\n    'Pride and Prejudice': 'Jane Austen'\n}",
    "duration": 2.690215646987781,
    "result_length": 204,
    "average_duration": 2.4353804490237962,
    "raw_durations": [
      2.690215646987781,
      2.4381861409638077,
      2.456342186080292,
      2.1567778220633045
    ],
    "uuid": "0195675b-b930-4f63-841d-e6e719f523a9"
  },
  "anthropic_fast": {
    "result": "// const bookAuthorMap = {\n    'To Kill a Mockingbird': 'Harper Lee',\n    '1984': 'George Orwell',\n    'Pride and Prejudice': 'Jane Austen'\n}",
    "duration": 0.858510660007596,
    "result_length": 141,
    "average_duration": 0.9485411333967931,
    "raw_durations": [
      0.858510660007596,
      0.8683540190104395,
      0.8868119230028242,
      1.2654215920483693,
      0.8809723169542849,
      0.870304538984783,
      0.9585126009769738,
      0.9527701470069587,
      0.9860080860089511,
      0.957745449966751
    ],
    "uuid": "462dada4-1092-4b99-8572-1307a9a12799"
  },
  "vertex_combined": {
    "result": "const bookAuthorMap = {\n  \"The Hitchhiker's Guide to the Galaxy\": \"Douglas Adams\",\n  \"The Catcher in the Rye\": \"J.D. Salinger\",\n  \"1984\": \"George Orwell\",\n};",
    "duration": 1.884435023064725,
    "result_length": 157,
    "average_duration": 2.14894642829895,
    "raw_durations": [
      1.884435023064725,
      1.9660815940005705,
      1.8117654039524496,
      1.816760782035999,
      1.8853406539419666,
      2.5281905939336866,
      2.187605343060568,
      1.7429131950484589,
      1.8131970789982006,
      3.853174614952877
    ],
    "uuid": "bf20befb-bcad-4e26-ba62-c6746b308e86"
  },
  "vertex_code_bison": {
    "result": "const bookAuthorMap = {\n  \"The Hitchhiker's Guide to the Galaxy\": \"Douglas Adams\",\n  \"The Catcher in the Rye\": \"J.D. Salinger\",\n  \"1984\": \"George Orwell\",\n};",
    "duration": 1.8847025709692389,
    "result_length": 157,
    "average_duration": 1.8304637679015285,
    "raw_durations": [
      1.8847025709692389,
      1.629110760986805,
      1.4909768220968544,
      1.8236072439467534,
      1.8485601999564096,
      1.9483262279536575,
      1.8063501919386908,
      2.5344171710312366,
      1.595756084076129,
      1.742830406059511
    ],
    "uuid": "f9b0bd3d-8a7e-41ce-9fe1-4ccb55a7fbd8"
  },
  "vertex_text_bison": {
    "result": "const bookAuthorMap = {\n      \"The Great Gatsby\": \"F. Scott Fitzgerald\",\n      \"The Catcher in the Rye\": \"J.D. Salinger\",\n      \"To Kill a Mockingbird\": \"Harper Lee\",\n      \"1984\": \"George Orwell\",\n      \"Fahrenheit 451\": \"Ray Bradbury\",\n      \"The Lord of the Rings\": \"J.R.R. Tolkien\",\n      \"Harry Potter and the Sorcerer's Stone\": \"J.K. Rowling\",\n      \"The Hunger Games\": \"Suzanne Collins\",\n      \"Twilight\": \"Stephenie Meyer\",\n    };",
    "duration": 2.382001177058555,
    "result_length": 438,
    "average_duration": 2.361537353810854,
    "raw_durations": [
      2.382001177058555,
      2.362331173964776,
      2.3135339610744268,
      2.372228741995059,
      2.368778072996065,
      2.3037097150227055,
      2.364247697056271,
      2.364834509906359,
      2.3806486050598323,
      2.4030598839744925
    ],
    "uuid": "d50c0a25-0049-419b-a202-c2a6923b0269"
  },
  "vertex_gecko": {
    "result": "//     \"1\": \"John McKinley\",\n//     \"2\": \"John Harrison\",\n//     \"3\": \"John McKinley\",\n//     \"4\": \"John Harr",
    "duration": 1.2866527090081945,
    "result_length": 109,
    "average_duration": 1.3618567669065669,
    "raw_durations": [
      1.2866527090081945,
      1.359342833980918,
      1.376071749953553,
      1.3391234580194578,
      1.333708000020124,
      1.442648833966814,
      1.4762454160954803,
      1.369824166991748,
      1.3083094169851393,
      1.3266410840442404
    ],
    "uuid": "c64c8e7c-9735-4f33-9132-c4a7697eb305"
  },
  "user_intention": "Live Test",
  "language": "javascript",
  "prompt": "const bookAuthorMap = {",
  "prompt_type": "completion",
  "gitlab_model": {
    "result": "'1': 'John McKinley',\n  '2': 'James McKinley',\n  '3': 'John Brown',\n  '4': 'John McKinley',",
    "duration": 0.5864396950055379,
    "result_length": 91,
    "average_duration": 0.5935492332020658,
    "uuid": "ff83d447-e741-4a35-9ef4-a2b6e6ac9a6e"
  }
}