{
  "user_intention": "Live Test",
  "language": "python",
  "prompt": "class Car:",
  "anthropic": {
    "result": ""
  },
  "anthropic_fast": {
    "result": "class Car:\n  \n      def __init__(self, make, model, year):\n          self.make = make\n          self.model = model  \n          self.year = year\n  \n      def get_descriptive_name(self):\n          long_name = f\"{self.year} {self.make} {self.model}\"\n          return long_name",
    "duration": 0.981211852049455,
    "result_length": 273,
    "avg_duration": 0.9263441693037748
  },
  "vertex_combined": {
    "result": ""
  },
  "vertex_code_bison": {
    "result": ""
  },
  "vertex_text_bison": {
    "result": "def __init__(self, make, model, year):\n         self.make = make\n         self.model = model\n         self.year = year",
    "duration": 0.5911678439588286,
    "result_length": 118,
    "avg_duration": 0.6472265667049214
  },
  "vertex_gecko": {
    "result": ""
  },
  "gitlab_model": {
    "result": "\n\n    def __init__(self, make, model, year):\n        self.make = make\n        self.model = model\n        self",
    "duration": 0.6715274109737948,
    "result_length": 109,
    "avg_duration": 0.6927649540943094
  }
}