{
  "user_intention": "Live Test",
  "language": "golang",
  "prompt": "// Implement a function to find the largest element in a list.",
  "anthropic": {
    "result": "func largest(nums []int) int {\n    largest := nums[0]\n    for _, n := range nums {\n        if n > largest {\n            largest = n\n        }\n    }\n    return largest\n}",
    "duration": 1.8305603410117328,
    "result_length": 168,
    "avg_duration": 1.7715638848894741
  },
  "anthropic_fast": {
    "result": "func largest(list []int) int {\n    max := list[0]\n    for _, v := range list {\n        if v > max {\n            max = v\n        }\n    }\n    return max\n}",
    "duration": 1.5825223890133202,
    "result_length": 152,
    "avg_duration": 1.032511130720377
  },
  "vertex_combined": {
    "result": "def find_largest_element(list):\n  \"\"\"Finds the largest element in a list.\n\n  Args:\n    list: The list to search.\n\n  Returns:\n    The largest element in the list.\n  \"\"\"\n\n  largest_element = list[0]\n  for element in list:\n    if element > largest_element:\n      largest_element = element\n\n  return largest_element",
    "duration": 3.1219083970063366,
    "result_length": 311,
    "avg_duration": 3.3275514784967526
  },
  "vertex_code_bison": {
    "result": "def find_largest_element(list):\n  \"\"\"Finds the largest element in a list.\n\n  Args:\n    list: The list to search.\n\n  Returns:\n    The largest element in the list.\n  \"\"\"\n\n  largest_element = list[0]\n  for element in list:\n    if element > largest_element:\n      largest_element = element\n\n  return largest_element",
    "duration": 3.2481177980080247,
    "result_length": 311,
    "avg_duration": 3.4556596589973196
  },
  "vertex_text_bison": {
    "result": "func largest(list []int) int {\n        max := list[0]\n        for _, v := range list {\n            if v > max {\n                max = v\n            }\n        }\n        return max\n    }",
    "duration": 0.8022414019796997,
    "result_length": 184,
    "avg_duration": 0.7426867384056095
  },
  "vertex_gecko": {
    "result": ""
  },
  "gitlab_model": {
    "result": "```go\nfunc findLargest(list []int) int {\n  largest := list[0]\n  for _, value := range list",
    "duration": 0.6098669709754176,
    "result_length": 90,
    "avg_duration": 0.6271402348007541
  }
}