{
  "anthropic": {
    "result": "// const capitalToCountryMap = {\n    \"London\": \"UK\",\n    \"Paris\": \"France\",\n    \"Tokyo\": \"Japan\",\n    \"New Delhi\": \"India\",\n    \"Washington, D.C.\": \"USA\" \n}",
    "duration": 2.1205726379994303,
    "result_length": 156,
    "average_duration": 2.5251982923031653,
    "raw_durations": [
      2.1205726379994303,
      2.690881413058378,
      2.952818327001296,
      2.2284750500693917,
      1.852275438955985,
      2.6193722810130566,
      3.2119928980246186
    ],
    "uuid": "ae58e039-34e9-479e-a3bb-11d36db90d4a"
  },
  "anthropic_fast": {
    "result": "// const capitalToCountryMap = {\n  'Washington':'USA',\n  'London':'UK',\n  'Paris':'France',\n  'Beijing':'China',\n  'New Delhi':'India'\n};",
    "duration": 0.8299294239841402,
    "result_length": 137,
    "average_duration": 0.9049475313979201,
    "raw_durations": [
      0.8299294239841402,
      0.909240887966007,
      1.026374474982731,
      0.8260798039846122,
      0.9313578889705241,
      1.0534116730559617,
      0.8821130390278995,
      0.9182362240971997,
      0.8471819639671594,
      0.8255499339429662
    ],
    "uuid": "154031d2-ac82-4e7a-b22e-968e272594b4"
  },
  "vertex_combined": {
    "result": "const capitalToCountryMap = {\n  \"Paris\": \"France\",\n  \"London\": \"England\",\n  \"Tokyo\": \"Japan\"\n};",
    "duration": 1.4861976710380986,
    "result_length": 95,
    "average_duration": 1.4081146831042133,
    "raw_durations": [
      1.4861976710380986,
      1.4146256890380755,
      1.395956219988875,
      1.475671005086042,
      1.2783718819264323,
      1.4401742069749162,
      1.4276296659372747,
      1.4805179439717904,
      1.2747089090989903,
      1.4072936379816383
    ],
    "uuid": "25a95b82-8442-4d64-95c9-ea3d309fac3b"
  },
  "vertex_code_bison": {
    "result": "const capitalToCountryMap = {\n  \"Paris\": \"France\",\n  \"London\": \"England\",\n  \"Tokyo\": \"Japan\"\n};",
    "duration": 1.4764743249397725,
    "result_length": 95,
    "average_duration": 1.4158446514047682,
    "raw_durations": [
      1.4764743249397725,
      1.2775944540044293,
      1.4841009320225567,
      1.42273010709323,
      1.542832597042434,
      1.3109246799722314,
      1.360651065944694,
      1.5189252080162987,
      1.36877707100939,
      1.395436074002646
    ],
    "uuid": "d172e74f-9920-4de0-a891-7bffacce268c"
  },
  "vertex_text_bison": {
    "result": "const capitalToCountryMap = {\n      \"Abuja\": \"Nigeria\",\n      \"Accra\": \"Ghana\",\n      \"Addis Ababa\": \"Ethiopia\",\n      \"Algiers\": \"Algeria\",\n      \"Amman\": \"Jordan\",\n      \"Ankara\": \"Turkey\",\n      \"Asmara\": \"Eritrea\",\n      \"Astana\": \"Kazakhstan\",\n      \"Bamako\": \"Mali\",\n      \"Bandar Seri Begawan\": \"Brunei\",\n      \"Bangui\": \"Central African Republic\",\n      \"Bangkok\": \"Thailand\",\n      \"Banjul\": \"Gambia\",\n      \"Bissau\": \"Guinea-Bissau\",\n      \"Bratislava\": \"Slovakia\",\n      \"Brazzaville\": \"Republic of the Congo\",\n      \"Budapest\": \"Hungary\",\n      \"Bujumbura\": \"Burundi\",\n      \"Buenos Aires\": \"Argentina\",\n      \"Bukavu\": \"Democratic Republic of the Congo\",\n      \"Cairo\": \"Egypt\",\n      \"Canberra\": \"Australia\",\n      \"Caracas\": \"Venezuela\",\n      \"Casablanca\": \"Morocco",
    "duration": 2.46352086099796,
    "result_length": 781,
    "average_duration": 2.356282217428088,
    "raw_durations": [
      2.46352086099796,
      2.3053653850220144,
      2.3033151030540466,
      2.3669104779837653,
      2.3706242510816082,
      2.295133915031329,
      2.380949115031399,
      2.3775166530394927,
      2.3143444679444656,
      2.3851419450948015
    ],
    "uuid": "8bdc51e7-e26f-4504-9968-62649702b64b"
  },
  "vertex_gecko": {
    "result": "//   'Afghanistan': 'AF',\n//   'Albania': 'AL',\n//   'Algeria': 'DZ',\n//   'Andorra': 'AD',",
    "duration": 1.3408381659537554,
    "result_length": 91,
    "average_duration": 1.33875118320575,
    "raw_durations": [
      1.3408381659537554,
      1.3992785420268774,
      1.3437736660707742,
      1.3112507500918582,
      1.3002216250170022,
      1.3353122499538586,
      1.4493129160255194,
      1.379401332931593,
      1.2633921670494601,
      1.2647304169367999
    ],
    "uuid": "830bd6d4-617b-47e4-8a13-76a7a1ea8e5b"
  },
  "user_intention": "Live Test",
  "language": "javascript",
  "prompt": "const capitalToCountryMap = {",
  "prompt_type": "completion",
  "gitlab_model": {
    "result": "'Afghanistan': 'AF',\n  'Albania': 'AL',\n  'Algeria': 'DZ',\n  'Andorra': 'AD',",
    "duration": 0.5462508679920575,
    "result_length": 77,
    "average_duration": 0.5662411042008898,
    "uuid": "d6bba023-cb57-4890-a2f0-8a3092dd257d"
  }
}