{
  "anthropic": {
    "result": "# class Car:\nclass Car:\n    def __init__(self, make, model, year):\n        self.make = make\n        self.model = model\n        self.year = year\n\n    def get_descriptive_name(self):\n        long_name = f\"{self.year} {self.make} {self.model}\"\n        return long_name.title()",
    "duration": 2.5040045040659606,
    "result_length": 273,
    "average_duration": 2.7810811660601757,
    "raw_durations": [
      2.5040045040659606,
      3.058157828054391
    ],
    "uuid": "cfecc04b-37fe-4c82-ae96-0b8408b893b9"
  },
  "anthropic_fast": {
    "result": "# class Car:  \n   def __init__(self, make, model, year):\n       self.make = make\n       self.model = model\n       self.year = year",
    "duration": 0.7391829160042107,
    "result_length": 130,
    "average_duration": 0.7391829160042107,
    "raw_durations": [
      0.7391829160042107
    ],
    "uuid": "f65529c4-7547-4b7c-b5c4-1ba70bc6722c"
  },
  "vertex_combined": {
    "result": "",
    "uuid": "8516d633-53de-472a-a7e1-ae247955e80c"
  },
  "vertex_code_bison": {
    "result": "",
    "uuid": "1c79451a-8a5a-43fa-9f80-a35dffbf873c"
  },
  "vertex_text_bison": {
    "result": "```python\nclass Car:\n    def __init__(self, make, model, year):\n        self.make = make\n        self.model = model\n        self.year = year\n\n    def __str__(self):\n        return f\"{self.make} {self.model} {self.year}\"\n\n    def get_make(self):\n        return self.make\n\n    def get_model(self):\n        return self.model\n\n    def get_year(self):\n        return self.year\n\n    def set_make(self, make):\n        self.make = make\n\n    def set_model(self, model):\n        self.model = model\n\n    def set_year(self, year):\n        self.year = year\n\n```",
    "duration": 1.8739294200204313,
    "result_length": 548,
    "average_duration": 1.8493757648044267,
    "raw_durations": [
      1.8739294200204313,
      1.7838637540116906,
      1.8611229870002717,
      1.9078469859668985,
      1.7788010110380128,
      1.8701641339575872,
      1.8811837390530854,
      1.8529913250822574,
      1.788256941945292,
      1.8955973499687389
    ],
    "uuid": "d476714c-4ff2-46fa-b074-f415ea7a96e7"
  },
  "vertex_gecko": {
    "result": "\n#     def __init__(self, make, model, year):\n#         self.make = make\n#         self.model = model\n#         self.year = year",
    "duration": 1.390097334049642,
    "result_length": 128,
    "average_duration": 1.445343087601941,
    "raw_durations": [
      1.390097334049642,
      1.420970542007126,
      1.4744677919661626,
      1.578605749993585,
      1.3738861670717597,
      1.4467127079842612,
      1.5094705000519753,
      1.4241687919711694,
      1.4205350829288363,
      1.4145162079948932
    ],
    "uuid": "7c57926f-6c13-45dc-b8ac-e04e1cf35cb3"
  },
  "user_intention": "Live Test",
  "language": "python",
  "prompt": "class Car:",
  "gitlab_model": {
    "result": "\n\n    def __init__(self, make, model, year):\n        self.make = make\n        self.model = model\n        self",
    "duration": 0.6715274109737948,
    "result_length": 109,
    "average_duration": 0.6927649540943094,
    "uuid": "7aa52a99-d09b-4da4-9602-54db6e856b17"
  }
}