{
  "anthropic": {
    "result": "func removeDuplicates(list []int) []int {\n    seen := make(map[int]bool)\n    var result []int\n    for _, val := range list {\n        if !seen[val] {\n            seen[val] = true\n            result = append(result, val)\n        }\n    }\n    return result\n}",
    "duration": 2.199448457919061,
    "result_length": 254,
    "average_duration": 2.1502678951830605,
    "raw_durations": [
      2.199448457919061,
      2.3074483959935606,
      2.040447887033224,
      2.247456267941743,
      2.1589396790368482,
      2.078597203013487,
      2.063801088021137,
      2.1418435119558126,
      2.1527532959589735,
      2.111943164956756
    ],
    "uuid": "beed4241-0e94-4b1a-a5c8-484acd0be325"
  },
  "anthropic_fast": {
    "result": "// func removeDuplicates(list []int) []int {\n    result := make([]int, 0, len(list))\n    map := make(map[int]bool)\n    \n    for _, v := range list {\n        if !map[v] {\n            map[v] = true\n            result = append(result, v)\n        }\n    }\n    \n    return result\n}",
    "duration": 0.9866055690217763,
    "result_length": 275,
    "average_duration": 1.1642055216943845,
    "raw_durations": [
      0.9866055690217763,
      0.9985036449506879,
      1.5075073511106893
    ],
    "uuid": "f2cc702f-1d1e-41bb-93fb-61201ab5a55e"
  },
  "vertex_combined": {
    "result": "func removeDuplicates(list []int) []int {\n\t// Create a set to store the unique elements of the input list.\n\tset := make(set)\n\n\t// Iterate over the input list and add each element to the set.\n\tfor _, element := range list {\n\t\tset.Add(element)\n\t}\n\n\t// Create a new list with the unique elements of the input list.\n\tnewList := make([]int, 0, len(set))\n\n\t// Iterate over the set and add each element to the new list.\n\tfor element := range set {\n\t\tnewList = append(newList, element)\n\t}\n\n\t// Return the new list without any duplicate elements.\n\treturn newList\n}",
    "duration": 3.7772535759722814,
    "result_length": 555,
    "average_duration": 3.8640816733124668,
    "raw_durations": [
      3.7772535759722814,
      3.975794467027299,
      4.021531346952543,
      3.860957041964866,
      3.8477290800074115,
      3.792782114003785,
      3.7731740300077945,
      3.925812402041629,
      3.8530918990727514,
      3.812690776074305
    ],
    "uuid": "4a151d64-e615-464c-8c36-153870446ac8"
  },
  "vertex_code_bison": {
    "result": "func removeDuplicates(list []int) []int {\n  // Create a set to store the unique elements of the input list.\n  set := make(set)\n\n  // Iterate over the input list and add each element to the set.\n  for _, element := range list {\n    set.Add(element)\n  }\n\n  // Create a new list with the unique elements of the input list.\n  newList := make([]int, 0, len(set))\n\n  // Iterate over the set and add each element to the new list.\n  for element := range set {\n    newList = append(newList, element)\n  }\n\n  // Return the new list without any duplicate elements.\n  return newList\n}",
    "duration": 3.94699165597558,
    "result_length": 571,
    "average_duration": 3.8656918840832075,
    "raw_durations": [
      3.94699165597558,
      4.076891241944395,
      3.8378717879531905,
      3.7823970949975774,
      3.7906432939926162,
      3.949518425972201,
      3.866849416983314,
      3.7831426300108433,
      3.9126299310009927,
      3.709983362001367
    ],
    "uuid": "59f22cdc-bbd1-4314-af56-e4c9460cf8df"
  },
  "vertex_text_bison": {
    "result": "func removeDuplicates(list []int) []int {\n        var result []int\n        for _, v := range list {\n            if !contains(result, v) {\n                result = append(result, v)\n            }\n        }\n        return result\n    }\n",
    "duration": 1.0292112459428608,
    "result_length": 233,
    "average_duration": 1.0371591814910062,
    "raw_durations": [
      1.0292112459428608,
      1.030403058975935,
      1.11514031002298,
      0.935652928892523,
      0.9665117949480191,
      1.0580778630683199,
      1.0765049600740895,
      1.0404148179804906,
      1.0656862569740042,
      1.0539885780308396
    ],
    "uuid": "a630941a-124e-430a-baa0-288fa4099c57"
  },
  "vertex_gecko": {
    "result": "// \tif len(list) == 0 {\n// \t\treturn list\n// \t}\n// \tvar res []int",
    "duration": 1.3468525840435177,
    "result_length": 64,
    "average_duration": 1.405207637604326,
    "raw_durations": [
      1.3468525840435177,
      1.4846165409544483,
      1.3700006250292063,
      1.282495958963409,
      1.245995750068687,
      1.3445783749921247,
      1.5341069999849424,
      1.4773174170404673,
      1.4786080420017242,
      1.4875040829647332
    ],
    "uuid": "5bba88b2-d1eb-465a-81dd-9cd45e01a897"
  },
  "user_intention": "Live Test",
  "language": "golang",
  "prompt": "func removeDuplicates(list []int) []int {",
  "prompt_type": "completion",
  "gitlab_model": {
    "result": "seen := map[int]bool{}\n  result := []int{}\n  for _, v := range list {\n   ",
    "duration": 0.6542060790234245,
    "result_length": 73,
    "average_duration": 0.6391162425104995,
    "uuid": "d462a862-6015-4eb7-b015-3bd13866fd97"
  }
}