{
  "user_intention": "Live Test",
  "language": "javascript",
  "prompt": "// Implement a function to calculate the area of a circle given its radius.",
  "anthropic": {
    "result": "// Implement a function to calculate the area of a circle given its radius.\nfunction calculateArea(radius) {\n  return Math.PI * radius * radius;\n}",
    "duration": 1.5467602999997325,
    "result_length": 146,
    "avg_duration": 1.5687917765055317
  },
  "anthropic_fast": {
    "result": "function areaOfCircle(radius) {\n  return Math.PI * radius * radius; \n}",
    "duration": 0.7494692360050976,
    "result_length": 70,
    "avg_duration": 0.6937229511095211
  },
  "vertex_combined": {
    "result": "area = \u03c0 * radius^2",
    "duration": 3.3091478319838643,
    "result_length": 19,
    "avg_duration": 3.0305539685010445
  },
  "vertex_code_bison": {
    "result": "area = \u03c0 * radius^2",
    "duration": 3.195842763001565,
    "result_length": 19,
    "avg_duration": 3.168678930302849
  },
  "vertex_text_bison": {
    "result": "const areaOfCircle = (radius) => Math.PI * radius * radius;",
    "duration": 0.5361846429877914,
    "result_length": 59,
    "avg_duration": 0.5296939491061494
  },
  "vertex_gecko": {
    "result": ""
  },
  "gitlab_model": {
    "result": "```js\nfunction areaOfCircle(radius) {\n  return Math.PI * radius * radius;\n}\n```",
    "duration": 0.6491732609574683,
    "result_length": 79,
    "avg_duration": 0.6391297477122861
  }
}