{
  "user_intention": "Live Test",
  "language": "python",
  "prompt": "def find_common_elements(list1, list2):",
  "anthropic": {
    "result": "def find_common_elements(list1, list2):\n    common = []\n    for element in list1:\n        if element in list2:\n            common.append(element)\n    return common",
    "duration": 1.5529905190342106,
    "result_length": 163
  },
  "anthropic_fast": {
    "result": "def find_common_elements(list1, list2):\n    list3 = [value for value in list1 if value in list2]    \n    return list3",
    "duration": 0.7698223009938374,
    "result_length": 117,
    "avg_duration": 0.8641915190033614
  },
  "vertex_combined": {
    "result": "def find_common_elements(list1, list2):\n  \"\"\"\n  This function takes two lists as input and returns a list of the elements that are common to both lists.\n\n  Args:\n    list1: The first list.\n    list2: The second list.\n\n  Returns:\n    A list of the elements that are common to both lists.\n  \"\"\"\n\n  # Create a set containing the elements of the first list.\n  set1 = set(list1)\n\n  # Create a set containing the elements of the second list.\n  set2 = set(list2)\n\n  # Find the intersection of the two sets.\n  intersection = set1.intersection(set2)\n\n  # Return the elements of the intersection.\n  return list(intersection)",
    "duration": 3.8271383339888416,
    "result_length": 614,
    "avg_duration": 3.6757101741910447
  },
  "vertex_code_bison": {
    "result": "def find_common_elements(list1, list2):\n  \"\"\"\n  This function takes two lists as input and returns a list of the elements that are common to both lists.\n\n  Args:\n    list1: The first list.\n    list2: The second list.\n\n  Returns:\n    A list of the elements that are common to both lists.\n  \"\"\"\n\n  # Create a set containing the elements of the first list.\n  set1 = set(list1)\n\n  # Create a set containing the elements of the second list.\n  set2 = set(list2)\n\n  # Find the intersection of the two sets.\n  intersection = set1.intersection(set2)\n\n  # Return a list of the elements in the intersection.\n  return list(intersection)",
    "duration": 3.8157867700210772,
    "result_length": 624,
    "avg_duration": 3.5698267787112856
  },
  "vertex_text_bison": {
    "result": "result = []\n     for i in list1:\n         if i in list2:\n             result.append(i)\n     return result",
    "duration": 0.5003765579895116,
    "result_length": 105,
    "avg_duration": 0.5603570080013014
  },
  "vertex_gecko": {
    "result": ""
  },
  "gitlab_model": {
    "result": "\n  \"\"\"Finds common elements in two lists.\n\n  Args:\n    list1: A list of elements.\n    list2:",
    "duration": 0.5986607929808088,
    "result_length": 92,
    "avg_duration": 0.6297906297026202
  }
}