{
  "anthropic": {
    "result": "// struct Calculator {\n    int num1;\n    int num2;\n    char op;\n};",
    "duration": 1.5525042080553249,
    "result_length": 66,
    "average_duration": 1.4431392000056804,
    "raw_durations": [
      1.5525042080553249,
      1.474080519983545,
      1.6766382290516049,
      1.3924027340253815,
      1.584793544956483,
      1.4077913740184158,
      1.28276377893053,
      1.4151868569897488,
      1.2295626680133864,
      1.4156680860323831
    ],
    "uuid": "172f0ec8-e338-4981-952a-fd42689796a2"
  },
  "anthropic_fast": {
    "result": "// struct Calculator {\n   int a;\n   int b;\n   int add();\n   int sub();\n};\n\nint Calculator::add() {\n   return a + b; \n}\n\nint Calculator::sub() {\n   return a - b;\n}",
    "duration": 1.1327065579826012,
    "result_length": 162,
    "average_duration": 1.2219806530862116,
    "raw_durations": [
      1.1327065579826012,
      0.9773009739583358,
      1.0674533640267327,
      1.022094312007539,
      1.0869363420642912,
      1.0831667450256646,
      0.9793079749215394,
      0.9958012299612164,
      2.4945375269744545,
      1.3805015039397404
    ],
    "uuid": "d359290b-0b49-493b-9cda-a3285fbec5e9"
  },
  "vertex_combined": {
    "result": "struct Calculator {\n  int add(int a, int b) {\n    return a + b;\n  }\n\n  int subtract(int a, int b) {\n    return a - b;\n  }\n\n  int multiply(int a, int b) {\n    return a * b;\n  }\n\n  int divide(int a, int b) {\n    return a / b;\n  }\n}",
    "duration": 2.2334284939570352,
    "result_length": 229,
    "average_duration": 2.285178899904713,
    "raw_durations": [
      2.2334284939570352,
      2.268600673065521,
      2.212952821981162,
      2.1867590569891036,
      2.170143525931053,
      2.297600353951566,
      2.203909640084021,
      2.325843587052077,
      2.2275369439739734,
      2.725013902061619
    ],
    "uuid": "de627400-41c8-4486-9d7d-8afddd2a5341"
  },
  "vertex_code_bison": {
    "result": "struct Calculator {\n  int add(int a, int b) {\n    return a + b;\n  }\n\n  int subtract(int a, int b) {\n    return a - b;\n  }\n\n  int multiply(int a, int b) {\n    return a * b;\n  }\n\n  int divide(int a, int b) {\n    return a / b;\n  }\n}",
    "duration": 2.3327312159817666,
    "result_length": 229,
    "average_duration": 2.35590360830538,
    "raw_durations": [
      2.3327312159817666,
      3.0049491259269416,
      2.1771357690449804,
      2.38852668099571,
      2.259490043972619,
      2.341121440054849,
      2.2854800960049033,
      2.235459827934392,
      2.1915272281039506,
      2.3426146550336853
    ],
    "uuid": "9dfb3802-c75c-403b-9ea9-a46b199ff9cf"
  },
  "vertex_text_bison": {
    "result": "struct Calculator {\n        int a;\n        int b;\n    };",
    "duration": 0.5313941580243409,
    "result_length": 56,
    "average_duration": 0.9476489408058114,
    "raw_durations": [
      0.5313941580243409,
      1.0056000329786912,
      0.9736016649985686,
      1.0062710919883102,
      0.9633121130755171,
      0.9724711449816823,
      1.4707001349888742,
      0.5591043130261824,
      1.0142867889953777,
      0.9797479650005698
    ],
    "uuid": "b9c9befd-1627-4e36-9798-80c79d39d9fb"
  },
  "vertex_gecko": {
    "result": "\n//     fn add(&self, x: i32, y: i32) -> i32 {\n//         x + y\n//     }\n// }",
    "duration": 1.316867750021629,
    "result_length": 77,
    "average_duration": 1.376531179319136,
    "raw_durations": [
      1.316867750021629,
      1.3897522080224007,
      1.4409930410329252,
      1.3049191670725122,
      1.3205700420076028,
      1.372521459008567,
      1.4069101669592783,
      1.4127227499848232,
      1.3969874170143157,
      1.4030677920673043
    ],
    "uuid": "b264b554-e203-42b5-a2a1-844b0e995547"
  },
  "user_intention": "Live Test",
  "language": "c",
  "prompt": "struct Calculator {",
  "gitlab_model": {
    "result": "\n    private var accumulator: Double = 0.0\n\n    func add(_ value: Double) {\n        accumulator +=",
    "duration": 0.5917211910127662,
    "result_length": 98,
    "average_duration": 0.6192844907112885,
    "uuid": "807c6c55-71c1-472e-b0f6-0aa4073a5b9a"
  }
}