{
  "user_intention": "Live Test",
  "language": "golang",
  "prompt": "// Write a program to find the common elements between two lists.",
  "anthropic": {
    "result": "package main\n\nimport \"fmt\"\n\nfunc common(list1 []int, list2 []int) []int {\n    var common []int\n    m := make(map[int]bool)\n\n    for _, num := range list1 {\n        m[num] = true\n    }\n\n    for _, num := range list2 {\n        if m[num] {\n            common = append(common, num)\n            m[num] = false\n        }\n    }\n\n    return common\n}\n\nfunc main() {\n    list1 := []int{1, 2, 3, 4, 5}",
    "duration": 3.393124051974155,
    "result_length": 390,
    "avg_duration": 3.760955412889598
  },
  "anthropic_fast": {
    "result": "package main\n\nimport \"fmt\"\n\nfunc main() {\n   list1 := []int{1,2,3,4}\n   list2 := []int{3,4,5,6}\n   \n   // Declare a map to store the count of each element\n   count := make(map[int]int)\n   \n   // Count the frequency of each element of list1\n   for _, v := range list1 {\n       count[v]++\n   }\n   \n   // Count the frequency of each element of list2    \n   for _, v := range list2 {\n      ",
    "duration": 1.3033921489841305,
    "result_length": 386,
    "avg_duration": 1.7195976909832098
  },
  "vertex_combined": {
    "result": "# Create two lists\nlist1 = [1, 2, 3, 4, 5]\nlist2 = [2, 4, 6, 8, 10]\n\n# Create a new list to store the common elements\ncommon_elements = []\n\n# Iterate over the first list\nfor element in list1:\n\n    # Check if the element is in the second list\n    if element in list2:\n\n        # Add the element to the new list\n        common_elements.append(element)\n\n# After iterating over the",
    "duration": 3.8176584310131148,
    "result_length": 377,
    "avg_duration": 3.8344095929991453
  },
  "vertex_code_bison": {
    "result": "# Create two lists\nlist1 = [1, 2, 3, 4, 5]\nlist2 = [2, 3, 5, 6, 7]\n\n# Create a new list to store the common elements\ncommon_elements = []\n\n# Iterate over the first list\nfor element in list1:\n\n    # Check if the element is in the second list\n    if element in list2:\n\n        # Add the element to the new list\n        common_elements.append(element)\n\n# After iterating over the first",
    "duration": 3.892499120964203,
    "result_length": 382,
    "avg_duration": 3.851975450490136
  },
  "vertex_text_bison": {
    "result": "package main\n\n    import (\n        \"fmt\"\n    )\n\n    func main() {\n        list1 := []int{1, 2, 3, 4, 5}\n        list2 := []int{3, 4, 5, 6, 7}\n\n        common := []int{}\n        for _, v := range list1 {\n            for _, w := range list2 {\n                if v == w {\n                    common = append(common, v)\n                }\n            }\n        }\n\n        fmt.Println(common)\n    }",
    "duration": 1.8749651809921488,
    "result_length": 392,
    "avg_duration": 2.6131201023003086
  },
  "vertex_gecko": {
    "result": ""
  },
  "gitlab_model": {
    "result": "```go\npackage main\n\nimport (\n    \"fmt\"\n)\n\nfunc main() {\n    // Create two lists of integers.\n",
    "duration": 0.6222666169633158,
    "result_length": 93,
    "avg_duration": 0.7472392311843578
  }
}