{
  "anthropic": {
    "result": "// void common_elements(int a[], int a_count, int b[], int b_count, int** result, int* result_count) {\n    int i = 0, j = 0; \n    *result_count = 0;\n    while (i < a_count && j < b_count) { \n        if (a[i] < b[j]) \n            i++; \n        else if (a[i] > b[j]) \n            j++; \n        else { \n            *result = realloc(*result, sizeof(int) * (*result_count + 1)); \n            *",
    "duration": 3.3264360500033945,
    "result_length": 389,
    "average_duration": 3.3229058781987986,
    "raw_durations": [
      3.3264360500033945,
      3.141740015009418,
      3.525263304938562,
      3.1836857839953154,
      3.247573657077737,
      3.7622973469551653,
      3.6813932000659406,
      2.9515217379666865,
      3.34556194790639,
      3.063585738069378
    ],
    "uuid": "6706c546-b04b-4d84-b0f0-c49e75728b5a"
  },
  "anthropic_fast": {
    "result": "",
    "uuid": "11b1dc1b-3393-4516-ae94-697c3f62209c"
  },
  "vertex_combined": {
    "result": "void common_elements(int a[], int a_count, int b[], int b_count, int** result, int* result_count) {\n  // Initialize the result array and the result count.\n  *result = malloc(sizeof(int) * a_count);\n  *result_count = 0;\n\n  // Iterate through the arrays `a` and `b`.\n  for (int i = 0; i < a_count; i++) {\n    for (int j = 0; j < b_count; j++) {\n      // If the elements at index `i` of `a` and index `j` of `b`",
    "duration": 3.9373823900241405,
    "result_length": 408,
    "average_duration": 3.8578295005252583,
    "raw_durations": [
      3.9373823900241405,
      3.8298988469177857,
      3.872649190016091,
      3.90607094601728,
      3.8436840140493587,
      3.772873104084283,
      3.8437299380311742,
      3.9473199350759387,
      3.7868173209717497,
      3.837869320064783
    ],
    "uuid": "213518f3-7127-44e8-b3b7-6c0faf2e159e"
  },
  "vertex_code_bison": {
    "result": "void common_elements(int a[], int a_count, int b[], int b_count, int** result, int* result_count) {\n  // Initialize the result array.\n  *result = malloc(sizeof(int) * a_count);\n  *result_count = 0;\n\n  // Iterate over the arrays `a` and `b`.\n  for (int i = 0; i < a_count; i++) {\n    for (int j = 0; j < b_count; j++) {\n      // If the elements at index `i` of `a` and index `j` of `b` are equal, add them to the result array.\n      if (a[i] == b[j]) {\n        (*result)[*result_count] = a[i];\n        (*result_count)++;\n      }\n    }\n  }\n}",
    "duration": 3.850073896930553,
    "result_length": 539,
    "average_duration": 3.836101929527811,
    "raw_durations": [
      3.850073896930553,
      3.9191578220343217,
      3.8339208129327744,
      3.7873188429512084,
      3.8747432510135695,
      3.8665468039689586,
      3.795711781946011,
      3.7718796900007874,
      3.825564463972114
    ],
    "uuid": "dc0bca70-0bd1-4061-9b72-994b54d6d0a1"
  },
  "vertex_text_bison": {
    "result": "void common_elements(int a[], int a_count, int b[], int b_count, int** result, int* result_count) {\n    int i, j, k;\n    int *temp = (int *)malloc(sizeof(int) * (a_count + b_count));\n    int temp_count = 0;\n    for (i = 0; i < a_count; i++) {\n        for (j = 0; j < b_count; j++) {\n            if (a[i] == b[j]) {\n                temp[temp_count++] = a[i];\n            }\n        }\n    }\n    *result_count = temp_count;\n    *result = (int *)malloc(sizeof(int) * temp_count);\n    for (i = 0; i < temp_count; i++) {\n        (*result)[i] = temp[i];\n    }\n    free(temp);\n}\n```",
    "duration": 2.112383218947798,
    "result_length": 573,
    "average_duration": 1.890847294393461,
    "raw_durations": [
      2.112383218947798,
      1.5602003699168563,
      1.5681748539209366,
      1.5587470280006528,
      2.3221423170762137,
      2.117328245076351,
      2.1498104570200667,
      1.745036773965694,
      1.623921366990544,
      2.150728313019499
    ],
    "uuid": "b406a7a5-4f10-4015-b647-939cac06d9df"
  },
  "vertex_gecko": {
    "result": "//     int i, j;\n//     for (i = 0; i < a_count; i++) {\n//         for (j = 0; j < b_count; j++) {\n//             if (a[i] == b[j]) {",
    "duration": 1.4551118749659508,
    "result_length": 133,
    "average_duration": 1.4139486333006062,
    "raw_durations": [
      1.4551118749659508,
      1.4931355830049142,
      1.2932397910626605,
      1.3572497080313042,
      1.5121301669860259,
      1.2836815839400515,
      1.6949943749932572,
      1.1749124999623746,
      1.3586310000391677,
      1.516399750020355
    ],
    "uuid": "f351dc83-6d73-4a7d-a4ed-3d01825b6e75"
  },
  "user_intention": "Live Test",
  "language": "c",
  "prompt": "void common_elements(int a[], int a_count, int b[], int b_count, int** result, int* result_count) {",
  "prompt_type": "completion",
  "gitlab_model": {
    "result": "int i, j, k = 0;\n    *result_count = 0;\n    int* temp = (int*)malloc",
    "duration": 0.6493687860202044,
    "result_length": 68,
    "average_duration": 0.6202685615106021,
    "uuid": "7ed14bd6-563b-495e-854b-c8669f086e63"
  }
}