{
  "user_intention": "Live Test",
  "language": "javascript",
  "prompt": "const bookAuthorMap = {",
  "anthropic": {
    "result": ""
  },
  "anthropic_fast": {
    "result": "const bookAuthorMap = {\n      'The Hobbit': 'J. R. R. Tolkien',\n      'Harry Potter': 'J. K. Rowling',\n      'The Hunger Games': 'Suzanne Collins'\n    }",
    "duration": 0.9497732040035771,
    "result_length": 152,
    "avg_duration": 1.1183455608028452
  },
  "vertex_combined": {
    "result": "const bookAuthorMap = {\n  \"The Hitchhiker's Guide to the Galaxy\": \"Douglas Adams\",\n  \"The Catcher in the Rye\": \"J.D. Salinger\",\n  \"To Kill a Mockingbird\": \"Harper Lee\",\n  \"1984\": \"George Orwell\",\n  \"Animal Farm\": \"George Orwell\"\n};",
    "duration": 3.0119867189932847,
    "result_length": 231
  },
  "vertex_code_bison": {
    "result": ""
  },
  "vertex_text_bison": {
    "result": "\"The Great Gatsby\": \"F. Scott Fitzgerald\",\n     \"1984\": \"George Orwell\",\n     \"To Kill a Mockingbird\": \"Harper Lee\",\n     \"The Catcher in the Rye\": \"J.D. Salinger\",\n     \"Fahrenheit 451\": \"Ray Bradbury\",\n     \"The Lord of the Rings\": \"J.R.R. Tolkien\",\n     \"Harry Potter and the Sorcerer's Stone\": \"J.K. Rowling\",\n     \"The Hitchhiker's Guide to the Galaxy\": \"Douglas Adams\",\n     \"The Color Purple\": \"Alice Walker\",\n     \"Beloved\": \"Toni Morrison\",\n     \"The Joy Luck Club\": \"Amy Tan\",\n     \"The Namesake\": \"Jhumpa Lahiri\",\n     \"The Kite Runner\": \"Khaled Hosseini\",\n     \"The Alchemist\": \"Paulo Coelho\",\n     \"The Girl with the Dragon Tattoo\": \"Stieg Larsson\",\n     \"The Hunger Games\": \"Suzanne Collins\",\n     \"Divergent\": \"Veronica Roth\",\n     \"The Fault in Our Stars\": \"John Green\",\n     \"Looking for Alaska\": \"John Green\",\n",
    "duration": 2.066919313991093,
    "result_length": 828,
    "avg_duration": 2.0917405496991703
  },
  "vertex_gecko": {
    "result": ""
  },
  "gitlab_model": {
    "result": "\n  '1': 'John McKinley',\n  '2': 'James McKinley',\n  '3': 'John Brown',\n  '4': 'John McKinley',",
    "duration": 0.5864396950055379,
    "result_length": 94,
    "avg_duration": 0.5935492332020658
  }
}