{
  "anthropic": {
    "result": "def calculate_sum(numbers):\n    sum = 0\n    for num in numbers:\n        sum += num\n    return sum",
    "duration": 1.1662449310533702,
    "result_length": 97,
    "average_duration": 1.2902155602787388,
    "raw_durations": [
      1.1662449310533702,
      1.2088427579728886,
      1.5744065210456029,
      1.3668856549775228,
      1.1953033719910309,
      1.2155447960831225,
      1.3164402740076184,
      1.2780561750987545
    ],
    "uuid": "801609f4-4f76-4268-9afd-6c41c3e0c95c"
  },
  "anthropic_fast": {
    "result": "# def calculate_sum(numbers):  \ndef calculate_sum(numbers):\n    total = 0\n    for number in numbers:\n        total += number\n    return total",
    "duration": 0.6522879179101437,
    "result_length": 141,
    "average_duration": 0.7506016868166625,
    "raw_durations": [
      0.6522879179101437,
      0.6741548500722274,
      0.6928350910311565,
      0.6667005809722468,
      1.4028194909915328,
      0.7478365909773856,
      0.6541823240695521,
      0.6643187750596553,
      0.6554961380315945,
      0.6953851090511307
    ],
    "uuid": "fc87a5b3-1e2d-4e8c-ad80-0d52bfac1b91"
  },
  "vertex_combined": {
    "result": "def calculate_sum(numbers):\n  \"\"\"Calculates the sum of a list of numbers.\n\n  Args:\n    numbers: A list of numbers.\n\n  Returns:\n    The sum of the numbers in the list.\n  \"\"\"\n\n  sum = 0\n  for number in numbers:\n    sum += number\n\n  return sum",
    "duration": 3.447896223049611,
    "result_length": 240,
    "average_duration": 2.995577665104065,
    "raw_durations": [
      3.447896223049611,
      1.8745259959250689,
      1.8916873791022226,
      3.5075258589349687,
      3.48314627003856,
      3.5035042259842157,
      1.7964378419565037,
      3.5248837820254266,
      3.4980744540225714,
      3.4280946200015023
    ],
    "uuid": "39613e95-8f50-46ba-a2fd-02b3f158bc87"
  },
  "vertex_code_bison": {
    "result": "def calculate_sum(numbers):\n  \"\"\"Calculates the sum of a list of numbers.\n\n  Args:\n    numbers: A list of numbers.\n\n  Returns:\n    The sum of the numbers in the list.\n  \"\"\"\n\n  sum = 0\n  for number in numbers:\n    sum += number\n\n  return sum",
    "duration": 3.395854167989455,
    "result_length": 240,
    "average_duration": 2.072367529408075,
    "raw_durations": [
      3.395854167989455,
      1.7969284489518031,
      1.904928139061667,
      1.783857694012113,
      1.902086508111097,
      1.9135496499948204,
      1.796820109942928,
      2.437611719011329,
      1.876617819070816,
      1.9154210379347205
    ],
    "uuid": "6a07e871-ad32-4444-8293-5fa92217633b"
  },
  "vertex_text_bison": {
    "result": "def calculate_sum(numbers):\r\n    total = 0\r\n    for number in numbers:\r\n        total += number\r\n    return total\n```",
    "duration": 0.6827448710100725,
    "result_length": 117,
    "average_duration": 0.7494906189152971,
    "raw_durations": [
      0.6827448710100725,
      0.7286023810738698,
      0.7775552179664373,
      0.7785461060702801,
      0.7817368989344686,
      0.7173791590612382,
      0.7230449239723384,
      0.7636068030260503,
      0.7443472689483315,
      0.7973425590898842
    ],
    "uuid": "4831aa5d-c588-45dd-9a8a-0dfd78b5388e"
  },
  "vertex_gecko": {
    "result": "#     return sum(numbers)\n\n# print(calculate_sum([1, 2, 3, 4, 5]))",
    "duration": 1.3258112920448184,
    "result_length": 66,
    "average_duration": 1.4327093500993215,
    "raw_durations": [
      1.3258112920448184,
      1.409768250072375,
      1.514408708899282,
      1.3771910420618951,
      1.484458458959125,
      1.3762497080024332,
      1.400014957995154,
      1.4787699580192566,
      1.4765008329413831,
      1.4839202919974923
    ],
    "uuid": "2a6bb1ac-c86c-458a-a317-dd0d7a3b5493"
  },
  "user_intention": "Live Test",
  "language": "python",
  "prompt": "def calculate_sum(numbers):",
  "prompt_type": "completion",
  "gitlab_model": {
    "result": "sum = 0\n  for number in numbers:\n    sum += number\n  return sum\n```",
    "duration": 0.6674398549948819,
    "result_length": 67,
    "average_duration": 0.6368343606009148,
    "uuid": "89a230e5-f638-40ba-aba6-605bddf9e506"
  }
}