{
  "anthropic": {
    "result": "function largest(list) {\n  let largest = list[0];\n  for (let i = 1; i < list.length; i++) {\n    if (list[i] > largest) {\n      largest = list[i];\n    }\n  }\n  return largest;\n}",
    "duration": 1.8659043000079691,
    "result_length": 175,
    "average_duration": 1.9836565375095234,
    "raw_durations": [
      1.8659043000079691,
      2.3014935449464247,
      2.1931945170508698,
      1.8336017479887232,
      1.6754291909746826,
      2.239751087035984,
      1.943235812941566,
      1.9049203890608624,
      1.843290560063906,
      2.0357442250242457
    ],
    "uuid": "edfe57aa-a0e0-44d1-be3d-541edc432489"
  },
  "anthropic_fast": {
    "result": "function findLargest(list) {\n  let largest = list[0];  \n  for(let i = 1; i < list.length; i++) {\n    if(list[i] > largest) {\n      largest = list[i];\n    }\n  }\n  return largest;\n}",
    "duration": 1.3806216570083052,
    "result_length": 179,
    "average_duration": 1.9591120023978874,
    "raw_durations": [
      1.3806216570083052,
      3.033097284962423,
      4.569277138914913,
      2.5512894729617983,
      1.264997930964455,
      1.6798414980294183,
      1.206765791052021,
      1.155403156997636,
      1.6607947100419551,
      1.089031383045949
    ],
    "uuid": "0b39fd0f-575f-4f03-ad92-1e0da8795315"
  },
  "vertex_combined": {
    "result": "def find_largest_element(list):\n  \"\"\"Finds the largest element in a list.\n\n  Args:\n    list: A list of elements.\n\n  Returns:\n    The largest element in the list.\n  \"\"\"\n\n  largest_element = list[0]\n  for element in list:\n    if element > largest_element:\n      largest_element = element\n  return largest_element",
    "duration": 3.2066585910506546,
    "result_length": 310,
    "average_duration": 3.2014248038874937,
    "raw_durations": [
      3.2066585910506546,
      3.1991009149933234,
      3.2959278180496767,
      3.274736837949604,
      3.1013432709733024,
      3.079324933933094,
      3.2282380500109866,
      3.172162357950583,
      3.2093802340095863,
      3.247375029954128
    ],
    "uuid": "302a36e9-5f21-4a6a-b52a-c91c3666d6e1"
  },
  "vertex_code_bison": {
    "result": "def find_largest_element(list):\n  \"\"\"Finds the largest element in a list.\n\n  Args:\n    list: The list to search.\n\n  Returns:\n    The largest element in the list.\n  \"\"\"\n\n  largest_element = list[0]\n  for element in list:\n    if element > largest_element:\n      largest_element = element\n\n  return largest_element",
    "duration": 3.205432750051841,
    "result_length": 311,
    "average_duration": 3.294192281796131,
    "raw_durations": [
      3.205432750051841,
      3.220418953918852,
      3.2152667910559103,
      3.3080562909599394,
      3.218571376055479,
      3.20081199798733,
      3.2134447989519686,
      3.903038045973517,
      3.2226855779299513,
      3.2341962350765243
    ],
    "uuid": "d725ad40-aaf3-40ef-955f-d06f34533654"
  },
  "vertex_text_bison": {
    "result": "const findLargest = (arr) => {\n      let largest = arr[0];\n      for (let i = 1; i < arr.length; i++) {\n        if (arr[i] > largest) {\n          largest = arr[i];\n        }\n      }\n      return largest;\n    };",
    "duration": 1.1524147350573912,
    "result_length": 210,
    "average_duration": 1.165553526103031,
    "raw_durations": [
      1.1524147350573912,
      1.1636643259553239,
      1.1555064520798624,
      1.1434304419672117,
      1.1550854530651122,
      1.1657550419913605,
      1.1824312700191513,
      1.2074390120105818,
      1.1812676849076524,
      1.1485408439766616
    ],
    "uuid": "b5caf829-cb65-4bb6-977f-e19fbc14673a"
  },
  "vertex_gecko": {
    "result": "// Example:\n\n// Input: 4 5 1 9 4 5 1 2 7",
    "duration": 1.2974062080029398,
    "result_length": 40,
    "average_duration": 1.3832223166828044,
    "raw_durations": [
      1.2974062080029398,
      1.5164268750231713,
      1.409121291944757,
      1.4956034999340773,
      1.3576136250048876,
      1.354820542037487,
      1.3382811249466613,
      1.4843560829758644,
      1.2903531669871882,
      1.2882407499710098
    ],
    "uuid": "15fef2dd-ddb3-40b5-940d-49c565ca72e6"
  },
  "user_intention": "Live Test",
  "language": "javascript",
  "prompt": "// Implement a function to find the largest element in a list.",
  "prompt_type": "generation",
  "gitlab_model": {
    "result": "let largest = list[0];\n  for (let i = 1; i < list.",
    "duration": 0.6047972629894502,
    "result_length": 50,
    "average_duration": 0.6187537838879507,
    "uuid": "f6cbb817-afd0-40f2-a0c1-d3ae4f672972"
  }
}