{
  "user_intention": "Live Test",
  "language": "javascript",
  "prompt": "// Implement a function to find the largest element in a list.",
  "anthropic": {
    "result": "function largest(list) {\n  let largest = list[0];\n  for (let i = 1; i < list.length; i++) {\n    if (list[i] > largest) {\n      largest = list[i];\n    }\n  }\n  return largest;\n}",
    "duration": 1.444332894985564,
    "result_length": 175,
    "avg_duration": 1.9289898231101688
  },
  "anthropic_fast": {
    "result": "function findLargest(list) {\n  let largest = list[0];  \n  for (let i = 1; i < list.length; i++) {\n    if (list[i] > largest) {\n      largest = list[i];\n    }\n  }\n  return largest;\n}",
    "duration": 0.8567203599959612,
    "result_length": 181,
    "avg_duration": 0.9087405746919103
  },
  "vertex_combined": {
    "result": "def find_largest_element(list):\n  \"\"\"Finds the largest element in a list.\n\n  Args:\n    list: The list to search.\n\n  Returns:\n    The largest element in the list.\n  \"\"\"\n\n  largest_element = list[0]\n  for element in list:\n    if element > largest_element:\n      largest_element = element\n\n  return largest_element",
    "duration": 3.121245493995957,
    "result_length": 311,
    "avg_duration": 3.2050251577049496
  },
  "vertex_code_bison": {
    "result": "def find_largest_element(list):\n  \"\"\"Finds the largest element in a list.\n\n  Args:\n    list: The list to search.\n\n  Returns:\n    The largest element in the list.\n  \"\"\"\n\n  largest_element = list[0]\n  for element in list:\n    if element > largest_element:\n      largest_element = element\n\n  return largest_element",
    "duration": 3.165635759010911,
    "result_length": 311,
    "avg_duration": 3.1949778944079297
  },
  "vertex_text_bison": {
    "result": "const findLargest = (list) => {\n      let largest = list[0];\n      for (let i = 1; i < list.length; i++) {\n        if (list[i] > largest) {\n          largest = list[i];\n        }\n      }\n      return largest;\n    };",
    "duration": 0.8077959200018086,
    "result_length": 215,
    "avg_duration": 0.8462619448953774
  },
  "vertex_gecko": {
    "result": ""
  },
  "gitlab_model": {
    "result": "```function findLargest(list) {\n  let largest = list[0];\n  for (let i = 1; i < list.",
    "duration": 0.6047972629894502,
    "result_length": 84,
    "avg_duration": 0.6187537838879507
  }
}