{
  "anthropic": {
    "result": "#include <stdio.h>\n\nint main() {\n    int list[] = {1, 2, 6, 4, 2, 3, 2};\n    int count[10] = {0};\n    \n    for (int i = 0; i < 7; i++) {\n        count[list[i]]++;\n    }\n    \n    for (int i = 0; i < 10; i++) {\n        if (count[i] > 0) {\n            printf(\"%d occurs %d times\\n\", i, count[i]);\n        }\n    }\n}",
    "duration": 3.5754788370104507,
    "result_length": 311,
    "average_duration": 3.4978824831894597,
    "raw_durations": [
      3.5754788370104507,
      3.6927473350660875,
      3.4034030999755487,
      3.3068476809421554,
      3.651351852924563,
      3.5487823829753324,
      3.724945077090524,
      3.3393152869539335,
      3.386030680965632,
      3.3499225979903713
    ],
    "uuid": "14988a28-191e-49ee-ae53-722fe9bb90bd"
  },
  "anthropic_fast": {
    "result": "#include <stdio.h>\n\nint main() {\n   int arr[100], freq[100] = {0}, i, j, max = -1;\n\n   printf(\"Enter the size of array: \");\n   scanf(\"%d\", &n);\n\n   printf(\"Enter array elements: \");\n   for (i = 0; i < n; i++) {\n      scanf(\"%d\", &arr[i]);\n      freq[arr[i]]++;  \n      if (arr[i] > max)  \n         max = arr[i];\n   }\n\n  ",
    "duration": 1.610618285019882,
    "result_length": 320,
    "average_duration": 1.8074591185897588,
    "raw_durations": [
      1.610618285019882,
      3.532909591915086,
      1.8597098370082676,
      1.6619118299568072,
      1.4363043889170513,
      1.3971864189952612,
      2.0263427309691906,
      1.4354208160657436,
      1.5027197970775887,
      1.6114674899727106
    ],
    "uuid": "3c29832d-cb38-4e2e-b8ae-d726ea883358"
  },
  "vertex_combined": {
    "result": "# Create a list of elements.\nelements = ['a', 'b', 'c', 'd', 'a', 'b', 'c']\n\n# Create a dictionary to store the results.\nresults = {}\n\n# Iterate over the list.\nfor element in elements:\n\n    # Check if the element is already in the dictionary.\n    if element not in results:\n        # If it is not in the dictionary, add it to",
    "duration": 3.8484896370209754,
    "result_length": 325,
    "average_duration": 3.863833847793285,
    "raw_durations": [
      3.8484896370209754,
      3.790327280992642,
      3.8362463479861617,
      3.848052253946662,
      3.8597952720010653,
      3.8240395960165188,
      3.846681850962341,
      3.921934974961914,
      3.940369841060601,
      3.9224014229839668
    ],
    "uuid": "c3734781-5730-4ee9-af26-c9290639fe40"
  },
  "vertex_code_bison": {
    "result": "# Create a list of numbers.\nnumbers = [1, 2, 3, 4, 5, 6, 7, 8, 9, 10]\n\n# Create a dictionary to store the results.\nresults = {}\n\n# Iterate over the list.\nfor number in numbers:\n\n    # Check if the number is already in the dictionary.\n    if number not in results:\n        # If it is not in the dictionary, add it to the dictionary with",
    "duration": 3.8635563859716058,
    "result_length": 335,
    "average_duration": 3.8607459385995755,
    "raw_durations": [
      3.8635563859716058,
      3.840379428002052,
      3.854322020080872,
      3.78006327804178,
      3.8262327309930697,
      3.86986663704738,
      3.930730781983584,
      3.9421951189870015,
      3.8346717179520056,
      3.8654412869364023
    ],
    "uuid": "ece53a6a-ea8a-4ad2-b8ed-97b051e8d71b"
  },
  "vertex_text_bison": {
    "result": "#include <stdio.h>\n#include <stdlib.h>\n\nint main()\n{\n    int n, i, j, count;\n    scanf(\" %d \", &n);\n    int a[n];\n    for (i = 0; i < n; i++)\n    {\n        scanf(\" %d \", &a[i]);\n    }\n    for (i = 0; i < n; i++)\n    {\n        count = 0;\n        for (j = 0; j < n; j++)\n        {\n            if (a[i] == a[j])\n            {\n                count++;\n            }\n        }\n        printf(\" %d \", count);\n    }\n    return 0;\n}\n```",
    "duration": 1.942732651019469,
    "result_length": 428,
    "average_duration": 1.9856927449000068,
    "raw_durations": [
      1.942732651019469,
      1.9592621850315481,
      2.357340586022474,
      1.9890914619900286,
      1.9293956679757684,
      1.9433959239395335,
      1.949550047982484,
      1.8627337290672585,
      1.9509015979710966,
      1.9725235980004072
    ],
    "uuid": "6aeb7b2d-e164-4d2e-a0b3-4dec605c0500"
  },
  "vertex_gecko": {
    "result": "import java.util.ArrayList;\nimport java.util.List;",
    "duration": 1.3111794590950012,
    "result_length": 50,
    "average_duration": 1.3708156874985433,
    "raw_durations": [
      1.3111794590950012,
      1.3875457079848275,
      1.4809962910367176,
      1.383329042000696,
      1.269317957921885,
      1.3437718329951167,
      1.3139792500296608,
      1.4740668749436736,
      1.3716260839719325,
      1.3723443750059232
    ],
    "uuid": "af664c96-a3e5-4e11-b761-6d3de21e9e39"
  },
  "user_intention": "Live Test",
  "language": "c",
  "prompt": "// Write a program to count the number of occurrences of each element in a list.",
  "prompt_type": "generation",
  "gitlab_model": {
    "result": "def count_occurrences(list1):\n  \"\"\"Counts the number of occurrences of each element in a list.\n\n  ",
    "duration": 0.6103020689915866,
    "result_length": 98,
    "average_duration": 0.6308880411961582,
    "uuid": "ad608401-c2d9-4196-8a21-9b2813df4795"
  }
}