{
  "anthropic": {
    "result": "def is_prime(n): \n    if n <= 1: \n        return False\n    for i in range(2, n): \n        if n % i == 0: \n            return False\n    return True",
    "duration": 1.740966483950615,
    "result_length": 146,
    "average_duration": 1.6138439520960675,
    "raw_durations": [
      1.740966483950615,
      1.6678637739969417,
      1.7519029719987884,
      1.5273015790153295,
      1.6756232950137928,
      1.4946674000239,
      1.5381423919461668,
      1.4807227200362831,
      1.7623124800156802,
      1.4989364249631763
    ],
    "uuid": "1e76b332-d737-4a9e-851a-804709d42882"
  },
  "anthropic_fast": {
    "result": "def is_prime(num):\n    if num == 1:\n        return False  \n    for n in range(2,num):\n       if num % n == 0:\n           return False\n    return True",
    "duration": 1.0310065200319514,
    "result_length": 149,
    "average_duration": 0.9772663466399536,
    "raw_durations": [
      1.0310065200319514,
      1.1322874340694398,
      0.8536170150619,
      0.951146703097038,
      0.8785720490850508,
      0.888473984086886,
      0.8769083789084107,
      0.8999707750044763,
      1.37534134904854,
      0.8853392580058426
    ],
    "uuid": "f85f93f5-a006-4196-bb47-bb45a4ad868a"
  },
  "vertex_combined": {
    "result": "def is_prime(n):\n  \"\"\"\n  Checks if a given number is prime.\n\n  Args:\n    n: The number to check.\n\n  Returns:\n    True if n is prime, False otherwise.\n  \"\"\"\n\n  # Check if n is divisible by 2.\n  if n % 2 == 0:\n    return False\n\n  # Check if n is divisible by any number from 3 to the square root of n.\n  for i in range(3, int(n ** 0.5) + 1, 2):\n    if n % i == 0:\n      return False\n\n  # If n is not divisible by any number from 2 to the square root of n, then it is prime.\n  return True",
    "duration": 3.875242229900323,
    "result_length": 485,
    "average_duration": 3.7034335776930676,
    "raw_durations": [
      3.875242229900323,
      3.7722495920024812,
      3.8220246030250564,
      3.895148367038928,
      3.7464309750357643,
      3.1197622729232535,
      3.848075899994001,
      3.8482560670236126,
      3.9943110069725662,
      3.112834763014689
    ],
    "uuid": "d20cbdaa-04ae-4d05-8e5b-0b0685cb6b04"
  },
  "vertex_code_bison": {
    "result": "def is_prime(n):\n  \"\"\"\n  Checks if a given number is prime.\n\n  Args:\n    n: The number to check.\n\n  Returns:\n    True if n is prime, False otherwise.\n  \"\"\"\n\n  # Check if n is divisible by 2.\n  if n % 2 == 0:\n    return False\n\n  # Check if n is divisible by any number from 3 to the square root of n.\n  for i in range(3, int(n ** 0.5) + 1, 2):\n    if n % i == 0:\n      return False\n\n  # If n is not divisible by any number from 2 to the square root of n, then it is prime.\n  return True",
    "duration": 3.752054195967503,
    "result_length": 485,
    "average_duration": 3.7073944660951383,
    "raw_durations": [
      3.752054195967503,
      3.853187886066735,
      3.79335757100489,
      3.770826199906878,
      3.8801992390071973,
      3.874091207049787,
      3.990717888926156,
      3.1816119109280407,
      3.184562813024968,
      3.7933357490692288
    ],
    "uuid": "b3073bf9-f705-427d-9624-55ca81ccace8"
  },
  "vertex_text_bison": {
    "result": "def is_prime(n):\n        if n <= 1:\n            return False\n        for i in range(2, int(n**0.5) + 1):\n            if n % i == 0:\n                return False\n        return True",
    "duration": 0.816727971076034,
    "result_length": 180,
    "average_duration": 0.8085358463344164,
    "raw_durations": [
      0.816727971076034,
      0.7386579039739445,
      0.8208390300860628,
      0.8218943540705368,
      0.9158308110199869,
      0.7927504370454699,
      0.8000530360732228,
      0.7904239880153909,
      0.8225275189615786,
      0.765653413021937
    ],
    "uuid": "c9c2f648-48a7-49ab-801b-c677966653c5"
  },
  "vertex_gecko": {
    "result": "\n\ndef is_prime(n):\n    if n == 1:\n        return False",
    "duration": 1.4574233749881387,
    "result_length": 54,
    "average_duration": 1.4683821747777983,
    "raw_durations": [
      1.4574233749881387,
      1.5284184580668807,
      1.4065729159628972,
      1.5655257500475273,
      1.4837694159941748,
      1.4107701249886304,
      1.4724234999157488,
      1.5862349579110742,
      1.3824542079819366,
      1.3902290419209749
    ],
    "uuid": "4549d00a-a768-4977-a44b-534c83480e3b"
  },
  "user_intention": "Live Test",
  "language": "python",
  "prompt": "Implement a function to check if a given number is prime.",
  "gitlab_model": {
    "result": "```python\ndef is_prime(n):\n    if n < 2:\n        return False\n    for i in range",
    "duration": 0.9179873949906323,
    "result_length": 80,
    "average_duration": 0.6871083381935023,
    "uuid": "63e321a7-b381-49f9-bf34-48e1786185ce"
  }
}