{
  "anthropic": {
    "result": "// Implement a function to find the factorial of a given number.\nfunction factorial(n) {\n  if (n === 1) return 1;\n  return n * factorial(n-1);\n}",
    "duration": 1.5420561149949208,
    "result_length": 144,
    "average_duration": 1.9972056588158011,
    "raw_durations": [
      1.5420561149949208,
      1.567339219036512,
      2.029664444969967,
      2.154802509001456,
      1.8877113519702107,
      2.39168016705662,
      2.077131737023592,
      2.1552762059727684,
      2.1219037750270218,
      2.0444910631049424
    ],
    "uuid": "6598002a-f98c-4fa0-82bc-85394d478020"
  },
  "anthropic_fast": {
    "result": "function factorial(n) {\n  if (n === 1) return 1;  \n  return n * factorial(n-1);\n}",
    "duration": 2.489294319995679,
    "result_length": 81,
    "average_duration": 1.4588219203054904,
    "raw_durations": [
      2.489294319995679,
      0.8284036270342767,
      0.7993135320721194,
      1.2697675870731473,
      0.8714266919996589,
      1.4548886329866946,
      0.9547147050034255,
      0.8360054979566485,
      1.2205249449471012,
      3.863879663986154
    ],
    "uuid": "93711946-2ac6-464d-9ef0-9a176b3ee1cc"
  },
  "vertex_combined": {
    "result": "def factorial(n):\n  \"\"\"\n  This function returns the factorial of a given number.\n\n  Args:\n    n: The number to find the factorial of.\n\n  Returns:\n    The factorial of `n`.\n  \"\"\"\n\n  if n < 0:\n    raise ValueError(\"The factorial of a negative number is not defined.\")\n\n  if n == 0:\n    return 1\n\n  return n * factorial(n - 1)",
    "duration": 2.812006880994886,
    "result_length": 323,
    "average_duration": 2.7827255591168067,
    "raw_durations": [
      2.812006880994886,
      2.829290993977338,
      2.748555485974066,
      2.815580824040808,
      2.729406989994459,
      2.7336054330226034,
      2.7368243120145053,
      2.8415614820551127,
      2.8290457150433213,
      2.751377474050969
    ],
    "uuid": "13a4c642-1b50-45be-90c5-4b8f4484cefa"
  },
  "vertex_code_bison": {
    "result": "def factorial(n):\n  \"\"\"\n  This function returns the factorial of a given number.\n\n  Args:\n    n: The number to find the factorial of.\n\n  Returns:\n    The factorial of n.\n  \"\"\"\n\n  if n < 0:\n    raise ValueError(\"n must be non-negative\")\n\n  if n == 0:\n    return 1\n\n  return n * factorial(n - 1)",
    "duration": 2.8915374850621447,
    "result_length": 293,
    "average_duration": 2.875428469607141,
    "raw_durations": [
      2.8915374850621447,
      2.732344579999335,
      2.812572369002737,
      2.840193829033524,
      3.5257383899297565,
      2.814407636062242,
      2.8290960380109027,
      2.7447343199746683,
      2.7318412449676543,
      2.831818804028444
    ],
    "uuid": "b1e1eebe-f65b-461d-91d8-92b50d42f2cd"
  },
  "vertex_text_bison": {
    "result": "function factorial(n) {\n        if (n === 0) {\n            return 1;\n        }\n        return n * factorial(n - 1);\n    }",
    "duration": 0.7268207509769127,
    "result_length": 121,
    "average_duration": 0.7254824978066609,
    "raw_durations": [
      0.7268207509769127,
      0.6843528640456498,
      0.705909525975585,
      0.6995823909528553,
      0.718933945056051,
      0.7279480450088158,
      0.7711922329617664,
      0.7300615040585399,
      0.7476204320555553,
      0.7424032869748771
    ],
    "uuid": "22b61741-d75a-46fd-afec-e8b53ad8909e"
  },
  "vertex_gecko": {
    "result": "#include <stdio.h>\n\nint factorial(int n)",
    "duration": 1.3599173330003396,
    "result_length": 40,
    "average_duration": 1.3737243292969652,
    "raw_durations": [
      1.3599173330003396,
      1.4585032919421792,
      1.3050170419737697,
      1.366476709023118,
      1.4010961669264361,
      1.3850250409450382,
      1.3241220840718597,
      1.4181693750433624,
      1.4246532500255853,
      1.2942630000179633
    ],
    "uuid": "b7bf1bf7-2f86-4417-b0f0-c70bf9319d60"
  },
  "user_intention": "Live Test",
  "language": "javascript",
  "prompt": "// Implement a function to find the factorial of a given number.",
  "prompt_type": "generation",
  "gitlab_model": {
    "result": "if (n === 0) {\n    return 1;\n  }\n  return n * factorial",
    "duration": 0.621693602995947,
    "result_length": 55,
    "average_duration": 0.6404932469013147,
    "uuid": "8d475a85-29f4-4df3-b3a0-ae7edee9d913"
  }
}