{
  "anthropic": {
    "result": "# title_to_author_map():\ndef title_to_author_map(titles):\n    author_map = {}\n    for title in titles:\n        author, book = title.split(' by ')\n        if author not in author_map:\n            author_map[author] = []\n        author_map[author].append(book)\n    return author_map",
    "duration": 2.610282541019842,
    "result_length": 280,
    "average_duration": 2.5818665598984807,
    "raw_durations": [
      2.610282541019842,
      2.47537643101532,
      2.002525190007873,
      2.5869025309802964,
      2.793183262925595,
      2.0532168679637834,
      2.8588625619886443,
      3.377840775065124,
      2.7734601410338655,
      2.287015296984464
    ],
    "uuid": "41ae6bad-4a28-4c31-ac9a-ada92da569e9"
  },
  "anthropic_fast": {
    "result": "# title_to_author_map():\ndef title_to_author_map():\n    title_to_author = {\n        \"Harry Potter\" : \"J. K. Rowling\",\n        \"The Hobbit\" : \"J. R. R. Tolkien\"\n    }\nreturn title_to_author",
    "duration": 0.9929020029958338,
    "result_length": 188,
    "average_duration": 1.2819161290923755,
    "raw_durations": [
      0.9929020029958338,
      0.9947974450187758,
      1.1066749410238117,
      2.7101608159719035,
      1.198119574924931,
      1.1397634329041466,
      1.0890165020246059,
      1.1258449970046058,
      1.179965449962765
    ],
    "uuid": "8e33acef-7a07-4b50-9755-9822566151cc"
  },
  "vertex_combined": {
    "result": "[{'title': 'The Great Gatsby', 'author': 'F. Scott Fitzgerald'},\n {'title': 'To Kill a Mockingbird', 'author': 'Harper Lee'},\n {'title': '1984', 'author': 'George Orwell'}]",
    "duration": 3.789854104979895,
    "result_length": 172,
    "average_duration": 3.343201841507107,
    "raw_durations": [
      3.789854104979895,
      3.737084951950237,
      3.338362736045383,
      3.0399697000393644,
      3.3737710040295497,
      3.3796310940524563,
      3.1288629960035905,
      3.029238131013699,
      3.1762948039686307,
      3.4389488929882646
    ],
    "uuid": "f853ab0a-46de-47fe-95ed-b0bb5ceb07d7"
  },
  "vertex_code_bison": {
    "result": "[{'title': 'The Great Gatsby', 'author': 'F. Scott Fitzgerald'},\n {'title': 'To Kill a Mockingbird', 'author': 'Harper Lee'},\n {'title': '1984', 'author': 'George Orwell'}]",
    "duration": 3.2054684379836544,
    "result_length": 172,
    "average_duration": 3.1784978587995285,
    "raw_durations": [
      3.2054684379836544,
      3.0489531230414286,
      3.0966323009924963,
      3.314245081972331,
      3.1360994009301066,
      3.0795023440150544,
      3.1862042280845344,
      3.175521092955023,
      3.202324668993242,
      3.3400279090274125
    ],
    "uuid": "c9afd90e-8a65-4cf9-80b5-200232228445"
  },
  "vertex_text_bison": {
    "result": "def title_to_author_map():\n        \"\"\"\n        Returns a map from title to author.\n        \"\"\"\n        title_to_author_map = {}\n        for book in books:\n            title_to_author_map[book.title] = book.author\n        return title_to_author_map\n",
    "duration": 2.364208223996684,
    "result_length": 248,
    "average_duration": 2.339930044708308,
    "raw_durations": [
      2.364208223996684,
      2.3779750670073554,
      2.3663616890553385,
      2.3003702730638906,
      2.3605606129858643,
      2.3600539970211685,
      2.3639606119832024,
      2.300961581990123,
      2.3175284740282223,
      2.2873199159512296
    ],
    "uuid": "2655f4fa-b12e-4af4-981a-b25b0ebc095c"
  },
  "vertex_gecko": {
    "result": "\n#     \"title\": \"title\",\n#     \"author\": \"author\",\n#     \"year\": \"year\",\n#     \"journal\": \"journal\",",
    "duration": 1.4159089580643922,
    "result_length": 100,
    "average_duration": 1.371961825096514,
    "raw_durations": [
      1.4159089580643922,
      1.3892391249537468,
      1.372917167027481,
      1.2783916250336915,
      1.3731232909485698,
      1.3851068340009078,
      1.3471599170006812,
      1.2975592919392511,
      1.41805466695223,
      1.4421573750441894
    ],
    "uuid": "abdedc4b-e8d9-4cda-8de8-63b305c6a85a"
  },
  "user_intention": "Live Test",
  "language": "python",
  "prompt": " def title_to_author_map():",
  "gitlab_model": {
    "result": "```python\ndef title_to_author_map():\n\n  \"\"\"Returns a map from title to author.\n\n  This is used to get",
    "duration": 0.6574134419788606,
    "result_length": 101,
    "average_duration": 0.7746367086132523,
    "uuid": "178f122b-3d03-4718-89b6-9f6d009d05ad"
  }
}