{
  "user_intention": "Live Test",
  "language": "python",
  "prompt": "# Write a function to reverse a string.",
  "anthropic": {
    "result": "def reverse_string(string):\n    return string[::-1]",
    "duration": 1.0518198480131105,
    "result_length": 51,
    "avg_duration": 1.386312669198378
  },
  "anthropic_fast": {
    "result": "def reverse(s):\n    return s[::-1]",
    "duration": 0.7780231990036555,
    "result_length": 34,
    "avg_duration": 0.6063828118960373
  },
  "vertex_combined": {
    "result": "def reverse_string(string):\n  \"\"\"Reverses a string.\n\n  Args:\n    string: The string to reverse.\n\n  Returns:\n    The reversed string.\n  \"\"\"\n  new_string = \"\"\n  for character in string[::-1]:\n    new_string += character\n  return new_string\n",
    "duration": 3.1365510759933386,
    "result_length": 238,
    "avg_duration": 3.232569219105062
  },
  "vertex_code_bison": {
    "result": "def reverse_string(string):\n  \"\"\"Reverses a string.\n\n  Args:\n    string: The string to reverse.\n\n  Returns:\n    The reversed string.\n  \"\"\"\n  new_string = \"\"\n  for character in string[::-1]:\n    new_string += character\n  return new_string\n",
    "duration": 3.1502442749915645,
    "result_length": 238,
    "avg_duration": 3.144400010892423
  },
  "vertex_text_bison": {
    "result": "def reverse(str1): \n        rev = \"\" \n        for i in range(len(str1) - 1, -1, -1): \n            rev = rev + str1[i] \n        return rev",
    "duration": 0.7625977839925326,
    "result_length": 137,
    "avg_duration": 0.8722167593950871
  },
  "vertex_gecko": {
    "result": ""
  },
  "gitlab_model": {
    "result": "```python\ndef reverse_string(str1):\n  str2 = \"\"\n  for i in range(len(str1) - 1",
    "duration": 0.5956498520099558,
    "result_length": 78,
    "avg_duration": 0.796099854199565
  }
}