{
  "anthropic": {
    "result": "// class Rectangle { \nconstructor(length, width) {\n    this.length = length;\n    this.width = width;\n}\n\ngetArea() {\n    return this.length * this.width; \n}\n}",
    "duration": 2.264144371030852,
    "result_length": 157,
    "average_duration": 1.9234004994970746,
    "raw_durations": [
      2.264144371030852,
      2.087606256012805,
      2.065449203015305,
      1.7197669990127906,
      2.050244521931745,
      1.7777211390202865,
      1.7604235579492524,
      1.808445019996725,
      1.8112840260146186,
      1.888919900986366
    ],
    "uuid": "45590d47-80cc-43e2-8bd4-aedfb4cb3b71"
  },
  "anthropic_fast": {
    "result": "// class Rectangle { \nconstructor(length, width) {\n       this.length = length;\n       this.width = width;\n   }\n   area() {\n       return this.length * this.width;\n   }\n}",
    "duration": 0.9871528259245679,
    "result_length": 170,
    "average_duration": 0.8502178435679525,
    "raw_durations": [
      0.9871528259245679,
      0.6655544600216672,
      0.8099530109902844,
      0.8683769749477506,
      0.9200519459554926
    ],
    "uuid": "81851d0e-eeab-4bf4-bfe8-164a691dfd41"
  },
  "vertex_combined": {
    "result": "const rectangle = new Rectangle(10, 20);\n\nconsole.log(rectangle.width); // 10\nconsole.log(rectangle.height); // 20",
    "duration": 3.8493023009505123,
    "result_length": 114,
    "average_duration": 3.8493023009505123,
    "raw_durations": [
      3.8493023009505123
    ],
    "uuid": "c0e81d52-26c4-42bb-93a4-4fc00cdf52f5"
  },
  "vertex_code_bison": {
    "result": "const rectangle = new Rectangle(10, 20);",
    "duration": 3.822189036058262,
    "result_length": 40,
    "average_duration": 3.822189036058262,
    "raw_durations": [
      3.822189036058262
    ],
    "uuid": "7637743f-72d7-49ca-92eb-54fa9bf74db8"
  },
  "vertex_text_bison": {
    "result": "//   this.length = length;\n    //   this.width = width;\n    // }\n    // get area() {\n    //   return this.length * this.width;\n    // }\n    // get perimeter() {\n    //   return 2 * this.length + 2 * this.width;\n    // }\n    // }",
    "duration": 1.0132720889523625,
    "result_length": 228,
    "average_duration": 1.019580997596495,
    "raw_durations": [
      1.0132720889523625,
      0.9749882549513131,
      0.9767349699977785,
      0.9805431590648368,
      0.9714654429117218,
      0.9968621170846745,
      1.0054368489654735,
      1.115558278048411,
      1.0030391690088436,
      1.1579096469795331
    ],
    "uuid": "952df5bd-78ef-4ea2-8786-914f30f08a28"
  },
  "vertex_gecko": {
    "result": " this.length = length; this.width = width; } }\n// class Square extends Rectangle { constructor(length) { super(length, length); } }\n// class Circle extends Rectangle { constructor(radius) { super(radius, radius); } }\n\n//",
    "duration": 1.441420582938008,
    "result_length": 220,
    "average_duration": 1.420961037511006,
    "raw_durations": [
      1.441420582938008,
      1.3782978750532493,
      1.4774069580016658,
      1.402251833002083,
      1.3362311669625342,
      1.4747492501046509,
      1.4777510000858456,
      1.3693469170248136,
      1.377522708964534,
      1.4746320829726756
    ],
    "uuid": "51978cb5-94de-4683-b8fb-49b6c81e72c4"
  },
  "user_intention": "Live Test",
  "language": "javascript",
  "prompt": "class Rectangle { constructor(length, width) {",
  "gitlab_model": {
    "result": " this.length = length; this.width = width; } }\n\nconst rectangle = new Rectangle(10, 5);\n\nconsole.log(rectangle.length);",
    "duration": 0.5571628840116318,
    "result_length": 119,
    "average_duration": 0.5797918024021783,
    "uuid": "56dbaea7-1141-4eca-8abf-054fd8a52e8b"
  }
}