{
  "anthropic": {
    "result": "// Write a function to reverse a string.\nchar* reverseString(char* str) {\n    char* start = str;\n    char* end = str + strlen(str) - 1;\n    while (start < end) {\n        char tmp = *start;\n        *start++ = *end;\n        *end-- = tmp;\n    }\n    return str;\n}",
    "duration": 2.471063461038284,
    "result_length": 259,
    "average_duration": 2.7002278432948517,
    "raw_durations": [
      2.471063461038284,
      2.480267046019435,
      2.6477566759567708,
      2.4518324630334973,
      3.8531177809927613,
      2.5758323109475896,
      2.6720412250142545,
      2.3416100669419393,
      3.0295416959561408,
      2.4792157070478424
    ],
    "uuid": "3e5f61be-7eb4-4ab1-8734-431cffd78466"
  },
  "anthropic_fast": {
    "result": "void reverse(char *str) \n{\n   char *end_ptr = str;\n   char tmp;\n  \n   if (str) {\n       while (*end_ptr) {\n           ++end_ptr;  \n       }\n       --end_ptr;  \n  \n       while (str < end_ptr) {\n           tmp = *str;\n           *str++ = *end_ptr;\n           *end_ptr-- = tmp;    \n       }\n   }\n}",
    "duration": 1.5105923089431599,
    "result_length": 295,
    "average_duration": 1.9216780237853528,
    "raw_durations": [
      1.5105923089431599,
      3.4393313279142603,
      1.5464041490340605,
      2.6677765409694985,
      1.5706650509964675,
      1.5190983180655167,
      1.648433372960426,
      1.6208701429422945,
      2.1137773550581187,
      1.5798316709697247
    ],
    "uuid": "260e60cc-0296-42ba-99ef-3ee14e7cd087"
  },
  "vertex_combined": {
    "result": "def reverse_string(string):\n  \"\"\"Reverses a string.\n\n  Args:\n    string: The string to be reversed.\n\n  Returns:\n    The reversed string.\n  \"\"\"\n  new_string = \"\"\n  for character in string[::-1]:\n    new_string += character\n  return new_string\n\n\nif __name__ == \"__main__\":\n  # Reverse the string \"hello\".\n  reversed_string = reverse_string(\"hello\")\n  print(reversed_string)\n  # Output: \"olleh\"",
    "duration": 3.718558601103723,
    "result_length": 391,
    "average_duration": 3.61590783551801,
    "raw_durations": [
      3.718558601103723,
      3.521030526026152,
      3.5651273110415787,
      3.4562734090723097,
      3.724498847965151,
      3.7181027060141787,
      3.618424567976035,
      3.506672636955045,
      3.608362315921113,
      3.722027433104813
    ],
    "uuid": "138a0403-a3f9-41e7-9673-ac0d829ec14b"
  },
  "vertex_code_bison": {
    "result": "def reverse_string(string):\n  \"\"\"Reverses a string.\n\n  Args:\n    string: The string to reverse.\n\n  Returns:\n    The reversed string.\n  \"\"\"\n  new_string = \"\"\n  for character in string[::-1]:\n    new_string = character + new_string\n  return new_string\n",
    "duration": 3.5692933769896626,
    "result_length": 250,
    "average_duration": 3.690672378905583,
    "raw_durations": [
      3.5692933769896626,
      3.5062980530783534,
      3.806457038037479,
      3.729579603066668,
      3.793857160024345,
      3.778970481012948,
      3.820801693946123,
      3.797739063971676,
      3.5081571709597483,
      3.5955701479688287
    ],
    "uuid": "31b017f9-c115-41ba-be57-efb89c1a8bf3"
  },
  "vertex_text_bison": {
    "result": "void reverse(char *str) {\n        int n = strlen(str);\n        for (int i = 0; i < n / 2; i++) {\n            char temp = str[i];\n            str[i] = str[n - i - 1];\n            str[n - i - 1] = temp;\n        }\n    }",
    "duration": 0.9383041349938139,
    "result_length": 216,
    "average_duration": 0.9404666849179193,
    "raw_durations": [
      0.9383041349938139,
      0.9592582340119407,
      0.9535449310205877,
      0.9416201950516552,
      0.9726963170105591,
      0.9144932840717956,
      0.9135108799673617,
      0.956014194060117,
      0.9453666179906577,
      0.9098580610007048
    ],
    "uuid": "12f8112c-73fe-4ffa-9446-0a80f3a89075"
  },
  "vertex_gecko": {
    "result": "\n\n// Example 1:\n\n// Input: \"hello\"",
    "duration": 1.303331583039835,
    "result_length": 34,
    "average_duration": 1.4575748459203168,
    "raw_durations": [
      1.303331583039835,
      1.4430606670212,
      1.3801476249936968,
      1.5870041250018403,
      1.4532082499936223,
      1.509563083993271,
      1.5762721670325845,
      1.5364552910905331,
      1.4003704169299453,
      1.3863352501066402
    ],
    "uuid": "8d0dec51-a91d-4465-95c8-75289a045d61"
  },
  "user_intention": "Live Test",
  "language": "c",
  "prompt": "Write a function to reverse a string.",
  "gitlab_model": {
    "result": "```python\ndef reverse_string(string):\n  \"\"\"Reverses a string.\n\n  Args:\n    string: The string to be",
    "duration": 0.5924485169816762,
    "result_length": 99,
    "average_duration": 0.6200381375965662,
    "uuid": "bd260659-4942-42a9-ae06-c3c7de4e4947"
  }
}