{
  "user_intention": "Live Test",
  "language": "golang",
  "prompt": "// Create a dictionary that maps country names to their capital cities.",
  "anthropic": {
    "result": "// Create a dictionary that maps country names to their capital cities.\ncountries := map[string]string{\n    \"France\":  \"Paris\",\n    \"Italy\":   \"Rome\",\n    \"Germany\": \"Berlin\",\n    \"Spain\":   \"Madrid\",\n}",
    "duration": 2.130206137022469,
    "result_length": 202,
    "avg_duration": 2.226207675790647
  },
  "anthropic_fast": {
    "result": "var capitals = map[string]string{\n    \"France\": \"Paris\",\n    \"Japan\": \"Tokyo\",\n}",
    "duration": 0.6466967880260199,
    "result_length": 80,
    "avg_duration": 0.6392871147079859
  },
  "vertex_combined": {
    "result": "capitals = {\n    \"Argentina\": \"Buenos Aires\",\n    \"Bolivia\": \"La Paz\",\n    \"Brazil\": \"Brasilia\",\n    \"Chile\": \"Santiago\",\n    \"Colombia\": \"Bogota\",\n    \"Ecuador\": \"Quito\",\n    \"French Guiana\": \"Cayenne\",\n    \"Guyana\": \"Georgetown\",\n    \"Paraguay\": \"Asuncion\",\n    \"Peru\": \"Lima\",\n    \"Suriname\": \"Paramaribo\",\n    \"Uruguay\": \"Montevideo\",\n    \"Venezuela\": \"Caracas\"\n}",
    "duration": 3.3366544309537858,
    "result_length": 367,
    "avg_duration": 3.3496883863932454
  },
  "vertex_code_bison": {
    "result": "capitals = {\n    \"Argentina\": \"Buenos Aires\",\n    \"Bolivia\": \"La Paz\",\n    \"Brazil\": \"Brasilia\",\n    \"Chile\": \"Santiago\",\n    \"Colombia\": \"Bogota\",\n    \"Ecuador\": \"Quito\",\n    \"French Guiana\": \"Cayenne\",\n    \"Guyana\": \"Georgetown\",\n    \"Paraguay\": \"Asuncion\",\n    \"Peru\": \"Lima\",\n    \"Suriname\": \"Paramaribo\",\n    \"Uruguay\": \"Montevideo\",\n    \"Venezuela\": \"Caracas\"\n}",
    "duration": 3.3250158090377226,
    "result_length": 367,
    "avg_duration": 3.325279855704866
  },
  "vertex_text_bison": {
    "result": "var capitals = map[string]string{\n        \"United States\": \"Washington, D.C.\",\n        \"United Kingdom\": \"London\",\n        \"France\": \"Paris\",\n        \"Germany\": \"Berlin\",\n        \"China\": \"Beijing\",\n    }",
    "duration": 5.92090621398529,
    "result_length": 204,
    "avg_duration": 1.3410076772910542
  },
  "vertex_gecko": {
    "result": ""
  },
  "gitlab_model": {
    "result": "```\ncountries := map[string]string{\n\t\"United States\": \"Washington, D.C.\",\n\t\"Canada\": \"Ottawa\",",
    "duration": 0.5475799769628793,
    "result_length": 94,
    "avg_duration": 1.2623694634879938
  }
}