{
  "anthropic": {
    "result": "class Person:\n    def __init__(self, name, age, address):\n        self.name = name\n        self.age = age\n        self.address = address",
    "duration": 1.187316820025444,
    "result_length": 136,
    "average_duration": 1.292769539996516,
    "raw_durations": [
      1.187316820025444,
      1.2772357700159773,
      1.3149099120637402,
      1.2655881779501215,
      1.1897306779865175,
      1.1941637479467317,
      1.2828713050112128,
      1.7750248729716986,
      1.130262921913527,
      1.3105911940801889
    ],
    "uuid": "1a5099e8-faf3-448c-88a7-7df2d280f360"
  },
  "anthropic_fast": {
    "result": "# Create a class that represents a person with attributes like name, age, and address.\nclass Person:  \n    def __init__(self, name, age):  \n        self.name = name  \n        self.age = age",
    "duration": 0.8047303919447586,
    "result_length": 189,
    "average_duration": 0.7887151848059147,
    "raw_durations": [
      0.8047303919447586,
      0.5999199360376224,
      0.6163781239883974,
      1.5860131629742682,
      0.5691596230026335,
      0.6837095470400527,
      0.6761858420213684,
      1.1707062770146877,
      0.5780941100092605,
      0.6022548340260983
    ],
    "uuid": "9d25a206-1b69-4b2f-b755-0a6cdc0c2282"
  },
  "vertex_combined": {
    "result": "class Person:\n    def __init__(self, name, age, address):\n        self.name = name\n        self.age = age\n        self.address = address\n\n    def __str__(self):\n        return f\"Person: {self.name}, {self.age}, {self.address}\"\n",
    "duration": 3.2631956370314583,
    "result_length": 227,
    "average_duration": 3.0549616780132056,
    "raw_durations": [
      3.2631956370314583,
      3.249260723008774,
      2.778161594993435,
      3.195382705074735,
      2.769319745944813,
      3.12851288204547,
      3.3616869170218706,
      3.1899647309910506,
      2.7317047249525785,
      2.88242711906787
    ],
    "uuid": "eb7a64cd-18bb-4f7c-bd83-48cf9c7c3d49"
  },
  "vertex_code_bison": {
    "result": "class Person:\n    def __init__(self, name, age, address):\n        self.name = name\n        self.age = age\n        self.address = address\n\n    def __str__(self):\n        return f\"Person {self.name}, {self.age}, {self.address}\"\n",
    "duration": 2.79990593099501,
    "result_length": 226,
    "average_duration": 2.9409832897013986,
    "raw_durations": [
      2.79990593099501,
      3.1322404079837725,
      2.7221501460298896,
      2.822897579986602,
      2.7883097050944343,
      3.231511835940182,
      2.7493781170342118,
      2.7956392739433795,
      3.2859326360048726,
      3.0818672640016302
    ],
    "uuid": "decab7f9-cc88-460c-ac90-67c2b30d140b"
  },
  "vertex_text_bison": {
    "result": "class Person:\n        def __init__(self, name, age, address):\n            self.name = name\n            self.age = age\n            self.address = address",
    "duration": 0.934369727037847,
    "result_length": 152,
    "average_duration": 0.9157089484040626,
    "raw_durations": [
      0.934369727037847,
      0.8981119350064546,
      0.8724579829722643,
      0.9365677579771727,
      0.8925564580131322,
      0.8894698850344867,
      0.9208199979038909,
      0.9323166420217603,
      0.9256401050370187,
      0.954778993036598
    ],
    "uuid": "cf1f175b-c5ef-4ec6-8c3a-fbbc383ac583"
  },
  "vertex_gecko": {
    "result": "class Person:\n    def __init__(self, name, age, address):\n        self.name = name\n        self.age = age",
    "duration": 1.5484804169973359,
    "result_length": 105,
    "average_duration": 1.4431046085082926,
    "raw_durations": [
      1.5484804169973359,
      1.4999827919527888,
      1.3784694590140134,
      1.4491645420202985,
      1.4331621250603348,
      1.439002375002019,
      1.4405796669889241,
      1.3796155829913914,
      1.3893197500146925,
      1.4732693750411272
    ],
    "uuid": "32eb28ca-71c8-4852-9c60-36c861b9b4be"
  },
  "user_intention": "Live Test",
  "language": "python",
  "prompt": "# Create a class that represents a person with attributes like name, age, and address.",
  "prompt_type": "generation",
  "gitlab_model": {
    "result": "class Person:\n\n    def __init__(self, name, age, address):\n        self.name = name\n        self.",
    "duration": 0.5703874440223444,
    "result_length": 97,
    "average_duration": 0.6262366722046864,
    "uuid": "5918a4d0-d197-4b73-8bf5-553b3d072dce"
  }
}