{
  "anthropic": {
    "result": "func isEven(number int) bool {\n    if number % 2 == 0 {\n        return true\n    } else {\n        return false\n    }\n}",
    "duration": 1.4691036259755492,
    "result_length": 117,
    "average_duration": 1.348495041008573,
    "raw_durations": [
      1.4691036259755492,
      1.3190130479633808,
      1.1523273719940335,
      1.2521268920972943,
      1.22908456902951,
      1.4485777529189363,
      1.3116672959877178,
      1.4763225620845333,
      1.5224734940566123,
      1.3042537979781628
    ],
    "uuid": "ea926d35-205c-4025-b0cc-0cdca278dc1b"
  },
  "anthropic_fast": {
    "result": "// func isEven(number int) bool {\n    if number%2 == 0 {\n        return true\n    } else {\n        return false\n    }\n}",
    "duration": 0.7280727659817785,
    "result_length": 118,
    "average_duration": 1.0882455912360456,
    "raw_durations": [
      0.7280727659817785,
      0.6992651569889858,
      0.7710850189905614,
      0.6717827919637784,
      0.7472888750489801,
      2.6376576699549332,
      1.751805903040804,
      0.6990065479185432
    ],
    "uuid": "7a86c606-8a36-43bf-ac0b-afa96cb7f59d"
  },
  "vertex_combined": {
    "result": "func isEven(number int) bool {\n    if number % 2 == 0 {\n        return true\n    } else {\n        return false\n    }\n}",
    "duration": 3.1032272069714963,
    "result_length": 117,
    "average_duration": 3.081661369197536,
    "raw_durations": [
      3.1032272069714963,
      3.1074369030538946,
      3.1077275089919567,
      3.166361758019775,
      3.0515735829249024,
      3.020781978033483,
      3.090699605992995,
      3.0632992209866643,
      3.084899249020964,
      3.020606677979231
    ],
    "uuid": "ec2471e8-3354-4fcd-96d7-02528d0b6395"
  },
  "vertex_code_bison": {
    "result": "func isEven(number int) bool {\n    if number % 2 == 0 {\n        return true\n    } else {\n        return false\n    }\n}",
    "duration": 2.8271278819302097,
    "result_length": 117,
    "average_duration": 2.9663538466673343,
    "raw_durations": [
      2.8271278819302097,
      3.035583128919825,
      3.0849868030054495,
      3.1473009219625965,
      2.602517483988777,
      3.023528170888312,
      2.9988723900169134,
      3.1719088859390467,
      2.738962923991494,
      3.0327498760307208
    ],
    "uuid": "8d4d3671-4cf5-44fb-824b-a30c26e78e56"
  },
  "vertex_text_bison": {
    "result": "func isEven(number int) bool {\n        return number%2 == 0\n    }",
    "duration": 0.866362986038439,
    "result_length": 65,
    "average_duration": 0.9127700306009501,
    "raw_durations": [
      0.866362986038439,
      0.9367383930366486,
      0.9454176319995895,
      0.9312230999348685,
      0.8473935259971768,
      0.9347235320601612,
      0.9437814890407026,
      0.9392289649695158,
      0.8486703649396077,
      0.9341603179927915
    ],
    "uuid": "932a417d-037d-4bd3-bf0f-d6e1a6dc7d7d"
  },
  "vertex_gecko": {
    "result": "\n// \treturn number % 2 == 0\n// }\n\n// func isOdd(number int) bool {",
    "duration": 1.3267316250130534,
    "result_length": 66,
    "average_duration": 1.3546382127562537,
    "raw_durations": [
      1.3267316250130534,
      1.296450666966848,
      1.4487454999471083,
      1.384583666920662,
      1.3637857499998063,
      1.3723990839207545,
      1.3774809589376673,
      1.3825594169320539,
      1.31949370901566,
      1.274151749908924
    ],
    "uuid": "2b941805-51d7-4bd9-b37e-38ad717fbbc8"
  },
  "user_intention": "Live Test",
  "language": "golang",
  "prompt": "func isEven(number int) bool {",
  "gitlab_model": {
    "result": "\n  return number%2 == 0\n}",
    "duration": 0.5721817400190048,
    "result_length": 25,
    "average_duration": 0.5766882625117432,
    "uuid": "12b9f1af-5ffb-4c19-b9b9-7df65d102625"
  }
}