{
  "user_intention": "Live Test",
  "language": "javascript",
  "prompt": "class Calculator { constructor(addition, subtraction, multiplication, addition) {",
  "anthropic": {
    "result": ""
  },
  "anthropic_fast": {
    "result": "class Calculator { \n  constructor(addition, subtraction, multiplication, addition) {\n    this.addition = addition;\n    this.subtraction = subtraction;\n    this.multiplication = multiplication;\n    this.division = division;\n  }\n}",
    "duration": 0.7565715689997887,
    "result_length": 228,
    "avg_duration": 1.0061412695009495
  },
  "vertex_combined": {
    "result": ""
  },
  "vertex_code_bison": {
    "result": "constructor(addition, subtraction, multiplication, division) {\n  this.addition = addition;\n  this.subtraction = subtraction;\n  this.multiplication = multiplication;\n  this.division = division;\n}",
    "duration": 3.0408428629889386,
    "result_length": 194
  },
  "vertex_text_bison": {
    "result": "this.addition = addition;\n     this.subtraction = subtraction;\n     this.multiplication = multiplication;\n     this.division = division;\n   }\n   add(a, b) {\n     return this.addition(a, b);\n   }\n   subtract(a, b) {\n     return this.subtraction(a, b);\n   }\n   multiply(a, b) {\n     return this.multiplication(a, b);\n   }\n   divide(a, b) {\n     return this.division(a, b);\n   }\n }",
    "duration": 1.322743595999782,
    "result_length": 378,
    "avg_duration": 1.3043189678995986
  },
  "vertex_gecko": {
    "result": ""
  },
  "gitlab_model": {
    "result": "\n    this.addition = addition;\n    this.subtraction = subtraction;\n    this.multiplication = multiplication;\n    this.addition = addition;",
    "duration": 0.5922922820027452,
    "result_length": 138,
    "avg_duration": 0.5858731055996032
  }
}