{
  "anthropic": {
    "result": "// float area_of_circle(float radius) {\n    float area;\n    area = 3.14 * radius * radius;\n    return area; \n}",
    "duration": 1.52120311697945,
    "result_length": 110,
    "average_duration": 1.608440744993277,
    "raw_durations": [
      1.52120311697945,
      1.7364750120323151,
      1.6597633089404553,
      1.517215047031641,
      1.801572049036622,
      1.6008808159967884,
      1.4423986210022122,
      1.6207495590206236,
      1.7068561379564926,
      1.4772937819361687
    ],
    "uuid": "d7e1dd60-c37a-46c6-9088-e388633d88e8"
  },
  "anthropic_fast": {
    "result": "// float area_of_circle(float radius) { \n    float area;\n    area = 3.14 * radius * radius;\n    return area;\n}",
    "duration": 0.7477699500741437,
    "result_length": 110,
    "average_duration": 0.9883439472307347,
    "raw_durations": [
      0.7477699500741437,
      0.7617117289919406,
      0.6941565310116857,
      1.8321218499913812,
      0.7402508709346876,
      0.6907047240529209,
      0.8086351030506194,
      0.7754361690022051,
      1.8443085979670286
    ],
    "uuid": "e18be3aa-2546-424d-b276-7fa15e91c0ca"
  },
  "vertex_combined": {
    "result": "float area_of_circle(float radius) {\n  // Calculate the area of the circle.\n  float area = 3.14159 * radius * radius;\n\n  // Return the area.\n  return area;\n}",
    "duration": 1.940312662976794,
    "result_length": 157,
    "average_duration": 1.8768439353094437,
    "raw_durations": [
      1.940312662976794,
      2.0587310349801555,
      2.1753973179729655,
      1.7779511820990592,
      1.8458033240167424,
      1.8170669979881495,
      1.843689447036013,
      1.6454804820241407,
      1.84735954599455,
      1.8166473580058664
    ],
    "uuid": "83168f84-9bb5-4fdd-90d4-8e65256c2b77"
  },
  "vertex_code_bison": {
    "result": "float area_of_circle(float radius) {\n  // Calculate the area of the circle.\n  float area = 3.14159265358979323846 * radius * radius;\n\n  // Return the area.\n  return area;\n}",
    "duration": 1.8320862039690837,
    "result_length": 172,
    "average_duration": 1.8913227363140321,
    "raw_durations": [
      1.8320862039690837,
      1.9062447590986267,
      1.8284535040147603,
      1.9316152890678495,
      1.9186678919941187,
      1.8202666679862887,
      2.034761294024065,
      2.084053399041295,
      1.7170825109351426,
      1.839995843009092
    ],
    "uuid": "78d18076-48b2-4082-a794-9486ebb6c3da"
  },
  "vertex_text_bison": {
    "result": "float area_of_circle(float radius) {\n        return 3.14 * radius * radius;\n    }",
    "duration": 0.8563459790311754,
    "result_length": 81,
    "average_duration": 0.8237082690699026,
    "raw_durations": [
      0.8563459790311754,
      0.7730063999770209,
      0.7994837269652635,
      0.8396029849536717,
      0.8731991389067844,
      0.7722821639617905,
      0.8748771999962628,
      0.8411581269465387,
      0.7614181659882888,
      0.8457088039722294
    ],
    "uuid": "e97583c3-aa73-4791-83e8-14eeed8eaa7d"
  },
  "vertex_gecko": {
    "result": "//     return M_PI * radius * radius;\n// }\n\n// int main() {",
    "duration": 1.416266500018537,
    "result_length": 59,
    "average_duration": 1.3852893624221907,
    "raw_durations": [
      1.416266500018537,
      1.4295352500630543,
      1.2950479579158127,
      1.2521290000295267,
      1.435152166057378,
      1.336692332988605,
      1.4315471251029521,
      1.5497888330137357,
      1.3948152919765562,
      1.3119191670557484
    ],
    "uuid": "dc9c40cc-8f0d-4226-98e6-1b95a8165bb1"
  },
  "user_intention": "Live Test",
  "language": "c",
  "prompt": "float area_of_circle(float radius) {",
  "prompt_type": "completion",
  "gitlab_model": {
    "result": "return (22 / 7) * radius * radius;\n}\n\nint main() {\n  float radius = 5;",
    "duration": 0.6411915399949066,
    "result_length": 70,
    "average_duration": 0.6238281981903129,
    "uuid": "2aa87d3e-98dc-4df6-bdbe-7f4778f46098"
  }
}