{
  "anthropic": {
    "result": "// type Calculator struct {\n    operand1 int\n    operand2 int\n}",
    "duration": 1.3668498010374606,
    "result_length": 63,
    "average_duration": 1.8037219771998934,
    "raw_durations": [
      1.3668498010374606,
      1.3607802810147405,
      1.2380508460337296,
      1.4772124349838123,
      3.34858907898888,
      1.7620550140272826,
      1.228905594907701,
      1.296973817050457,
      1.2644577129976824,
      3.6933451909571886
    ],
    "uuid": "ce72cea2-5897-452f-b7e7-f5c82f0aeb6a"
  },
  "anthropic_fast": {
    "result": "// type Calculator struct {\n    Num1 int\n    Num2 int\n}",
    "duration": 0.6074111310299486,
    "result_length": 55,
    "average_duration": 1.6645193668897265,
    "raw_durations": [
      0.6074111310299486,
      2.3800025249365717,
      1.4085146080469713,
      1.4372504309285432,
      2.9254550349432975,
      1.2464162099640816,
      0.4656836970243603,
      3.085449520032853,
      1.7684886319329962,
      1.3205218800576404
    ],
    "uuid": "832911db-008f-4d0b-a38d-725b110d4ba5"
  },
  "vertex_combined": {
    "result": "calculator := Calculator{}\nresult := calculator.Add(10, 20)",
    "duration": 3.2920448699733242,
    "result_length": 59,
    "average_duration": 3.185395625012461,
    "raw_durations": [
      3.2920448699733242,
      3.1116024729562923,
      3.911166795063764,
      2.426768362056464
    ],
    "uuid": "33a96eb6-3c38-4e0e-b4c0-009c3a3bc463"
  },
  "vertex_code_bison": {
    "result": "type Calculator struct {\n}",
    "duration": 3.8319382710615173,
    "result_length": 26,
    "average_duration": 3.8005585391407033,
    "raw_durations": [
      3.8319382710615173,
      3.837135636014864,
      3.865771723096259,
      3.89830802497454,
      3.823314765933901,
      3.8208977029426023,
      3.5265436499612406
    ],
    "uuid": "737cdebf-4c09-4d7a-bd1e-c18aabc8b356"
  },
  "vertex_text_bison": {
    "result": "type Calculator struct {\n        memory float64\n    }\n",
    "duration": 1.302873020991683,
    "result_length": 54,
    "average_duration": 1.3747986952075735,
    "raw_durations": [
      1.302873020991683,
      1.3891211570007727,
      1.374534631962888,
      1.3764179800637066,
      1.3886316650314257,
      1.377171011059545,
      1.3870842930627987,
      1.3778067729435861,
      1.4058325910009444,
      1.3685138289583847
    ],
    "uuid": "afd8821d-e3eb-4c61-aac8-c85a34b3e01c"
  },
  "vertex_gecko": {
    "result": "\n// \ta int\n// \tb int\n// }",
    "duration": 1.4354015840217471,
    "result_length": 25,
    "average_duration": 1.4001133209792898,
    "raw_durations": [
      1.4354015840217471,
      1.3765172079438344,
      1.3666829579742625,
      1.3811907089548185,
      1.4777725839521736,
      1.3847826248966157,
      1.3470972920767963,
      1.3880977920489386,
      1.469264541985467,
      1.3743259159382433
    ],
    "uuid": "d274337d-2ab4-4c33-bdcf-f54fc43d9341"
  },
  "user_intention": "Live Test",
  "language": "golang",
  "prompt": "type Calculator struct {",
  "gitlab_model": {
    "result": "\n    result int\n}\n\nfunc (c *Calculator) Add(a, b int) {\n    c.result = a + b\n",
    "duration": 0.6385468009975739,
    "result_length": 77,
    "average_duration": 0.6224209390988108,
    "uuid": "4a50c4fd-bdf8-44b5-b35a-5dc41d7720b5"
  }
}