{
  "anthropic": {
    "result": "package main\n\nimport \"sort\"\n\nfunc main() {\n    nums := []int{5, 3, 1, 4, 2}\n    sort.Ints(nums)\n    println(nums) \n}",
    "duration": 1.6692322499584407,
    "result_length": 116,
    "average_duration": 2.1400219856994225,
    "raw_durations": [
      1.6692322499584407,
      1.8541191660333425,
      1.792283162008971,
      1.9097418179735541,
      4.451487472048029,
      1.820253161014989,
      1.8302224850049242,
      1.8457912969170138,
      2.268059508060105,
      1.9590295379748568
    ],
    "uuid": "b2752f3b-f19d-43c6-a558-877eebcac0e0"
  },
  "anthropic_fast": {
    "result": "package main\n\nimport \"sort\"\n\nfunc main() {\n    numbers := []int{4,3,2,1}\n    \n    sort.Ints(numbers)\n    \n    for _, number := range numbers {\n        println(number)\n    }\n}",
    "duration": 1.0796979449223727,
    "result_length": 174,
    "average_duration": 1.1859986942843534,
    "raw_durations": [
      1.0796979449223727,
      1.23780695698224,
      1.2429431369528174,
      1.1759748460026458,
      1.2330869759898633,
      1.1107584399869666,
      1.2227286630077288,
      1.0750633539864793,
      1.2862831290112808,
      1.1956434960011393
    ],
    "uuid": "13105f5f-e14a-4f9d-8beb-a133a803b21e"
  },
  "vertex_combined": {
    "result": "# Create a list of numbers.\nnumbers = [10, 5, 2, 7, 3]\n\n# Sort the list in ascending order.\nnumbers.sort()\n\n# Print the sorted list.\nprint(numbers)",
    "duration": 2.842316335067153,
    "result_length": 147,
    "average_duration": 2.6376191720948556,
    "raw_durations": [
      2.842316335067153,
      2.6203611890086904,
      2.6738664669683203,
      2.6145030959742144,
      2.59146432694979,
      2.5694041500100866,
      2.542013867991045,
      2.661175225977786,
      2.5878968979232013,
      2.6731901650782675
    ],
    "uuid": "2aaf254b-fa4a-43bd-9d0c-001b9f1e6bd5"
  },
  "vertex_code_bison": {
    "result": "# Create a list of numbers.\nnumbers = [10, 5, 2, 7, 3]\n\n# Sort the list in ascending order.\nnumbers.sort()\n\n# Print the sorted list.\nprint(numbers)",
    "duration": 2.688743182923645,
    "result_length": 147,
    "average_duration": 2.6256402834900654,
    "raw_durations": [
      2.688743182923645,
      2.669905334012583,
      2.5554173690034077,
      2.6618642800021917,
      2.656271902960725,
      2.6069320349488407,
      2.5810755849815905,
      2.5942086530849338,
      2.692395919933915,
      2.5495885730488226
    ],
    "uuid": "39ba80fe-d6f0-4ab3-b81f-b94185631826"
  },
  "vertex_text_bison": {
    "result": "```\npackage main\n\nimport (\n    \"fmt\"\n    \"sort\"\n)\n\nfunc main() {\n    // Create a list of numbers.\n    numbers := []int{5, 3, 1, 2, 4}\n\n    // Sort the list in ascending order.\n    sort.Ints(numbers)\n\n    // Print the sorted list.\n    fmt.Println(numbers)\n}\n```",
    "duration": 1.3643008039798588,
    "result_length": 260,
    "average_duration": 1.3694408594048582,
    "raw_durations": [
      1.3643008039798588,
      1.3513360950164497,
      1.3598184930160642,
      1.3530753320083022,
      1.5046473860275,
      1.3801033190684393,
      1.3666106140008196,
      1.3668816009303555,
      1.2695756609318778,
      1.378059289068915
    ],
    "uuid": "7ab293fb-190b-4308-b188-1dd65883c0de"
  },
  "vertex_gecko": {
    "result": "\n\nimport java.util.Scanner;\n\npublic class SortAscending {",
    "duration": 1.447997875045985,
    "result_length": 57,
    "average_duration": 1.3952921123942361,
    "raw_durations": [
      1.447997875045985,
      1.4367457500193268,
      1.3108995830407366,
      1.486769999959506,
      1.3859825830440968,
      1.3827088749967515,
      1.4962509999750182,
      1.3680577909108251,
      1.2866404169471934,
      1.3508672500029206
    ],
    "uuid": "c785fd85-ae3b-4b41-93d4-3724d4945c12"
  },
  "user_intention": "Live Test",
  "language": "golang",
  "prompt": "Write a program to sort a list of numbers in ascending order.",
  "gitlab_model": {
    "result": "```go\npackage main\n\nimport (\n    \"fmt\"\n    \"sort\"\n)\n\nfunc main() {\n    // Create a",
    "duration": 0.6300792489782907,
    "result_length": 82,
    "average_duration": 0.927758642891422,
    "uuid": "0a51dc75-b304-4933-86bc-12f2562ed9be"
  }
}