{
  "anthropic": {
    "result": "# Write a program to count the number of occurrences of each element in a list.\ndef count_occurrences(list):\n    count_dict = {}\n    for element in list:\n        if element in count_dict:\n            count_dict[element] += 1\n        else:\n            count_dict[element] = 1\n    return count_dict",
    "duration": 2.2997946250252426,
    "result_length": 296,
    "average_duration": 3.103504493110813,
    "raw_durations": [
      2.2997946250252426,
      2.4996856580255553,
      2.3998987660743296,
      2.3660369539866224,
      3.0816960079828277,
      4.182395349023864,
      3.995196843985468,
      3.9114672100404277,
      3.299457260989584,
      2.999416255974211
    ],
    "uuid": "844f5a7e-9eac-43d9-ab65-1689429763b2"
  },
  "anthropic_fast": {
    "result": "# Write a program to count the number of occurrences of each element in a list.\n\nlst = [1, 2, 3, 4, 2, 1, 1, 3, 4, 5]  \n\ncount = {}  \n\nfor x in lst:  \n    if x in count:  \n        count[x] += 1  \n    else:  \n        count[x] = 1\n\nprint(count)",
    "duration": 1.0961575229885057,
    "result_length": 242,
    "average_duration": 1.0838121452368796,
    "raw_durations": [
      1.0961575229885057,
      1.2137280700262636,
      0.8943952120607719,
      1.1410811020759866,
      1.1214618990197778,
      0.9940344990463927,
      1.1417593930382282,
      1.1067636860534549,
      1.0211654340382665,
      1.107574634021148
    ],
    "uuid": "6ec1c826-d401-4960-b672-9656a10d5868"
  },
  "vertex_combined": {
    "result": "# Create a list of numbers.\nnumbers = [1, 2, 3, 4, 5, 6, 7, 8, 9, 10]\n\n# Create a dictionary to store the results.\nresults = {}\n\n# Iterate over the list.\nfor number in numbers:\n\n    # Check if the number is already in the dictionary.\n    if number not in results:\n        # If it is not in the dictionary, add it to the dictionary with a count of 1.",
    "duration": 3.916977384011261,
    "result_length": 349,
    "average_duration": 3.8587574385106564,
    "raw_durations": [
      3.916977384011261,
      3.8581888530170545,
      3.866611763020046,
      3.7834269070299342,
      3.907073767040856,
      3.8624357669614255,
      3.8339746079873294,
      3.8464888309827074,
      3.859514632029459,
      3.85288187302649
    ],
    "uuid": "f228f40d-b962-4ccd-bc48-5f1af144c0a9"
  },
  "vertex_code_bison": {
    "result": "# Create a list of numbers.\nnumbers = [1, 2, 3, 4, 5, 6, 7, 8, 9, 10]\n\n# Create a dictionary to store the results.\nresults = {}\n\n# Iterate over the list.\nfor number in numbers:\n\n    # Check if the number is already in the dictionary.\n    if number not in results:\n        # If it is not in the dictionary, add it to the dictionary with a count of 1.",
    "duration": 3.8543651920044795,
    "result_length": 349,
    "average_duration": 3.8769340844941325,
    "raw_durations": [
      3.8543651920044795,
      3.824374918011017,
      3.7837355049559847,
      4.107779081095941,
      3.851822642958723,
      3.7884254379896447,
      3.8323252639966086,
      3.9330222189892083,
      3.871674300986342,
      3.921816283953376
    ],
    "uuid": "165cb54a-84ea-4aed-9230-e40caf07dd12"
  },
  "vertex_text_bison": {
    "result": "def count_occurrences(list1):\n    \"\"\"\n    Counts the number of occurrences of each element in a list.\n\n    Args:\n        list1 (list): The list to be counted.\n\n    Returns:\n        dict: A dictionary with the elements as keys and the number of occurrences as values.\n    \"\"\"\n\n    result = {}\n    for element in list1:\n        if element in result:\n            result[element] += 1\n        else:\n            result[element] = 1\n    return result\n",
    "duration": 1.6865685459924862,
    "result_length": 445,
    "average_duration": 1.729343000811059,
    "raw_durations": [
      1.6865685459924862,
      1.655112733016722,
      1.6415608311071992,
      1.654723796993494,
      1.668928942992352,
      1.6560274179792032,
      2.3778153200400993,
      1.758616697974503,
      1.6030149620492011,
      1.5910607599653304
    ],
    "uuid": "68458c29-203e-4385-b9f3-609221ca377e"
  },
  "vertex_gecko": {
    "result": "\n\ndef count_elements(list):\n    count = {}\n    for i in list:",
    "duration": 1.3906956249848008,
    "result_length": 61,
    "average_duration": 1.4882132749073207,
    "raw_durations": [
      1.3906956249848008,
      1.4371746249962598,
      1.4104638749267906,
      1.4208509160671383,
      1.4402674590237439,
      1.5280792500125244,
      1.5901208330178633,
      1.5917261660797521,
      1.4877287920098752,
      1.585025207954459
    ],
    "uuid": "648b4cab-0e83-4eb7-b3b3-51c123d1e78d"
  },
  "user_intention": "Live Test",
  "language": "python",
  "prompt": "Write a program to count the number of occurrences of each element in a list.",
  "gitlab_model": {
    "result": "```python\ndef count_occurrences(list1):\n  \"\"\"This function counts the number of occurrences of each element in a list.\"\"\"\n\n ",
    "duration": 0.7146977689990308,
    "result_length": 124,
    "average_duration": 0.6283008105063346,
    "uuid": "21f8fbff-91b5-442c-80da-f481f4c53399"
  }
}