{
  "anthropic": {
    "result": "// int is_palindrome(char* string) {\n    int len = strlen(string);\n    int i = 0; \n    int j = len - 1;\n    while (i < j) {\n        if (string[i] != string[j])\n            return 0;\n        i++;\n        j--;\n    }\n    return 1;\n}",
    "duration": 2.315379193983972,
    "result_length": 229,
    "average_duration": 2.1967131858950273,
    "raw_durations": [
      2.315379193983972,
      2.212708509992808,
      2.1115169059485197,
      2.198744786088355,
      2.1734391580102965,
      2.0936461789533496,
      2.011863923049532,
      2.538829936995171,
      2.1142900800332427
    ],
    "uuid": "2830d0f7-a179-4a31-b0ab-f9ed45a53539"
  },
  "anthropic_fast": {
    "result": "// int is_palindrome(char* string) { \n    int length = strlen(string);\n    int i;\n    for (i = 0; i < length/2; i++) {\n        if (string[i] != string[length-i-1]) {\n            return 0;\n        }\n    }\n    return 1;\n}",
    "duration": 1.0769648699788377,
    "result_length": 219,
    "average_duration": 1.2763480393099598,
    "raw_durations": [
      1.0769648699788377,
      1.1549715460278094,
      1.143398109008558,
      1.0015138620510697,
      1.0464860351057723,
      2.778935502981767,
      1.1111430019373074,
      1.0892375629628077,
      1.1686885349918157,
      1.1921413680538535
    ],
    "uuid": "f6cc6cae-1263-4c98-a5e3-a008b188a266"
  },
  "vertex_combined": {
    "result": "int is_palindrome(char* string) {\n  int i = 0;\n  int j = strlen(string) - 1;\n\n  while (i < j) {\n    if (string[i] != string[j]) {\n      return 0;\n    }\n    i++;\n    j--;\n  }\n\n  return 1;\n}",
    "duration": 3.8313427401008084,
    "result_length": 188,
    "average_duration": 3.649431495903991,
    "raw_durations": [
      3.8313427401008084,
      3.784484697971493,
      3.8408804970094934,
      3.886160420952365,
      3.897057930007577,
      3.873760318965651,
      3.8859122400172055,
      1.839840341010131,
      3.871099609998055,
      3.7837761630071327
    ],
    "uuid": "a420e1fb-d3cc-4d1d-aa28-f7c28ed2460c"
  },
  "vertex_code_bison": {
    "result": "int is_palindrome(char* string) {\n  int i = 0;\n  int j = strlen(string) - 1;\n\n  while (i < j) {\n    if (string[i] != string[j]) {\n      return 0;\n    }\n    i++;\n    j--;\n  }\n\n  return 1;\n}",
    "duration": 3.842442409018986,
    "result_length": 188,
    "average_duration": 3.6829268377972766,
    "raw_durations": [
      3.842442409018986,
      3.9328704579966143,
      1.878034681896679,
      3.789627506979741,
      3.9380091009661555,
      3.930447309045121,
      3.8428772239713,
      3.9253637050278485,
      3.916010900051333,
      3.8335850830189884
    ],
    "uuid": "6bd15787-f345-4c5e-aa35-276acb0087b1"
  },
  "vertex_text_bison": {
    "result": "```\n    int is_palindrome(char* string) {\n        int i = 0, j = strlen(string) - 1;\n        while (i < j) {\n            if (string[i] != string[j]) {\n                return 0;\n            }\n            i++;\n            j--;\n        }\n        return 1;\n    }\n    ```",
    "duration": 1.2049321070080623,
    "result_length": 266,
    "average_duration": 1.247618214378599,
    "raw_durations": [
      1.2049321070080623,
      1.2226940339896828,
      1.2759355049347505,
      1.207887014024891,
      1.2116985559696332,
      1.2207709170179442,
      1.2931448559975252,
      1.2773849809309468,
      1.2885706910165027,
      1.2731634828960523
    ],
    "uuid": "0356af61-a957-4be2-b42e-e3276e27587d"
  },
  "vertex_gecko": {
    "result": "\n//     int i = 0;\n//     int j = strlen(string) - 1;\n//     while (i < j) {\n//         if (string[i] != string[j]) {",
    "duration": 1.2807270829798654,
    "result_length": 117,
    "average_duration": 1.3422264248831197,
    "raw_durations": [
      1.2807270829798654,
      1.4400968339759856,
      1.276685333927162,
      1.3174443329917267,
      1.3813223330071196,
      1.3919975409517065,
      1.2977430409519002,
      1.2832447499968112,
      1.373987124999985,
      1.3790158750489354
    ],
    "uuid": "e72e7574-445b-4e6e-a991-0cc051c4f88c"
  },
  "user_intention": "Live Test",
  "language": "c",
  "prompt": "int is_palindrome(char* string) {",
  "gitlab_model": {
    "result": "\n    int i = 0;\n    int j = strlen(string) - 1;\n    while (i < j) {",
    "duration": 0.6387305289972574,
    "result_length": 67,
    "average_duration": 0.6218093510018662,
    "uuid": "83e38992-1fa0-4b8a-bfc7-9c6dc3f0401b"
  }
}