{
  "anthropic": {
    "result": "package main\n\nimport \"fmt\"\n\nfunc main() {\n    nums := []int{2, 6, 1, 4, 3, 5}\n    first, second := nums[0], nums[0]\n    for _, n := range nums {\n        if n < first {\n            second = first\n            first = n\n        } else if n < second {\n            second = n\n        }\n    }\n    fmt.Println(second)\n}",
    "duration": 2.926950916997157,
    "result_length": 312,
    "average_duration": 2.797078926791437,
    "raw_durations": [
      2.926950916997157,
      2.861536961980164,
      2.5302470909664407,
      3.2616352889453992,
      2.7080215510213748,
      2.617686624987982,
      2.6407245240407065,
      2.832948673982173,
      2.589391430024989,
      3.001646204967983
    ],
    "uuid": "62fd446e-f1eb-4491-98b2-46449057fd71"
  },
  "anthropic_fast": {
    "result": "package main\n\nimport \"fmt\"\n\nfunc main() {\n    var numbers = []int{48,12,24,96,36}\n    \n    // Sort the list\n    sort.Ints(numbers)\n    \n    // Print the second smallest number\n    fmt.Println(numbers[1]) \n}",
    "duration": 1.2110185159835964,
    "result_length": 206,
    "average_duration": 1.9049307793728076,
    "raw_durations": [
      1.2110185159835964,
      1.9015511319739744,
      1.7249677119543776,
      1.4244468309916556,
      1.3459587579127401,
      1.5120472019771114,
      5.680577921913937,
      1.5685731100384146,
      1.2932039110455662,
      1.3869626999367028
    ],
    "uuid": "f006d5bc-0544-400b-93d6-255a6956f3a8"
  },
  "vertex_combined": {
    "result": "def find_second_smallest_element(list):\n  \"\"\"\n  This function finds the second smallest element in a list.\n\n  Args:\n    list: The list to be searched.\n\n  Returns:\n    The second smallest element in the list.\n  \"\"\"\n\n  # Sort the list in ascending order.\n  list.sort()\n\n  # The second smallest element is the second element in the sorted list.\n  return list[1]",
    "duration": 2.6775684700114653,
    "result_length": 358,
    "average_duration": 2.757790226198267,
    "raw_durations": [
      2.6775684700114653,
      2.638855559984222,
      2.9453829360427335,
      2.935050504980609,
      2.5945040449732915,
      2.613295317045413,
      2.774105097982101,
      2.772401383961551,
      2.9952487379778177,
      2.631490209023468
    ],
    "uuid": "c0b394eb-a89f-4312-af5d-e38c69a2ce9a"
  },
  "vertex_code_bison": {
    "result": "def find_second_smallest_element(list):\n  \"\"\"\n  This function finds the second smallest element in a list.\n\n  Args:\n    list: The list to be searched.\n\n  Returns:\n    The second smallest element in the list.\n  \"\"\"\n\n  # Sort the list in ascending order.\n  list.sort()\n\n  # The second smallest element is the second element in the sorted list.\n  return list[1]",
    "duration": 2.9489988590357825,
    "result_length": 358,
    "average_duration": 2.8921109308023008,
    "raw_durations": [
      2.9489988590357825,
      2.6489097829908133,
      3.210612542927265,
      2.657788846991025,
      2.946838421979919,
      2.594402853050269,
      3.3020899719558656,
      2.9692599209956825,
      2.972207793034613,
      2.6700003150617704
    ],
    "uuid": "94bceaa4-0905-42ba-98d0-910458f2a92d"
  },
  "vertex_text_bison": {
    "result": "package main\n\n    import (\n        \"fmt\"\n    )\n\n    func main() {\n        var list = []int{1, 2, 3, 4, 5}\n        fmt.Println(\"The second smallest element in the list is:\", findSecondSmallest(list))\n    }\n\n    func findSecondSmallest(list []int) int {\n        smallest := list[0]\n        secondSmallest := list[0]\n        for _, value := range list {\n            if value < smallest {\n                secondSmallest = smallest\n                smallest = value\n            } else if value < secondSmallest {\n                secondSmallest = value\n            }\n        }\n        return secondSmallest\n    }",
    "duration": 1.5573604559758678,
    "result_length": 605,
    "average_duration": 1.676219404290896,
    "raw_durations": [
      1.5573604559758678,
      1.550117095001042,
      1.5916191770229489,
      1.9520359330344945,
      1.769286275957711,
      2.011051047942601,
      1.5925369811011478,
      1.5886106078978628,
      1.579028856009245,
      1.5705476129660383
    ],
    "uuid": "82270c6f-97a0-4eb4-ae62-95dc5307cae7"
  },
  "vertex_gecko": {
    "result": "\n\n#include <stdio.h>\n\nint main()",
    "duration": 1.3080959169892594,
    "result_length": 32,
    "average_duration": 1.361794875212945,
    "raw_durations": [
      1.3080959169892594,
      1.4089630839880556,
      1.3232900000875816,
      1.2667558749672025,
      1.427047000033781,
      1.3776331250555813,
      1.3756461669690907,
      1.437481458997354,
      1.4265147079713643,
      1.2665214170701802
    ],
    "uuid": "a99f4e26-3ce5-4ee3-8bda-c8fdf7b1fcf0"
  },
  "user_intention": "Live Test",
  "language": "golang",
  "prompt": "Write a program to find the second smallest element in a list.",
  "gitlab_model": {
    "result": "```go\npackage main\n\nimport (\n    \"fmt\"\n    \"sort\"\n)\n\nfunc main() {\n    // Create a",
    "duration": 0.5930737169692293,
    "result_length": 82,
    "average_duration": 0.6106379612989258,
    "uuid": "7bf4186d-6ef2-4445-b56c-77cc9a0ea494"
  }
}