{
  "user_intention": "Live Test",
  "language": "javascript",
  "prompt": "// Write a program to remove duplicates from a list.",
  "anthropic": {
    "result": "function removeDuplicates(list) {\n  let unique = [];\n  for (let i = 0; i < list.length; i++) {\n    if (unique.indexOf(list[i]) === -1) {\n      unique.push(list[i]);\n    }\n  }\n  return unique;\n}",
    "duration": 1.803240648994688,
    "result_length": 193,
    "avg_duration": 2.081691764394054
  },
  "anthropic_fast": {
    "result": "function removeDuplicates(arr) {\n  let unique = [];  \n  for (let i = 0; i < arr.length; i++) {\n    if (unique.indexOf(arr[i]) === -1) {\n      unique.push(arr[i]);\n    }\n  }\n  return unique;\n}",
    "duration": 0.8915745259728283,
    "result_length": 191,
    "avg_duration": 1.1043588859960436
  },
  "vertex_combined": {
    "result": "# Create a new list.\nnew_list = []\n\n# Iterate over the original list.\nfor item in old_list:\n\n    # If the item is not in the new list, add it to the new list.\n    if item not in new_list:\n        new_list.append(item)\n\n# After iterating over the original list, the new list will not contain any duplicates.",
    "duration": 3.228706169000361,
    "result_length": 306,
    "avg_duration": 3.2221934376109855
  },
  "vertex_code_bison": {
    "result": "# Create a new list.\nnew_list = []\n\n# Iterate over the original list.\nfor item in old_list:\n\n    # If the item is not in the new list, add it to the new list.\n    if item not in new_list:\n        new_list.append(item)\n\n# After iterating over the original list, the new list will not contain any duplicates.",
    "duration": 3.3877775670262054,
    "result_length": 306,
    "avg_duration": 3.2895076095941476
  },
  "vertex_text_bison": {
    "result": "```\nfunction removeDuplicates(arr) {\n  const seen = new Set();\n  const result = [];\n  for (const element of arr) {\n    if (!seen.has(element)) {\n      seen.add(element);\n      result.push(element);\n    }\n  }\n  return result;\n}\n```",
    "duration": 1.0389608059776947,
    "result_length": 230,
    "avg_duration": 1.231714606890455
  },
  "vertex_gecko": {
    "result": ""
  },
  "gitlab_model": {
    "result": "```js\nfunction removeDuplicates(arr) {\n  // Create a new array to store the unique values.\n  const newArr = [];",
    "duration": 0.5845259709749371,
    "result_length": 111,
    "avg_duration": 0.6304502656974365
  }
}