{
  "anthropic": {
    "result": "func IsPrime(n int) bool {\n    if n <= 1 {\n        return false\n    }\n    for i := 2; i < n; i++ {\n        if n%i == 0 {\n            return false\n        }\n    }\n    return true\n}",
    "duration": 2.1647836080519482,
    "result_length": 179,
    "average_duration": 2.027905392390676,
    "raw_durations": [
      2.1647836080519482,
      2.7394342590123415,
      1.7698985169408843,
      1.844554362935014,
      1.9353109819348902,
      2.1598148880293593,
      1.6878054150147364,
      2.1612008080119267,
      1.93250584800262,
      1.8837452359730378
    ],
    "uuid": "89af8199-321f-48b3-8f5d-2e1a058e56bb"
  },
  "anthropic_fast": {
    "result": "func isPrime(num int) bool {\n    if num < 2 {\n        return false\n    }\n    \n    for i := 2; i < num; i++ {\n        if num%i == 0 {\n            return false\n        }    \n    }\n    \n    return true\n}",
    "duration": 1.3624049699865282,
    "result_length": 200,
    "average_duration": 1.0833157839719205,
    "raw_durations": [
      1.3624049699865282,
      0.9436548410449177,
      0.8452680499758571,
      0.8440382769331336,
      1.175642772926949,
      1.9233139719581231,
      0.9505762619664893,
      0.929162690998055,
      0.955047826981172,
      0.9040481769479811
    ],
    "uuid": "ce4a0ad6-7d25-4c6f-9ecc-86b5fd937b4a"
  },
  "vertex_combined": {
    "result": "def is_prime(n):\n  \"\"\"\n  Checks if a given number is prime.\n\n  Args:\n    n: The number to check.\n\n  Returns:\n    True if n is prime, False otherwise.\n  \"\"\"\n\n  # Check if n is divisible by 2.\n  if n % 2 == 0:\n    return False\n\n  # Check if n is divisible by any number from 3 to the square root of n.\n  for i in range(3, int(n ** 0.5) + 1, 2):\n    if n % i == 0:\n      return False\n\n  # If n is not divisible by any number from 2 to the square root of n, then it is prime.\n  return True",
    "duration": 3.9027555210050195,
    "result_length": 485,
    "average_duration": 3.85873992699531,
    "raw_durations": [
      3.9027555210050195,
      3.8604704830795527,
      3.7996637739706784,
      3.9039696030085906,
      3.8356857129838318,
      3.785626422963105,
      3.9230079719563946
    ],
    "uuid": "4d135746-8244-4ebb-bc03-b14660f12775"
  },
  "vertex_code_bison": {
    "result": "def is_prime(number):\n  \"\"\"\n  Checks if a given number is prime.\n\n  Args:\n    number: The number to check.\n\n  Returns:\n    True if the number is prime, False otherwise.\n  \"\"\"\n\n  # Check if the number is divisible by 2.\n  if number % 2 == 0:\n    return False\n\n  # Check if the number is divisible by any number from 3 to the square root of the number.\n  for i in range(3, int(number ** 0.5) + 1, 2):\n  ",
    "duration": 3.8672136410605162,
    "result_length": 401,
    "average_duration": 3.877451057487633,
    "raw_durations": [
      3.8672136410605162,
      3.837659487966448,
      3.9013450329657644,
      3.9035860679578036
    ],
    "uuid": "efa9ca02-ba92-4002-a55f-8ab3d97b30f4"
  },
  "vertex_text_bison": {
    "result": "func isPrime(n int) bool {\n        if n <= 1 {\n            return false\n        }\n        for i := 2; i <= n/2; i++ {\n            if n%i == 0 {\n                return false\n            }\n        }\n        return true\n    }",
    "duration": 1.0932721639983356,
    "result_length": 222,
    "average_duration": 1.15176387099782,
    "raw_durations": [
      1.0932721639983356,
      1.1730831380700693,
      1.1905491910874844,
      1.164989485987462,
      1.1712041599676013,
      1.1037706289207563,
      1.1792717449134216,
      1.1543082949938253,
      1.1704882249468938,
      1.116701677092351
    ],
    "uuid": "414d1de7-ebb4-46ac-a1be-25d84f89cadd"
  },
  "vertex_gecko": {
    "result": "\n\n// Example:\n\n// Input: 12",
    "duration": 1.4127862500026822,
    "result_length": 27,
    "average_duration": 1.4225091415806674,
    "raw_durations": [
      1.4127862500026822,
      1.3533561249496415,
      1.4761877079727128,
      1.354454957996495,
      1.3848512079566717,
      1.4230787080014125,
      1.3772295420058072,
      1.5934843749273568,
      1.4716352500254288,
      1.3780272919684649
    ],
    "uuid": "772b3e56-8247-4e93-9e8f-ce5652161153"
  },
  "user_intention": "Live Test",
  "language": "golang",
  "prompt": "Implement a function to check if a given number is prime.",
  "gitlab_model": {
    "result": "```go\nfunc isPrime(n int) bool {\n    if n <= 1 {\n        return false\n    }\n  ",
    "duration": 0.6294629669864662,
    "result_length": 78,
    "average_duration": 0.6196184771077242,
    "uuid": "dd97079e-58bb-4cd4-b050-7a2d303a0f9e"
  }
}