{
  "user_intention": "Live Test",
  "language": "c",
  "prompt": "float area_of_circle(float radius) {",
  "anthropic": {
    "result": "    float area_of_circle(float radius) {\n        return 3.14 * radius * radius; \n    }",
    "duration": 1.3838674720027484,
    "result_length": 86,
    "avg_duration": 1.5115761455032044
  },
  "anthropic_fast": {
    "result": "    float area_of_circle(float radius) {\n       return 3.14 * radius * radius;  \n    }",
    "duration": 0.5446744709624909,
    "result_length": 86,
    "avg_duration": 0.7788985297025647
  },
  "vertex_combined": {
    "result": ""
  },
  "vertex_code_bison": {
    "result": "area = pi * radius^2",
    "duration": 2.729804790986236,
    "result_length": 20
  },
  "vertex_text_bison": {
    "result": "float area;\n    area = 3.14 * radius * radius;\n    return area;\n}",
    "duration": 0.5170230669900775,
    "result_length": 65,
    "avg_duration": 0.5286829549004324
  },
  "vertex_gecko": {
    "result": ""
  },
  "gitlab_model": {
    "result": "\n  return (22 / 7) * radius * radius;\n}\n\nint main() {\n  float radius = 5;",
    "duration": 0.6411915399949066,
    "result_length": 73,
    "avg_duration": 0.6238281981903129
  }
}