{
  "user_intention": "Live Test",
  "language": "c",
  "prompt": "struct Rectangle { int length; int width; };",
  "anthropic": {
    "result": "struct Rectangle { \n    int length; \n    int width; \n};\n\nint area(struct Rectangle rect) {\n    return rect.length * rect.width; \n}\n\nint perimeter(struct Rectangle rect) {\n    return 2 * rect.length + 2 * rect.width;\n}\n\nint main() {\n    struct Rectangle rect = {10, 5};\n    printf(\"Area: %d\\n\", area(rect));\n    printf(\"Perimeter: %d\\n\", perimeter(rect));\n}",
    "duration": 3.3693419549963437,
    "result_length": 356,
    "avg_duration": 3.452260452200426
  },
  "anthropic_fast": {
    "result": "struct Rectangle { \n    int length; \n    int width; \n};\n\nint main() {\n    struct Rectangle rect;\n    rect.length = 5;\n    rect.width = 10;\n    \n    int area = rect.length * rect.width;\n    \n    printf(\"Area is %d\", area);\n}",
    "duration": 1.0540331109659746,
    "result_length": 223
  },
  "vertex_combined": {
    "result": "Rectangle myRectangle;",
    "duration": 3.7937415330088697,
    "result_length": 22
  },
  "vertex_code_bison": {
    "result": "struct Rectangle {\n  int length;\n  int width;\n};",
    "duration": 3.806041316012852,
    "result_length": 48
  },
  "vertex_text_bison": {
    "result": "struct Rectangle create_rectangle(int length, int width) {\n        struct Rectangle rectangle;\n        rectangle.length = length;\n        rectangle.width = width;\n        return rectangle;\n    }",
    "duration": 0.6368537350208499,
    "result_length": 194,
    "avg_duration": 0.6632547578890808
  },
  "vertex_gecko": {
    "result": ""
  },
  "gitlab_model": {
    "result": "\n\nint main() {\n  Rectangle rectangle;\n  rectangle.length = 10;\n  rectangle.width = 5;\n",
    "duration": 0.5604424210032448,
    "result_length": 86,
    "avg_duration": 0.6522653442982118
  }
}