{
  "anthropic": {
    "result": "// Implement a function to check if a given year is a leap year.\nint is_leap_year(int year) {\n    if (year % 400 == 0)\n        return 1;\n    if (year % 100 == 0)\n        return 0;\n    if (year % 4 == 0)\n        return 1;\n    return 0;\n}",
    "duration": 1.9376764970365912,
    "result_length": 236,
    "average_duration": 2.120731577789411,
    "raw_durations": [
      1.9376764970365912,
      2.099920376902446,
      2.2268563619581982,
      2.2132141939364374,
      2.0608573919162154,
      2.0663430710555986,
      2.1117855589836836,
      2.0673782019875944,
      2.239725311053917,
      2.183558813063428
    ],
    "uuid": "b4cfc55f-8450-49bd-94d8-9b5f4efa639a"
  },
  "anthropic_fast": {
    "result": "int is_leap_year(int year) {\n   if (year % 400 == 0) \n       return 1;\n   if (year % 100 == 0)\n       return 0; \n   if (year % 4 == 0)\n       return 1;\n   return 0;\n}",
    "duration": 1.997922767070122,
    "result_length": 166,
    "average_duration": 1.5191352118155919,
    "raw_durations": [
      1.997922767070122,
      2.0152736679883674,
      0.9477695330278948,
      0.9659818250220269,
      1.1164959319867194,
      1.0082766480045393,
      2.8977275299839675,
      1.079683370073326,
      0.9027668749913573,
      2.2594539700075984
    ],
    "uuid": "3f85510a-c5a2-4df7-92fe-4dfba17870a9"
  },
  "vertex_combined": {
    "result": "function isLeapYear(year) {\n  if (year % 4 == 0) {\n    if (year % 100 == 0) {\n      return year % 400 == 0;\n    } else {\n      return true;\n    }\n  } else {\n    return false;\n  }\n}",
    "duration": 3.552726722904481,
    "result_length": 180,
    "average_duration": 3.6704677792295115,
    "raw_durations": [
      3.552726722904481,
      3.603686268092133,
      3.6789124719798565,
      3.5375190740451217,
      3.899378124042414,
      3.7314744119066745,
      3.686081570922397,
      3.673963589943014
    ],
    "uuid": "1bb29447-8c66-489a-9e58-0122c14e37b4"
  },
  "vertex_code_bison": {
    "result": "function isLeapYear(year) {\n  if (year % 4 == 0) {\n    if (year % 100 == 0) {\n      return year % 400 == 0;\n    } else {\n      return true;\n    }\n  } else {\n    return false;\n  }\n}",
    "duration": 3.6093378179939464,
    "result_length": 180,
    "average_duration": 3.6248888957280934,
    "raw_durations": [
      3.6093378179939464,
      3.693345227977261,
      3.6818968079751357,
      3.6462880440521985,
      3.533152614021674,
      3.6697479910217226,
      3.5404537670547143
    ],
    "uuid": "33cfa68f-4589-467c-aa77-6a16f2e42a59"
  },
  "vertex_text_bison": {
    "result": "int is_leap_year(int year) {\n        if (year % 4 == 0) {\n            if (year % 100 == 0) {\n                if (year % 400 == 0) {\n                    return 1;\n                } else {\n                    return 0;\n                }\n            } else {\n                return 1;\n            }\n        } else {\n            return 0;\n        }\n    }",
    "duration": 1.109478903003037,
    "result_length": 350,
    "average_duration": 1.1517551257857122,
    "raw_durations": [
      1.109478903003037,
      1.0736354509135708,
      1.0900553540559486,
      1.0518168630078435,
      1.29674163099844,
      1.163216523011215,
      1.0476053609745577,
      1.0469698449596763,
      1.2727792429504916,
      1.365252083982341
    ],
    "uuid": "ffcd0d1a-73b4-4cb3-b997-8bfb0b9a4423"
  },
  "vertex_gecko": {
    "result": "// leapYear(2000) \u2192 true\n// leapYear(2004) \u2192 true\n// leapYear(2100) \u2192 false",
    "duration": 1.3358745409641415,
    "result_length": 75,
    "average_duration": 1.4635557000990957,
    "raw_durations": [
      1.3358745409641415,
      1.431390832993202,
      1.4890306249726564,
      2.070401542005129,
      1.4105483340099454,
      1.3619652090128511,
      1.402688791975379,
      1.3970064159948379,
      1.3460657090181485,
      1.3905850000446662
    ],
    "uuid": "3e5ee420-c0d9-4ef2-be63-3b1b5e97ce0a"
  },
  "user_intention": "Live Test",
  "language": "c",
  "prompt": "// Implement a function to check if a given year is a leap year.",
  "prompt_type": "generation",
  "gitlab_model": {
    "result": "def is_leap_year(year):\n  \"\"\"Returns True if the given year is a leap year, False otherwise.\"\"\"\n\n ",
    "duration": 0.6228850120096467,
    "result_length": 98,
    "average_duration": 0.6258824444899801,
    "uuid": "10d800e3-b899-4651-8dd9-01e239c417f9"
  }
}