{
  "user_intention": "Live Test",
  "language": "python",
  "prompt": "class Person:",
  "anthropic": {
    "result": ""
  },
  "anthropic_fast": {
    "result": "class Person:\n   def __init__(self, name):  \n       self.name = name",
    "duration": 0.586143548018299,
    "result_length": 68,
    "avg_duration": 0.6727191121142824
  },
  "vertex_combined": {
    "result": ""
  },
  "vertex_code_bison": {
    "result": ""
  },
  "vertex_text_bison": {
    "result": "def __init__(self, name, age):\n         self.name = name\n         self.age = age",
    "duration": 0.5591866580070928,
    "result_length": 80,
    "avg_duration": 0.5312599308090284
  },
  "vertex_gecko": {
    "result": ""
  },
  "gitlab_model": {
    "result": "\n  def __init__(self, name, age):\n    self.name = name\n    self.age = age\n\n  def __str",
    "duration": 0.6444359750021249,
    "result_length": 86,
    "avg_duration": 0.6495457260927651
  }
}