{
  "anthropic": {
    "result": "struct BankAccount { \n    int (* deposit)(float amount) {\n        balance += amount;\n        return 1;\n    }\n    int (* withdraw)(float amount) {\n        if (amount <= balance) {\n            balance -= amount;\n            return 1;\n        }\n        return 0;\n    }\n    float balance;\n};",
    "duration": 2.5038771010003984,
    "result_length": 287,
    "average_duration": 2.7244325074949303,
    "raw_durations": [
      2.5038771010003984,
      2.313418645062484,
      2.7218415669631213,
      2.8952374879736453,
      3.1306361419847235,
      2.6030867729568854,
      2.635383023065515,
      2.68047609901987,
      2.9015274218982086,
      2.8588408150244504
    ],
    "uuid": "4901d7a9-154c-4314-a381-23de877b6c20"
  },
  "anthropic_fast": {
    "result": "// struct BankAccount { \n    int (* deposit)(float amount);  \n    int (* withdraw)(float amount); \n};\n\nint deposit(float amount){\n    // deposit amount\n    return 0;\n}\n\nint withdraw(float amount){\n    // withdraw amount\n    return 0;\n}",
    "duration": 1.0132172598969191,
    "result_length": 235,
    "average_duration": 1.0132172598969191,
    "raw_durations": [
      1.0132172598969191
    ],
    "uuid": "e74d738c-a04e-434c-a3d9-e057de1968d1"
  },
  "vertex_combined": {
    "result": "int (*function_pointer)(float amount);",
    "duration": 3.9279255509609357,
    "result_length": 38,
    "average_duration": 3.9279255509609357,
    "raw_durations": [
      3.9279255509609357
    ],
    "uuid": "aedc8a2d-50b3-48b7-8aaa-a5c704ee6030"
  },
  "vertex_code_bison": {
    "result": "struct BankAccount {\n  int (*deposit)(float amount);\n  int (*withdraw)(float amount);\n};",
    "duration": 3.579894457012415,
    "result_length": 88,
    "average_duration": 3.579894457012415,
    "raw_durations": [
      3.579894457012415
    ],
    "uuid": "3da02d4e-3d2d-4996-9436-0045afc3dc45"
  },
  "vertex_text_bison": {
    "result": "struct BankAccount { \n        int (* deposit)(float amount); \n        int (* withdraw)(float amount); \n    };",
    "duration": 0.8532397630624473,
    "result_length": 109,
    "average_duration": 0.8331069862120785,
    "raw_durations": [
      0.8532397630624473,
      0.830445380997844,
      0.7613215571036562,
      0.8290420470293611,
      0.8422548390226439,
      0.8501075829844922,
      0.8342726730043069,
      0.8488357450114563,
      0.8322603009874001,
      0.8492899729171768
    ],
    "uuid": "8f13bc9a-0113-4116-8a64-10e5f4734137"
  },
  "vertex_gecko": {
    "result": "// struct BankAccount * bank;\n// bank->deposit(1000);\n// bank->withdraw(500);\n// bank->deposit(1000);",
    "duration": 1.4280017089331523,
    "result_length": 101,
    "average_duration": 1.3520034917979502,
    "raw_durations": [
      1.4280017089331523,
      1.332392832962796,
      1.3823367500444874,
      1.3050514999777079,
      1.3484538750490174,
      1.3527237919624895,
      1.330981667037122,
      1.343691375106573,
      1.2793742089997977,
      1.417027207906358
    ],
    "uuid": "9086b441-406b-4c4e-8ea7-7b1f20d2d6b8"
  },
  "user_intention": "Live Test",
  "language": "c",
  "prompt": "struct BankAccount { int (* deposit)(float amount); int (* withdraw)(float amount); };",
  "prompt_type": "completion",
  "gitlab_model": {
    "result": "int deposit(float amount) {\n  return 0;\n}\n\nint withdraw(float amount) {\n  return 0;",
    "duration": 0.6192143309745006,
    "result_length": 83,
    "average_duration": 0.6171369735035114,
    "uuid": "e8b2fa18-4d21-4c77-bf82-f830657be58d"
  }
}