{
  "user_intention": "Live Test",
  "language": "c",
  "prompt": "// Write a function to reverse a string.",
  "anthropic": {
    "result": "// Write a function to reverse a string.\nchar* reverse(char* str) {\n    char* start = str;\n    char* end = str + strlen(str) - 1;\n    while (start < end) {\n        char tmp = *start;\n        *start++ = *end;\n        *end-- = tmp;\n    }\n    return str;\n}",
    "duration": 2.513805049995426,
    "result_length": 253,
    "avg_duration": 2.6685739439039025
  },
  "anthropic_fast": {
    "result": "void reverse(char *str) \n{\n   char *end_ptr = str;\n   char tmp;\n  \n   if (str) {\n       while (*end_ptr) {\n           ++end_ptr;    \n       }\n       --end_ptr;  \n    \n       while (str < end_ptr) {\n           tmp = *str;\n           *str++ = *end_ptr;\n           *end_ptr-- = tmp;    \n       }\n   }\n}",
    "duration": 1.3741905320202932,
    "result_length": 299,
    "avg_duration": 1.3487177072966006
  },
  "vertex_combined": {
    "result": "def reverse_string(string):\n  \"\"\"Reverses a string.\n\n  Args:\n    string: The string to be reversed.\n\n  Returns:\n    The reversed string.\n  \"\"\"\n  new_string = \"\"\n  for character in string[::-1]:\n    new_string = character + new_string\n  return new_string\n",
    "duration": 3.487511722021736,
    "result_length": 254,
    "avg_duration": 3.525961654103594
  },
  "vertex_code_bison": {
    "result": "def reverse_string(string):\n  \"\"\"Reverses a string.\n\n  Args:\n    string: The string to reverse.\n\n  Returns:\n    The reversed string.\n  \"\"\"\n  new_string = \"\"\n  for character in string[::-1]:\n    new_string += character\n  return new_string\n\n\nif __name__ == \"__main__\":\n  # Reverse the string \"hello\".\n  reversed_string = reverse_string(\"hello\")\n  print(reversed_string)\n  # Output: \"olleh\"",
    "duration": 3.4399640479823574,
    "result_length": 387,
    "avg_duration": 3.489890485606156
  },
  "vertex_text_bison": {
    "result": "void reverse(char *str) {\n        int n = strlen(str);\n        for (int i = 0; i < n / 2; i++) {\n            char temp = str[i];\n            str[i] = str[n - i - 1];\n            str[n - i - 1] = temp;\n        }\n    }",
    "duration": 0.8783520639990456,
    "result_length": 216,
    "avg_duration": 0.9063195078866556
  },
  "vertex_gecko": {
    "result": ""
  },
  "gitlab_model": {
    "result": "```python\ndef reverse_string(string):\n  \"\"\"Reverses a string.\n\n  Args:\n    string: The string to be",
    "duration": 0.5924485169816762,
    "result_length": 99,
    "avg_duration": 0.6200381375965662
  }
}