{
  "anthropic": {
    "result": "// Create a dictionary that maps country names to their capital cities.\ncountries := map[string]string{\n    \"France\":  \"Paris\",\n    \"Italy\":   \"Rome\",\n    \"Germany\": \"Berlin\",\n    \"Spain\":   \"Madrid\",\n}",
    "duration": 1.9293823390034959,
    "result_length": 202,
    "average_duration": 2.009660610195715,
    "raw_durations": [
      1.9293823390034959,
      2.182749751023948,
      1.8805512430844828,
      1.967606243910268,
      2.164841155987233,
      1.9576299929758534,
      1.8671565629774705,
      2.0543769949581474,
      2.1779025840805843,
      1.9144092339556664
    ],
    "uuid": "702b4e18-0f21-42f8-81b5-3c10e8ad1925"
  },
  "anthropic_fast": {
    "result": "var capitals = map[string]string{\n    \n}",
    "duration": 0.8248784739989787,
    "result_length": 40,
    "average_duration": 0.6733004321111367,
    "raw_durations": [
      0.8248784739989787,
      0.6578642330132425,
      0.6056515780510381,
      0.5800728700123727,
      0.48475579102523625,
      0.5343962910119444,
      1.2023806750075892,
      0.847822259995155,
      0.4983331219991669,
      0.49684902699664235
    ],
    "uuid": "3e2ca81d-3a1d-44c1-8329-cbb4c090794d"
  },
  "vertex_combined": {
    "result": "capitals = {\n    \"Argentina\": \"Buenos Aires\",\n    \"Bolivia\": \"La Paz\",\n    \"Brazil\": \"Brasilia\",\n    \"Chile\": \"Santiago\",\n    \"Colombia\": \"Bogota\",\n    \"Ecuador\": \"Quito\",\n    \"French Guiana\": \"Cayenne\",\n    \"Guyana\": \"Georgetown\",\n    \"Paraguay\": \"Asuncion\",\n    \"Peru\": \"Lima\",\n    \"Suriname\": \"Paramaribo\",\n    \"Uruguay\": \"Montevideo\",\n    \"Venezuela\": \"Caracas\"\n}",
    "duration": 3.300492736045271,
    "result_length": 367,
    "average_duration": 3.375068727915641,
    "raw_durations": [
      3.300492736045271,
      3.2928258649772033,
      3.361817706027068,
      3.4226914379978552,
      3.410160313011147,
      3.3712882340187207,
      3.391980594024062,
      3.4259023900376633,
      3.4448848790489137,
      3.3286431239685044
    ],
    "uuid": "c4498b7a-8dc1-49f2-bf33-df5f0d51c02d"
  },
  "vertex_code_bison": {
    "result": "capitals = {\n    \"Argentina\": \"Buenos Aires\",\n    \"Bolivia\": \"La Paz\",\n    \"Brazil\": \"Brasilia\",\n    \"Chile\": \"Santiago\",\n    \"Colombia\": \"Bogota\",\n    \"Ecuador\": \"Quito\",\n    \"French Guiana\": \"Cayenne\",\n    \"Guyana\": \"Georgetown\",\n    \"Paraguay\": \"Asuncion\",\n    \"Peru\": \"Lima\",\n    \"Suriname\": \"Paramaribo\",\n    \"Uruguay\": \"Montevideo\",\n    \"Venezuela\": \"Caracas\"\n}",
    "duration": 3.3698586949612945,
    "result_length": 367,
    "average_duration": 3.3917200193041936,
    "raw_durations": [
      3.3698586949612945,
      3.4040230149403214,
      3.346238780999556,
      3.4399193830322474,
      3.4468600599793717,
      3.4106134820031,
      3.4373894500313327,
      3.353631773032248,
      3.3312838870333508,
      3.3773816670291126
    ],
    "uuid": "1f60d3cc-700a-4911-8436-a5a77eacf4f5"
  },
  "vertex_text_bison": {
    "result": "var capitals = map[string]string{\n        \"United States\": \"Washington, D.C.\",\n        \"United Kingdom\": \"London\",\n        \"France\": \"Paris\",\n        \"Germany\": \"Berlin\",\n        \"Italy\": \"Rome\",\n    }",
    "duration": 0.7944178420584649,
    "result_length": 201,
    "average_duration": 0.9617965817102231,
    "raw_durations": [
      0.7944178420584649,
      0.8081443849951029,
      1.0363754350692034,
      1.0200445769587532,
      1.0183138099964708,
      1.0171860760310665,
      1.023977278964594,
      0.966597625054419,
      0.942912498023361,
      0.9899962899507955
    ],
    "uuid": "0630a7d2-c762-43b1-beaa-57cda4604cf3"
  },
  "vertex_gecko": {
    "result": "\n        Dictionary<string, string> countryCapital = new Dictionary<string, string>();\n        countryCapital.Add(\"USA\", \"Washington DC\");\n        countryCapital.Add(\"India\", \"New Delhi\");",
    "duration": 1.2939823339693248,
    "result_length": 188,
    "average_duration": 1.347459370805882,
    "raw_durations": [
      1.2939823339693248,
      1.2758830829989165,
      1.320690624997951,
      1.4296144580002874,
      1.3543779579922557,
      1.422488084062934,
      1.3349052080884576,
      1.4214404169470072,
      1.3308726249961182,
      1.2903389160055667
    ],
    "uuid": "ea1e4e0c-56ca-4795-951b-ef68e2c50fb1"
  },
  "user_intention": "Live Test",
  "language": "golang",
  "prompt": "Create a dictionary that maps country names to their capital cities.",
  "gitlab_model": {
    "result": "```\ncountries := map[string]string{\n\t\"United States\": \"Washington, D.C.\",\n\t\"Canada\": \"Ottawa\",",
    "duration": 0.5475799769628793,
    "result_length": 94,
    "average_duration": 1.2623694634879938,
    "uuid": "ac939f69-a254-47bb-aef5-a6d3c236fcb5"
  }
}