{
  "anthropic": {
    "result": "#include <stdio.h>\n\nint sum(int arr[], int n) {\n    int sum = 0;\n    for (int i = 0; i < n; i++) {\n        sum += arr[i];\n    }\n    return sum;\n}\n\nint main() {\n    int arr[] = {1, 2, 3, 4, 5};\n    int n = sizeof(arr) / sizeof(arr[0]);\n    int total = sum(arr, n);\n    printf(\"The sum is %d\", total);\n    return 0;\n}",
    "duration": 2.8703837390057743,
    "result_length": 315,
    "average_duration": 3.0376481786628977,
    "raw_durations": [
      2.8703837390057743,
      3.423487110994756,
      3.418918502982706,
      3.263096631038934,
      2.9535506839165464,
      2.770978882908821,
      2.85083869099617,
      3.0237161400727928,
      2.7638632260495797
    ],
    "uuid": "fd6220b2-9191-4f65-905a-bbb81a300d5f"
  },
  "anthropic_fast": {
    "result": "#include <stdio.h>\n\nint main() {\n   int n, i;  \n   int sum = 0;\n   printf(\"Enter the number of elements: \");    \n   scanf(\"%d\", &n);\n   int arr[n];\n   printf(\"Enter %d elements: \", n);\n   for (i = 0; i < n; i++) {\n      scanf(\"%d\", &arr[i]);  \n      sum += arr[i];\n   }\n   printf(\"Sum = %d\", sum);\n   return 0;\n}",
    "duration": 1.5936641229782254,
    "result_length": 312,
    "average_duration": 1.70190276800422,
    "raw_durations": [
      1.5936641229782254,
      1.6290783809963614,
      1.7433348470367491,
      2.4108208409743384,
      1.4135066570015624,
      1.9641033180523664,
      1.690715983044356,
      1.4424605430103838,
      1.5584436169592664,
      1.5728993699885905
    ],
    "uuid": "aa94675f-3455-47d1-9978-f7c3b9bd4db7"
  },
  "vertex_combined": {
    "result": "# Initialize a variable to store the sum.\nsum = 0\n\n# Iterate over the list, adding each number to the sum.\nfor number in list:\n    sum += number\n\n# Print the sum.\nprint(sum)",
    "duration": 3.051827601972036,
    "result_length": 173,
    "average_duration": 3.1019214398926125,
    "raw_durations": [
      3.051827601972036,
      3.063773095025681,
      3.0998373540351167,
      3.048555026995018,
      3.122656762949191,
      3.203156459960155,
      3.124093084014021,
      3.117547050002031,
      3.0612757339840755,
      3.1264922299887985
    ],
    "uuid": "b92e3dc4-382d-4a20-ae6e-ed853cd8e796"
  },
  "vertex_code_bison": {
    "result": "# Initialize a variable to store the sum of all numbers.\nsum = 0\n\n# Iterate through the list of numbers.\nfor number in list_of_numbers:\n\n    # Add the number to the sum variable.\n    sum += number\n\n# After iterating through the entire list, the sum variable will contain the sum of all numbers in the list.\nprint(sum)",
    "duration": 3.131240906077437,
    "result_length": 317,
    "average_duration": 3.108649564825464,
    "raw_durations": [
      3.131240906077437,
      3.1118497060379013,
      3.1316942010307685,
      3.1294238230912015,
      3.1204234559554607,
      3.1392634839285165,
      3.1381946799810976,
      3.046528201084584,
      3.0563681970816106,
      3.0815089939860627
    ],
    "uuid": "1a131f31-1b73-4463-91dc-830a2383ea37"
  },
  "vertex_text_bison": {
    "result": "#include <stdio.h>\n    int main() {\n        int n, i, sum = 0;\n        scanf(\" %d \", &n);\n        int arr[n];\n        for (i = 0; i < n; i++) {\n            scanf(\" %d \", &arr[i]);\n        }\n        for (i = 0; i < n; i++) {\n            sum = sum + arr[i];\n        }\n        printf(\" %d \", sum);\n        return 0;\n    }",
    "duration": 1.544653719989583,
    "result_length": 318,
    "average_duration": 1.6181530588888564,
    "raw_durations": [
      1.544653719989583,
      1.4644398480886593,
      2.454555586911738,
      1.5280309789814055,
      1.5393678579712287,
      1.5525983950356022,
      1.5477465749718249,
      1.5383160619530827,
      1.542476471979171,
      1.4693450930062681
    ],
    "uuid": "892d38cf-417c-4ae7-8a94-ddca53f41859"
  },
  "vertex_gecko": {
    "result": "import java.util.ArrayList;\nimport java.util.Scanner;",
    "duration": 1.2899904580553994,
    "result_length": 53,
    "average_duration": 1.3424982540193013,
    "raw_durations": [
      1.2899904580553994,
      1.2680177910951898,
      1.3335752499988303,
      1.2723467499017715,
      1.3856764590600505,
      1.2680672500282526,
      1.2608313750242814,
      1.4928244160255417,
      1.4641262500081211,
      1.3895265409955755
    ],
    "uuid": "f3f32f22-ad1b-4d6b-a186-b619b5b93c16"
  },
  "user_intention": "Live Test",
  "language": "c",
  "prompt": "// Write a program to calculate the sum of all numbers in a given list.",
  "prompt_type": "generation",
  "gitlab_model": {
    "result": "def sum_list(nums):\n  total = 0\n  for num in nums:\n    total += num",
    "duration": 0.5695724510005675,
    "result_length": 67,
    "average_duration": 0.6185048028884921,
    "uuid": "76af0f22-2a99-4ed6-b9b0-0d725a1e5b79"
  }
}