{
  "user_intention": "Live Test",
  "language": "python",
  "prompt": "# Implement a function to find the largest element in a list.",
  "anthropic": {
    "result": "def largest(list):\n    largest = list[0]\n    for num in list:\n        if num > largest:\n            largest = num\n    return largest",
    "duration": 1.7917376419936772,
    "result_length": 132,
    "avg_duration": 1.8750598796032136
  },
  "anthropic_fast": {
    "result": "def find_largest(list): \n    largest = list[0]  \n    for i in list:  \n        if i > largest:  \n            largest = i  \n    return largest",
    "duration": 0.730969947995618,
    "result_length": 140,
    "avg_duration": 0.7649222864944022
  },
  "vertex_combined": {
    "result": "def find_largest_element(list):\n  \"\"\"\n  Finds the largest element in a list.\n\n  Args:\n    list: The list to search.\n\n  Returns:\n    The largest element in the list.\n  \"\"\"\n\n  # Initialize the largest element to the first element in the list.\n  largest_element = list[0]\n\n  # Iterate over the remaining elements in the list.\n  for element in list[1:]:\n    # If the current element is larger than the largest element, update the largest element.\n    if element > largest_element:\n      largest_element = element\n\n  # Return the largest element.\n  return largest_element",
    "duration": 3.7028402329888195,
    "result_length": 566,
    "avg_duration": 3.634762138192309
  },
  "vertex_code_bison": {
    "result": "def find_largest_element(list):\n  \"\"\"\n  Finds the largest element in a list.\n\n  Args:\n    list: The list to search.\n\n  Returns:\n    The largest element in the list.\n  \"\"\"\n\n  # Initialize the largest element to the first element in the list.\n  largest_element = list[0]\n\n  # Iterate over the rest of the elements in the list.\n  for element in list[1:]:\n    # If the current element is larger than the largest element, update the largest element.\n    if element > largest_element:\n      largest_element = element\n\n  # Return the largest element.\n  return largest_element",
    "duration": 3.415218317997642,
    "result_length": 568,
    "avg_duration": 3.588217221200466
  },
  "vertex_text_bison": {
    "result": "def find_largest(nums):\n        largest = nums[0]\n        for num in nums:\n            if num > largest:\n                largest = num\n        return largest",
    "duration": 0.6359645500197075,
    "result_length": 157,
    "avg_duration": 0.677280553104356
  },
  "vertex_gecko": {
    "result": ""
  },
  "gitlab_model": {
    "result": "```python\ndef find_largest_element(list1):\n  \"\"\"\n  Finds the largest element in a list.\n\n  Args",
    "duration": 0.5481178300105967,
    "result_length": 95,
    "avg_duration": 0.6199105417996179
  }
}