{
  "user_intention": "Live Test",
  "language": "python",
  "prompt": "# Implement a function to check if a given number is even or odd.",
  "anthropic": {
    "result": "# Implement a function to check if a given number is even or odd.\ndef is_even(num):\n    if num % 2 == 0:\n        return True\n    else:\n        return False",
    "duration": 1.6390019860118628,
    "result_length": 155,
    "avg_duration": 1.830242974704015
  },
  "anthropic_fast": {
    "result": "# Implement a function to check if a given number is even or odd.\ndef check_number(num):\n    if num % 2 == 0:\n        print(f\"{num} is even\")\n    else:\n        print(f\"{num} is odd\")",
    "duration": 0.9178270129777957,
    "result_length": 182,
    "avg_duration": 0.9416019537020475
  },
  "vertex_combined": {
    "result": "number = 10",
    "duration": 3.770842750003794,
    "result_length": 11,
    "avg_duration": 3.824317002503085
  },
  "vertex_code_bison": {
    "result": "number = 10",
    "duration": 3.815380055020796,
    "result_length": 11,
    "avg_duration": 3.827590756007703
  },
  "vertex_text_bison": {
    "result": "def is_even(n):\n        return n % 2 == 0\n",
    "duration": 0.4911482850147877,
    "result_length": 42,
    "avg_duration": 0.5217596492002485
  },
  "vertex_gecko": {
    "result": ""
  },
  "gitlab_model": {
    "result": "```python\ndef is_even(number):\n  \"\"\"Return True if the given number is even, False otherwise.\"\"\"\n\n  if number % ",
    "duration": 0.6302324970019981,
    "result_length": 112,
    "avg_duration": 0.6643962086091051
  }
}