{
  "anthropic": {
    "result": "// countryCapitalMap := map[string]string{  \n\"France\": \"Paris\",\n\"Italy\": \"Rome\",\n\"Japan\": \"Tokyo\",\n\"India\": \"New Delhi\"\n}",
    "duration": 2.0350892529822886,
    "result_length": 121,
    "average_duration": 2.133817818481475,
    "raw_durations": [
      2.0350892529822886,
      1.8402767869411036,
      2.282873118063435,
      2.3770321159390733
    ],
    "uuid": "6e4f2eb3-c2bd-446a-8fc0-140ef191fb82"
  },
  "anthropic_fast": {
    "result": "// countryCapitalMap := map[string]string{\n   \"France\": \"Paris\", \n   \"Japan\": \"Tokyo\",\n   \"India\": \"New Delhi\"\n}",
    "duration": 0.886946149985306,
    "result_length": 112,
    "average_duration": 1.2421596233849415,
    "raw_durations": [
      0.886946149985306,
      1.1991349559975788,
      0.8729813050013036,
      3.458994141081348,
      0.8498900990234688,
      0.8876038149464875,
      1.6145411500474438,
      0.9668369379360229,
      0.7641730959294364,
      0.9204945839010179
    ],
    "uuid": "84047204-7465-4ab5-9977-557d2fdea4e5"
  },
  "vertex_combined": {
    "result": "countryCapitalMap := map[string]string{\n    \"United States\": \"Washington, D.C.\",\n    \"Canada\": \"Ottawa\",\n    \"Mexico\": \"Mexico City\",\n    \"Brazil\": \"Brasilia\",\n    \"Argentina\": \"Buenos Aires\",\n    \"Chile\": \"Santiago\",\n    \"Colombia\": \"Bogota\",\n    \"Peru\": \"Lima\",\n    \"Venezuela\": \"Caracas\",\n}",
    "duration": 3.5833612460410222,
    "result_length": 293,
    "average_duration": 3.3416419130982833,
    "raw_durations": [
      3.5833612460410222,
      3.8665468770777807,
      2.9128139190142974,
      3.9259964999509975,
      3.076272759004496,
      2.3633102769963443,
      2.9797663509380072,
      3.8302647840464488,
      2.9598580528981984,
      3.9182283650152385
    ],
    "uuid": "88078acc-8c5e-43f7-a78b-3162fb5527b8"
  },
  "vertex_code_bison": {
    "result": "countryCapitalMap := map[string]string{\n    \"United States\": \"Washington, D.C.\",\n    \"Canada\": \"Ottawa\",\n    \"Mexico\": \"Mexico City\",\n    \"Brazil\": \"Brasilia\",\n    \"Argentina\": \"Buenos Aires\",\n    \"Chile\": \"Santiago\",\n    \"Colombia\": \"Bogota\",\n    \"Peru\": \"Lima\",\n    \"Venezuela\": \"Caracas\",\n}",
    "duration": 3.8434591570403427,
    "result_length": 293,
    "average_duration": 3.464981127018109,
    "raw_durations": [
      3.8434591570403427,
      3.8744357930263504,
      2.5096597720403224,
      3.834501354023814,
      3.9054146729176864,
      3.8238447749754414,
      2.5204654710832983,
      3.9338991349795833,
      2.5635917760664597,
      3.8405393640277907
    ],
    "uuid": "a7096ea8-68c8-475f-95a1-b2f9a667a104"
  },
  "vertex_text_bison": {
    "result": "countryCapitalMap := map[string]string{\n        \"India\": \"New Delhi\",\n        \"United States\": \"Washington, D.C.\",\n        \"United Kingdom\": \"London\",\n        \"France\": \"Paris\",\n        \"Germany\": \"Berlin\",\n        \"China\": \"Beijing\",\n        \"Japan\": \"Tokyo\",\n        \"Italy\": \"Rome\",\n        \"Spain\": \"Madrid\",\n    }",
    "duration": 1.294902466936037,
    "result_length": 318,
    "average_duration": 1.7655923406826333,
    "raw_durations": [
      1.294902466936037,
      1.7084036369342357,
      1.339542901958339,
      1.3476769219851121,
      1.4310045490274206,
      2.2994374280096963,
      1.2214573109522462,
      2.279425407992676,
      2.3729635869385675,
      2.361109196092002
    ],
    "uuid": "aebe3f23-7ac1-43e1-8c3e-5ca11695b4e4"
  },
  "vertex_gecko": {
    "result": "\n// \t\"India\": \"Delhi\",\n// \t\"USA\":   \"Washington\",\n// \t\"China\": \"Beijing\",\n// }",
    "duration": 1.2425071250181645,
    "result_length": 78,
    "average_duration": 1.4042996583855711,
    "raw_durations": [
      1.2425071250181645,
      1.3387102499837056,
      1.488112207967788,
      1.4814437089953572,
      1.4790009999414906,
      1.5050236249808222,
      1.7512301249662414,
      1.258153292001225,
      1.324697499978356,
      1.1741177500225604
    ],
    "uuid": "e64ca76e-dcb5-40ed-8d5a-b868430f774e"
  },
  "user_intention": "Live Test",
  "language": "golang",
  "prompt": "countryCapitalMap := map[string]string{",
  "gitlab_model": {
    "result": "\n    \"France\": \"Paris\",\n    \"Italy\": \"Rome\",\n    \"Germany\": \"Berlin\",\n}",
    "duration": 0.6319685110356659,
    "result_length": 71,
    "average_duration": 0.6336038045817987,
    "uuid": "689c7865-1e8b-440b-adae-a9c0dab9ecf4"
  }
}