{
  "anthropic": {
    "result": "// const nameAgeMap = {\n    \"John\": 30,\n    \"Amy\": 12,\n    \"Lisa\": 56\n}",
    "duration": 1.6667467440711334,
    "result_length": 71,
    "average_duration": 1.6667467440711334,
    "raw_durations": [
      1.6667467440711334
    ],
    "uuid": "3f3e70e4-3b0f-4f97-9f11-4839a8266d3f"
  },
  "anthropic_fast": {
    "result": "// const nameAgeMap = {\n   John: 30,\n   Mary: 25\n}",
    "duration": 0.7060621139826253,
    "result_length": 50,
    "average_duration": 0.981165574293118,
    "raw_durations": [
      0.7060621139826253,
      0.7913469449849799,
      0.6671705020125955,
      0.6037996410159394,
      1.5509855119744316,
      0.6633132830029353,
      0.6326731248991564,
      0.8220972380368039,
      2.6001027390593663,
      0.774104643962346
    ],
    "uuid": "39b17ffb-0421-48db-9067-7bacc9de1f62"
  },
  "vertex_combined": {
    "result": "const nameAgeMap = {\n  \"John\": 20,\n};",
    "duration": 1.2656700370134786,
    "result_length": 37,
    "average_duration": 1.3579825030872599,
    "raw_durations": [
      1.2656700370134786,
      1.721973235020414,
      1.214170670020394,
      1.2682566409930587,
      1.2660844209603965,
      1.268529710941948,
      1.6399921140400693,
      1.2462004499975592,
      1.400910791940987,
      1.288036959944293
    ],
    "uuid": "26d1f322-46f4-4d50-8139-6a7139cfa202"
  },
  "vertex_code_bison": {
    "result": "const nameAgeMap = {\n  \"John\": 20,\n  \"Jane\": 21,\n  \"Mary\": 22\n};",
    "duration": 1.7493000170215964,
    "result_length": 64,
    "average_duration": 1.4145765476045198,
    "raw_durations": [
      1.7493000170215964,
      1.359395214007236,
      1.3233659910038114,
      1.2427556099137291,
      1.2599944620160386,
      1.241774988011457,
      1.7261078580049798,
      1.326012077042833,
      1.6438927280250937,
      1.2731665309984237
    ],
    "uuid": "f075f9bb-9009-4e43-a260-b6e58ba657d6"
  },
  "vertex_text_bison": {
    "result": "const nameAgeMap = {\n      \"John\": 20,\n      \"Jane\": 21,\n      \"Mary\": 22,\n    };",
    "duration": 0.9258262779330835,
    "result_length": 81,
    "average_duration": 0.9126895341207273,
    "raw_durations": [
      0.9258262779330835,
      0.918244315078482,
      0.9277749069733545,
      0.9572219320107251,
      0.9419826089870185,
      0.8297308210749179,
      0.9286216670880094,
      0.9137114450568333,
      0.9376609389437363,
      0.8461204280611128
    ],
    "uuid": "682814c0-53cf-4b65-a9ce-b39ca9ffe042"
  },
  "vertex_gecko": {
    "result": "//   name: 'James',\n//   age: 25,\n// };",
    "duration": 1.2844871670240536,
    "result_length": 39,
    "average_duration": 1.4175074165919797,
    "raw_durations": [
      1.2844871670240536,
      1.4001379578839988,
      1.2449411249253899,
      1.3860739999217913,
      1.5196762080304325,
      1.6937738750129938,
      1.3037784170592204,
      1.3628571250010282,
      1.4862425830215216,
      1.4931057080393657
    ],
    "uuid": "451b1f80-c50e-4b05-8432-dde1339aa61d"
  },
  "user_intention": "Live Test",
  "language": "javascript",
  "prompt": "const nameAgeMap = {",
  "prompt_type": "completion",
  "gitlab_model": {
    "result": "'James': 29,\n  'John': 31,\n  'John': 28,\n  'John': 30,",
    "duration": 0.5891230359993642,
    "result_length": 54,
    "average_duration": 0.6220178919000319,
    "uuid": "1e3730a0-9fbd-4cd1-b9b7-b9b99d2422a9"
  }
}