{
  "anthropic": {
    "result": "// long factorial(int n) {\n        if (n == 0) {\n            return 1; \n        }\n        else {\n            return n * factorial(n-1);\n        }\n    }",
    "duration": 1.9544154009781778,
    "result_length": 151,
    "average_duration": 1.7145474737044424,
    "raw_durations": [
      1.9544154009781778,
      1.7162686879746616,
      1.63033966999501,
      1.7231012770207599,
      1.5338273339439183,
      1.8429955150932074,
      1.6569502969505265,
      1.8061150830471888,
      1.5623094390612096,
      1.719152032979764
    ],
    "uuid": "c5135626-4bd2-411f-ac1a-409f282bfdac"
  },
  "anthropic_fast": {
    "result": "// long factorial(int n) { \n    if (n == 0)\n        return 1;\n    return n * factorial(n-1);\n}",
    "duration": 0.749320050003007,
    "result_length": 94,
    "average_duration": 1.1123305764980613,
    "raw_durations": [
      0.749320050003007,
      0.9385141489328817,
      0.9359474689699709,
      0.999170913011767,
      1.0571079780347645,
      0.7236204360378906,
      0.7443096609786153,
      1.3030755650252104,
      0.978943431051448,
      2.6932961129350588
    ],
    "uuid": "70e1d023-f5db-4bdc-863f-dd9806a00875"
  },
  "vertex_combined": {
    "result": "long factorial(int n) {\n  if (n == 0) {\n    return 1;\n  } else {\n    return n * factorial(n - 1);\n  }\n}",
    "duration": 1.2744773930171505,
    "result_length": 103,
    "average_duration": 1.324366638995707,
    "raw_durations": [
      1.2744773930171505,
      1.3787371709477156,
      1.3134870369685814,
      1.3048136649886146,
      1.3212312139803544,
      1.2923393429955468,
      1.311127476976253,
      1.3914253880502656,
      1.319379150052555,
      1.3366485519800335
    ],
    "uuid": "4791ecf5-9f9b-43f0-9d90-545d08a04199"
  },
  "vertex_code_bison": {
    "result": "long factorial(int n) {\n  if (n == 0) {\n    return 1;\n  } else {\n    return n * factorial(n - 1);\n  }\n}",
    "duration": 1.3024533849675208,
    "result_length": 103,
    "average_duration": 1.3431296239956283,
    "raw_durations": [
      1.3024533849675208,
      1.3924732309533283,
      1.3166527880821377,
      1.2608886520611122,
      1.3925897559383884,
      1.3035099749686196,
      1.2976241069845855,
      1.3838468410540372,
      1.3979305080138147,
      1.3833269969327375
    ],
    "uuid": "b561dcef-63be-4382-8079-630048dc27d0"
  },
  "vertex_text_bison": {
    "result": "long factorial(int n) {\n        if (n == 0)\n            return 1;\n        else\n            return n * factorial(n - 1);\n    }\n    ```",
    "duration": 1.0738000189885497,
    "result_length": 133,
    "average_duration": 0.9841708054183982,
    "raw_durations": [
      1.0738000189885497,
      0.9345303089357913,
      0.9979807010386139,
      0.9920764600392431,
      0.9114949239883572,
      1.0097014050697908,
      0.9989817769965157,
      0.921871719066985,
      1.0049522439949214,
      0.9963184960652143
    ],
    "uuid": "b49dc633-fe6e-4b06-afa6-34d4235a9781"
  },
  "vertex_gecko": {
    "result": "//     if (n == 0) {\n//         return 1;\n//     }\n//     return n * factorial(n - 1);",
    "duration": 1.5262723750201985,
    "result_length": 86,
    "average_duration": 1.4051033751107753,
    "raw_durations": [
      1.5262723750201985,
      1.3895216250093654,
      1.3818799590226263,
      1.3784941249759868,
      1.4693630000110716,
      1.4464294170029461,
      1.4263260000152513,
      1.3456540410406888,
      1.402017791988328,
      1.2850754170212895
    ],
    "uuid": "a8421680-e8b4-4b1c-bab3-b67812753f03"
  },
  "user_intention": "Live Test",
  "language": "c",
  "prompt": "long factorial(int n) {",
  "prompt_type": "completion",
  "gitlab_model": {
    "result": "if (n == 0) {\n        return 1;\n    }\n    return n * factorial(n - 1",
    "duration": 0.6271852600038983,
    "result_length": 68,
    "average_duration": 0.6174756295047701,
    "uuid": "71254d46-64ca-4254-bfef-1fee0de0d1a4"
  }
}