{
  "user_intention": "Live Test",
  "language": "python",
  "prompt": "# Implement a function to calculate the area of a circle given its radius.",
  "anthropic": {
    "result": "# Implement a function to calculate the area of a circle given its radius.\ndef calculate_area(radius):\n    import math\n    area = math.pi * radius ** 2\n    return area",
    "duration": 1.6367900559853297,
    "result_length": 167
  },
  "anthropic_fast": {
    "result": "import math  \n\ndef area_of_circle(radius):\n    return math.pi * radius ** 2",
    "duration": 0.7056929399841465,
    "result_length": 75,
    "avg_duration": 0.843489405096625
  },
  "vertex_combined": {
    "result": "area = \u03c0 * radius^2",
    "duration": 3.9116238740098197,
    "result_length": 19,
    "avg_duration": 3.8023546974960483
  },
  "vertex_code_bison": {
    "result": "def area_of_circle(radius):\n  \"\"\"Calculates the area of a circle given its radius.\n\n  Args:\n    radius: The radius of the circle.\n\n  Returns:\n    The area of the circle.\n  \"\"\"\n\n  # Calculate the area of the circle.\n  area = math.pi * radius ** 2\n\n  # Return the area of the circle.\n  return area",
    "duration": 3.8467233470000792,
    "result_length": 295,
    "avg_duration": 3.799505839101039
  },
  "vertex_text_bison": {
    "result": "def area_of_circle(radius):\n        \"\"\"\n        Calculates the area of a circle given its radius.\n\n        Args:\n            radius: The radius of the circle in meters.\n\n        Returns:\n            The area of the circle in square meters.\n        \"\"\"\n        return math.pi * radius ** 2\n",
    "duration": 0.8921260249917395,
    "result_length": 289,
    "avg_duration": 0.88569190169801
  },
  "vertex_gecko": {
    "result": ""
  },
  "gitlab_model": {
    "result": "```python\ndef area_of_circle(radius):\n  \"\"\"Calculates the area of a circle given its radius.\n\n  Args:",
    "duration": 0.5960707390040625,
    "result_length": 101,
    "avg_duration": 0.8477007925976068
  }
}