{
  "user_intention": "Live Test",
  "language": "javascript",
  "prompt": "// Create a dictionary that maps country names to their capital cities.",
  "anthropic": {
    "result": "// Create a dictionary that maps country names to their capital cities.\nconst countries = {\n  Canada: 'Ottawa',\n  Italy: 'Rome',\n  Japan: 'Tokyo',\n  India: 'New Delhi' \n}",
    "duration": 1.9544146670377813,
    "result_length": 170,
    "avg_duration": 2.3257224697910717
  },
  "anthropic_fast": {
    "result": "// Create a dictionary that maps country names to their capital cities.\nlet capitals = {\n  France: \"Paris\",\n  Japan: \"Tokyo\",\n  Australia: \"Canberra\"\n};",
    "duration": 0.8031665349844843,
    "result_length": 152,
    "avg_duration": 0.9278165423020255
  },
  "vertex_combined": {
    "result": "capitals = {\n    \"Argentina\": \"Buenos Aires\",\n    \"Bolivia\": \"La Paz\",\n    \"Brazil\": \"Brasilia\",\n    \"Chile\": \"Santiago\",\n    \"Colombia\": \"Bogota\",\n    \"Ecuador\": \"Quito\",\n    \"French Guiana\": \"Cayenne\",\n    \"Guyana\": \"Georgetown\",\n    \"Paraguay\": \"Asuncion\",\n    \"Peru\": \"Lima\",\n    \"Suriname\": \"Paramaribo\",\n    \"Uruguay\": \"Montevideo\",\n    \"Venezuela\": \"Caracas\"\n}",
    "duration": 3.329526651999913,
    "result_length": 367,
    "avg_duration": 3.327528900501784
  },
  "vertex_code_bison": {
    "result": "capitals = {\n    \"Argentina\": \"Buenos Aires\",\n    \"Bolivia\": \"La Paz\",\n    \"Brazil\": \"Brasilia\",\n    \"Chile\": \"Santiago\",\n    \"Colombia\": \"Bogota\",\n    \"Ecuador\": \"Quito\",\n    \"French Guiana\": \"Cayenne\",\n    \"Guyana\": \"Georgetown\",\n    \"Paraguay\": \"Asuncion\",\n    \"Peru\": \"Lima\",\n    \"Suriname\": \"Paramaribo\",\n    \"Uruguay\": \"Montevideo\",\n    \"Venezuela\": \"Caracas\"\n}",
    "duration": 3.318264867994003,
    "result_length": 367,
    "avg_duration": 3.3593993346032223
  },
  "vertex_text_bison": {
    "result": "var capitals = {\n      \"United States\": \"Washington, D.C.\",\n      \"Canada\": \"Ottawa\",\n      \"Mexico\": \"Mexico City\",\n      \"United Kingdom\": \"London\",\n      \"France\": \"Paris\",\n      \"Germany\": \"Berlin\",\n      \"Italy\": \"Rome\",\n      \"Spain\": \"Madrid\",\n      \"China\": \"Beijing\",\n      \"India\": \"New Delhi\",\n      \"Japan\": \"Tokyo\",\n      \"South Korea\": \"Seoul\",\n      \"Brazil\": \"Brasilia\",\n      \"Argentina\": \"Buenos Aires\",\n      \"Australia\": \"Canberra\",\n      \"New Zealand\": \"Wellington\"\n    };",
    "duration": 2.0351915869978257,
    "result_length": 493,
    "avg_duration": 2.065017070900649
  },
  "vertex_gecko": {
    "result": ""
  },
  "gitlab_model": {
    "result": "```js\nconst capitalCities = {\n  \"Afghanistan\": \"Kabul\",\n  \"Albania\": \"Tirana\",\n  \"Algeria",
    "duration": 0.5868098969804123,
    "result_length": 89,
    "avg_duration": 0.6338171133829746
  }
}