module gitlab.com/gitlab-org/manage/access/pam-gitlab

go 1.13

require (
	github.com/mattn/go-shellwords v0.0.0-20190425161501-2444a32a19f4
	github.com/otiai10/copy v1.0.1
	github.com/otiai10/curr v1.0.0 // indirect
	github.com/sirupsen/logrus v1.3.0
	github.com/stretchr/testify v1.4.0
	gitlab.com/gitlab-org/gitaly v1.68.0
	gitlab.com/gitlab-org/labkit v0.0.0-20200507062444-0149780c759d
	google.golang.org/grpc v1.24.0
	gopkg.in/yaml.v2 v2.2.4
        gitlab.com/gitlab-org/gitlab-shell v0.0.0-20200821152636-82ec8144fb2a
)
