{
  "issuer": "http://whatever:9999/",
  "authorization_endpoint": "https://9999-%s/authorize",
  "token_endpoint": "http://localhost:9999/token",
  "userinfo_endpoint": "http://localhost:9999/userinfo",
  "jwks_uri": "http://localhost:9999/.well-known/jwks.json",
  "response_types_supported": [
    "code",
    "id_token",
    "token id_token"
  ],
  "token_endpoint_auth_methods_supported": [
    "client_secret_basic"
  ]
}