module github.com/timescale/tsbs

go 1.14

require (
	github.com/ClickHouse/clickhouse-go v1.4.8
	github.com/HdrHistogram/hdrhistogram-go v1.0.0
	github.com/SiriDB/go-siridb-connector v0.0.0-20190110105621-86b34c44c921
	github.com/StackExchange/wmi v0.0.0-20190523213315-cbe66965904d // indirect
	github.com/andreyvit/diff v0.0.0-20170406064948-c7f18ee00883
	github.com/aws/aws-sdk-go v1.35.13
	github.com/blagojts/viper v1.6.3-0.20200313094124-068f44cf5e69
	github.com/globalsign/mgo v0.0.0-20181015135952-eeefdecb41b8
	github.com/go-ole/go-ole v1.2.4 // indirect
	github.com/gocql/gocql v0.0.0-20190810123941-df4b9cc33030
	github.com/golang/protobuf v1.4.2
	github.com/golang/snappy v0.0.1
	github.com/google/flatbuffers v1.11.0
	github.com/google/go-cmp v0.5.2
	github.com/jackc/pgx/v4 v4.8.0
	github.com/jmoiron/sqlx v1.2.1-0.20190826204134-d7d95172beb5
	github.com/lib/pq v1.3.0
	github.com/pkg/errors v0.9.1
	github.com/prometheus/common v0.13.0
	github.com/shirou/gopsutil v3.21.3+incompatible
	github.com/spf13/cobra v1.0.0
	github.com/spf13/pflag v1.0.5
	github.com/timescale/promscale v0.0.0-20201006153045-6a66a36f5c84
	github.com/tklauser/go-sysconf v0.3.5 // indirect
	github.com/transceptor-technology/go-qpack v0.0.0-20190116123619-49a14b216a45
	github.com/valyala/fasthttp v1.15.1
	go.uber.org/atomic v1.6.0
	golang.org/x/net v0.0.0-20200904194848-62affa334b73
	golang.org/x/time v0.0.0-20200630173020-3af7569d3a1e
	gopkg.in/yaml.v2 v2.3.0
)
