{
    "version": "15.0.6",
    "scan": {
        "analyzer": {
            "id": "my_custom_analyzer",
            "name": "A Custom Analyzer",
            "vendor": {
                "name": "SamAnalyze"
            },
            "version": "1.0.0"
        },
        "scanner": {
            "id": "my_custom_scanner",
            "name": "A Custom Scanner",
            "vendor": {
                "name": "SamScan"
            },
            "version": "1.0"
        },
        "start_time": "2022-04-07T12:26:58",
        "end_time": "2022-04-26T12:26:00",
        "status": "success",
        "messages": [],
        "type": "sast"
    },
    "vulnerabilities": [
        {
            "id": "asdnmvxzaslk391011",
            "name": "Sam's custom vulnerability",
            "description": "Let's make a long-form description to explain the problem and why it is a vulnerability",
            "severity": "High",
            "location": {
                "file": "src/myapp.c",
                "start_line": 8,
                "dependency": {
                    "package": {}
                }
            },
            "identifiers": [
                {
                    "type": "my_scan_id",
                    "name": "MyScan ID: 17",
                    "value": "17"
                }
            ]
        },
        {
            "id": "klsnmllfgg298390rp1fli2ifh",
            "name": "Sam's second custom vulnerability",
            "description": "Let's make a long-form description to explain the problem and why it is a vulnerability",
            "severity": "Medium",
            "location": {
                "file": "src/myapp.c",
                "start_line": 20,
                "dependency": {
                    "package": {}
                }
            },
            "identifiers": [
                {
                    "type": "my_scan_id",
                    "name": "MyScan ID: 18",
                    "value": "18"
                }
            ]
        }
    ],
    "remediations": []
}
