{
  "vulnerabilities": [
    {
      "id": "1ef123cde3a5f318e3fceb936548f3a3aec50e10",
      "severity": "Low",
      "location": {
        "dependency": {
          "package": {
            "name": "apt"
          },
          "version": "2.2.4"
        },
        "operating_system": "debian 11.3",
        "image": "cypress/included:10.0.0"
      },
      "identifiers": [
        {
          "type": "cve",
          "name": "CVE-2011-3374",
          "value": "CVE-2011-3374",
          "url": "https://access.redhat.com/security/cve/cve-2011-3374"
        }
      ],
      "links": [
        {
          "url": "https://access.redhat.com/security/cve/cve-2011-3374"
        },
        {
          "url": "https://bugs.debian.org/cgi-bin/bugreport.cgi?bug=642480"
        },
        {
          "url": "https://people.canonical.com/~ubuntu-security/cve/2011/CVE-2011-3374.html"
        },
        {
          "url": "https://seclists.org/fulldisclosure/2011/Sep/221"
        },
        {
          "url": "https://security-tracker.debian.org/tracker/CVE-2011-3374"
        },
        {
          "url": "https://snyk.io/vuln/SNYK-LINUX-APT-116518"
        },
        {
          "url": "https://ubuntu.com/security/CVE-2011-3374"
        }
      ],
      "description": "It was found that apt-key in apt, all versions, do not correctly validate gpg keys with the master keyring, leading to a potential man-in-the-middle attack.",
      "solution": "No solution provided"
    }
  ],
  "remediations": [],
  "scan": {
    "scanner": {
      "id": "trivy",
      "name": "Trivy",
      "url": "https://github.com/aquasecurity/trivy/",
      "vendor": {
        "name": "GitLab"
      },
      "version": "0.36.1"
    },
    "analyzer": {
      "id": "gcs",
      "name": "GitLab Container Scanning",
      "vendor": {
        "name": "GitLab"
      },
      "version": "6.1.1"
    },
    "type": "container_scanning",
    "start_time": "2023-06-27T19:58:57",
    "end_time": "2023-06-27T19:59:21",
    "status": "success"
  },
  "version": "15.0.6"
}
