{
  "vulnerabilities": [
    {
      "id": "cff517827957edad355b6fff5bf252177d1faa86",
      "severity": "Medium",
      "location": {
        "dependency": {
          "package": {
            "name": "avahi-libs"
          },
          "version": "0.7-20.el8"
        },
        "operating_system": "redhat 8.5",
        "image": "jboss/keycloak:latest"
      },
      "identifiers": [
        {
          "type": "cve",
          "name": "CVE-2021-3468",
          "value": "CVE-2021-3468",
          "url": "https://access.redhat.com/security/cve/CVE-2021-3468"
        }
      ],
      "links": [
        {
          "url": "https://access.redhat.com/security/cve/CVE-2021-3468"
        },
        {
          "url": "https://bugzilla.redhat.com/show_bug.cgi?id=1939614"
        },
        {
          "url": "https://cve.mitre.org/cgi-bin/cvename.cgi?name=CVE-2021-3468"
        },
        {
          "url": "https://lists.debian.org/debian-lts-announce/2022/06/msg00009.html"
        },
        {
          "url": "https://lists.debian.org/debian-lts-announce/2023/06/msg00028.html"
        },
        {
          "url": "https://nvd.nist.gov/vuln/detail/CVE-2021-3468"
        },
        {
          "url": "https://ubuntu.com/security/notices/USN-5008-1"
        },
        {
          "url": "https://ubuntu.com/security/notices/USN-5008-2"
        },
        {
          "url": "https://www.cve.org/CVERecord?id=CVE-2021-3468"
        }
      ],
      "description": "A flaw was found in avahi in versions 0.6 up to 0.8. The event used to signal the termination of the client connection on the avahi Unix socket is not correctly handled in the client_work function, allowing a local attacker to trigger an infinite loop. The highest threat from this vulnerability is to the availability of the avahi service, which becomes unresponsive after this flaw is triggered.",
      "solution": "No solution provided"
    }
  ],
  "remediations": [],
  "scan": {
    "scanner": {
      "id": "trivy",
      "name": "Trivy",
      "url": "https://github.com/aquasecurity/trivy/",
      "vendor": {
        "name": "GitLab"
      },
      "version": "0.36.1"
    },
    "analyzer": {
      "id": "gcs",
      "name": "GitLab Container Scanning",
      "vendor": {
        "name": "GitLab"
      },
      "version": "6.1.1"
    },
    "type": "container_scanning",
    "start_time": "2023-06-27T19:58:59",
    "end_time": "2023-06-27T19:59:09",
    "status": "success"
  },
  "version": "15.0.6"
}
