{
  "version": "15.0.6",
  "scan": {
    "type": "dependency_scanning",
    "start_time": "2023-06-27T19:59:12",
    "end_time": "2023-06-27T19:59:21",
    "status": "success",
    "scanner": {
      "id": "trivy",
      "name": "Trivy",
      "url": "https://github.com/aquasecurity/trivy/",
      "vendor": {
        "name": "GitLab"
      },
      "version": "0.36.1"
    },
    "analyzer": {
      "id": "gcs",
      "name": "GitLab Container Scanning",
      "vendor": {
        "name": "GitLab"
      },
      "version": "6.1.1"
    }
  },
  "vulnerabilities": [],
  "dependency_files": [
    {
      "path": "container-image:jboss/keycloak:latest",
      "package_manager": "redhat:8.5 (yum)",
      "dependencies": [
        {
          "package": {
            "name": "alsa-lib"
          },
          "version": "1.2.5"
        },
        {
          "package": {
            "name": "audit"
          },
          "version": "3.0"
        },
        {
          "package": {
            "name": "avahi"
          },
          "version": "0.7"
        },
        {
          "package": {
            "name": "basesystem"
          },
          "version": "11"
        },
        {
          "package": {
            "name": "bash"
          },
          "version": "4.4.20"
        },
        {
          "package": {
            "name": "brotli"
          },
          "version": "1.0.6"
        },
        {
          "package": {
            "name": "bzip2"
          },
          "version": "1.0.6"
        },
        {
          "package": {
            "name": "ca-certificates"
          },
          "version": "2021.2.50"
        },
        {
          "package": {
            "name": "chkconfig"
          },
          "version": "1.19.1"
        },
        {
          "package": {
            "name": "copy-jdk-configs"
          },
          "version": "4.0"
        },
        {
          "package": {
            "name": "coreutils"
          },
          "version": "8.30"
        },
        {
          "package": {
            "name": "crypto-policies"
          },
          "version": "20210617"
        },
        {
          "package": {
            "name": "crypto-policies"
          },
          "version": "20210617"
        },
        {
          "package": {
            "name": "cups"
          },
          "version": "2.2.6"
        },
        {
          "package": {
            "name": "curl"
          },
          "version": "7.61.1"
        },
        {
          "package": {
            "name": "cyrus-sasl"
          },
          "version": "2.1.27"
        },
        {
          "package": {
            "name": "dbus"
          },
          "version": "1.12.8"
        },
        {
          "package": {
            "name": "elfutils"
          },
          "version": "0.185"
        },
        {
          "package": {
            "name": "expat"
          },
          "version": "2.2.5"
        },
        {
          "package": {
            "name": "file"
          },
          "version": "5.33"
        },
        {
          "package": {
            "name": "filesystem"
          },
          "version": "3.8"
        },
        {
          "package": {
            "name": "findutils"
          },
          "version": "4.6.0"
        },
        {
          "package": {
            "name": "freetype"
          },
          "version": "2.9.1"
        },
        {
          "package": {
            "name": "gawk"
          },
          "version": "4.2.1"
        },
        {
          "package": {
            "name": "gdbm"
          },
          "version": "1.18"
        },
        {
          "package": {
            "name": "gdbm"
          },
          "version": "1.18"
        },
        {
          "package": {
            "name": "glib2"
          },
          "version": "2.56.4"
        },
        {
          "package": {
            "name": "glibc"
          },
          "version": "2.28"
        },
        {
          "package": {
            "name": "glibc"
          },
          "version": "2.28"
        },
        {
          "package": {
            "name": "glibc"
          },
          "version": "2.28"
        },
        {
          "package": {
            "name": "glibc"
          },
          "version": "2.28"
        },
        {
          "package": {
            "name": "gmp"
          },
          "version": "6.1.2"
        },
        {
          "package": {
            "name": "gnupg2"
          },
          "version": "2.2.20"
        },
        {
          "package": {
            "name": "gnutls"
          },
          "version": "3.6.16"
        },
        {
          "package": {
            "name": "gobject-introspection"
          },
          "version": "1.56.1"
        },
        {
          "package": {
            "name": "gpg-pubkey"
          },
          "version": "d4082792"
        },
        {
          "package": {
            "name": "gpg-pubkey"
          },
          "version": "fd431d51"
        },
        {
          "package": {
            "name": "gpgme"
          },
          "version": "1.13.1"
        },
        {
          "package": {
            "name": "graphite2"
          },
          "version": "1.3.10"
        },
        {
          "package": {
            "name": "grep"
          },
          "version": "3.1"
        },
        {
          "package": {
            "name": "gzip"
          },
          "version": "1.9"
        },
        {
          "package": {
            "name": "harfbuzz"
          },
          "version": "1.7.5"
        },
        {
          "package": {
            "name": "hostname"
          },
          "version": "3.20"
        },
        {
          "package": {
            "name": "texinfo"
          },
          "version": "6.5"
        },
        {
          "package": {
            "name": "java-11-openjdk"
          },
          "version": "11.0.14.0.9"
        },
        {
          "package": {
            "name": "javapackages-tools"
          },
          "version": "5.3.0"
        },
        {
          "package": {
            "name": "json-c"
          },
          "version": "0.13.1"
        },
        {
          "package": {
            "name": "json-glib"
          },
          "version": "1.4.4"
        },
        {
          "package": {
            "name": "keyutils"
          },
          "version": "1.5.10"
        },
        {
          "package": {
            "name": "krb5"
          },
          "version": "1.18.2"
        },
        {
          "package": {
            "name": "langpacks"
          },
          "version": "1.0"
        },
        {
          "package": {
            "name": "lcms2"
          },
          "version": "2.9"
        },
        {
          "package": {
            "name": "acl"
          },
          "version": "2.2.53"
        },
        {
          "package": {
            "name": "libarchive"
          },
          "version": "3.3.3"
        },
        {
          "package": {
            "name": "libassuan"
          },
          "version": "2.5.1"
        },
        {
          "package": {
            "name": "attr"
          },
          "version": "2.4.48"
        },
        {
          "package": {
            "name": "util-linux"
          },
          "version": "2.32.1"
        },
        {
          "package": {
            "name": "libcap"
          },
          "version": "2.26"
        },
        {
          "package": {
            "name": "libcap-ng"
          },
          "version": "0.7.11"
        },
        {
          "package": {
            "name": "e2fsprogs"
          },
          "version": "1.45.6"
        },
        {
          "package": {
            "name": "curl"
          },
          "version": "7.61.1"
        },
        {
          "package": {
            "name": "libdb"
          },
          "version": "5.3.28"
        },
        {
          "package": {
            "name": "libdb"
          },
          "version": "5.3.28"
        },
        {
          "package": {
            "name": "libdnf"
          },
          "version": "0.63.0"
        },
        {
          "package": {
            "name": "libffi"
          },
          "version": "3.1"
        },
        {
          "package": {
            "name": "gcc"
          },
          "version": "8.5.0"
        },
        {
          "package": {
            "name": "libgcrypt"
          },
          "version": "1.8.5"
        },
        {
          "package": {
            "name": "libgpg-error"
          },
          "version": "1.31"
        },
        {
          "package": {
            "name": "libidn2"
          },
          "version": "2.2.0"
        },
        {
          "package": {
            "name": "libjpeg-turbo"
          },
          "version": "1.5.3"
        },
        {
          "package": {
            "name": "libksba"
          },
          "version": "1.3.5"
        },
        {
          "package": {
            "name": "libmodulemd"
          },
          "version": "2.13.0"
        },
        {
          "package": {
            "name": "util-linux"
          },
          "version": "2.32.1"
        },
        {
          "package": {
            "name": "nghttp2"
          },
          "version": "1.33.0"
        },
        {
          "package": {
            "name": "libnsl2"
          },
          "version": "1.2.0"
        },
        {
          "package": {
            "name": "libpeas"
          },
          "version": "1.22.0"
        },
        {
          "package": {
            "name": "libpng"
          },
          "version": "1.6.34"
        },
        {
          "package": {
            "name": "libpsl"
          },
          "version": "0.20.2"
        },
        {
          "package": {
            "name": "librepo"
          },
          "version": "1.14.0"
        },
        {
          "package": {
            "name": "librhsm"
          },
          "version": "0.0.3"
        },
        {
          "package": {
            "name": "libselinux"
          },
          "version": "2.9"
        },
        {
          "package": {
            "name": "libsepol"
          },
          "version": "2.9"
        },
        {
          "package": {
            "name": "libsigsegv"
          },
          "version": "2.11"
        },
        {
          "package": {
            "name": "util-linux"
          },
          "version": "2.32.1"
        },
        {
          "package": {
            "name": "libsolv"
          },
          "version": "0.7.19"
        },
        {
          "package": {
            "name": "libssh"
          },
          "version": "0.9.4"
        },
        {
          "package": {
            "name": "libssh"
          },
          "version": "0.9.4"
        },
        {
          "package": {
            "name": "gcc"
          },
          "version": "8.5.0"
        },
        {
          "package": {
            "name": "libtasn1"
          },
          "version": "4.13"
        },
        {
          "package": {
            "name": "libtirpc"
          },
          "version": "1.1.4"
        },
        {
          "package": {
            "name": "libunistring"
          },
          "version": "0.9.9"
        },
        {
          "package": {
            "name": "libusbx"
          },
          "version": "1.0.23"
        },
        {
          "package": {
            "name": "util-linux"
          },
          "version": "2.32.1"
        },
        {
          "package": {
            "name": "libverto"
          },
          "version": "0.3.0"
        },
        {
          "package": {
            "name": "libxcrypt"
          },
          "version": "4.1.1"
        },
        {
          "package": {
            "name": "libxml2"
          },
          "version": "2.9.7"
        },
        {
          "package": {
            "name": "libyaml"
          },
          "version": "0.1.7"
        },
        {
          "package": {
            "name": "zstd"
          },
          "version": "1.4.4"
        },
        {
          "package": {
            "name": "lksctp-tools"
          },
          "version": "1.0.18"
        },
        {
          "package": {
            "name": "lua"
          },
          "version": "5.3.4"
        },
        {
          "package": {
            "name": "lua"
          },
          "version": "5.3.4"
        },
        {
          "package": {
            "name": "lz4"
          },
          "version": "1.8.3"
        },
        {
          "package": {
            "name": "microdnf"
          },
          "version": "3.8.0"
        },
        {
          "package": {
            "name": "mpfr"
          },
          "version": "3.1.6"
        },
        {
          "package": {
            "name": "ncurses"
          },
          "version": "6.1"
        },
        {
          "package": {
            "name": "ncurses"
          },
          "version": "6.1"
        },
        {
          "package": {
            "name": "nettle"
          },
          "version": "3.4.1"
        },
        {
          "package": {
            "name": "npth"
          },
          "version": "1.5"
        },
        {
          "package": {
            "name": "nspr"
          },
          "version": "4.32.0"
        },
        {
          "package": {
            "name": "nss"
          },
          "version": "3.67.0"
        },
        {
          "package": {
            "name": "nss"
          },
          "version": "3.67.0"
        },
        {
          "package": {
            "name": "nss"
          },
          "version": "3.67.0"
        },
        {
          "package": {
            "name": "nss"
          },
          "version": "3.67.0"
        },
        {
          "package": {
            "name": "nss"
          },
          "version": "3.67.0"
        },
        {
          "package": {
            "name": "openldap"
          },
          "version": "2.4.46"
        },
        {
          "package": {
            "name": "openssl"
          },
          "version": "1.1.1k"
        },
        {
          "package": {
            "name": "openssl"
          },
          "version": "1.1.1k"
        },
        {
          "package": {
            "name": "openssl-pkcs11"
          },
          "version": "0.4.10"
        },
        {
          "package": {
            "name": "p11-kit"
          },
          "version": "0.23.22"
        },
        {
          "package": {
            "name": "p11-kit"
          },
          "version": "0.23.22"
        },
        {
          "package": {
            "name": "pcre"
          },
          "version": "8.42"
        },
        {
          "package": {
            "name": "pcre2"
          },
          "version": "10.32"
        },
        {
          "package": {
            "name": "python3"
          },
          "version": "3.6.8"
        },
        {
          "package": {
            "name": "python-pip"
          },
          "version": "9.0.3"
        },
        {
          "package": {
            "name": "python-setuptools"
          },
          "version": "39.2.0"
        },
        {
          "package": {
            "name": "popt"
          },
          "version": "1.18"
        },
        {
          "package": {
            "name": "publicsuffix-list"
          },
          "version": "20180723"
        },
        {
          "package": {
            "name": "python3"
          },
          "version": "3.6.8"
        },
        {
          "package": {
            "name": "python-pip"
          },
          "version": "9.0.3"
        },
        {
          "package": {
            "name": "python-setuptools"
          },
          "version": "39.2.0"
        },
        {
          "package": {
            "name": "readline"
          },
          "version": "7.0"
        },
        {
          "package": {
            "name": "redhat-release"
          },
          "version": "8.5"
        },
        {
          "package": {
            "name": "rootfiles"
          },
          "version": "8.1"
        },
        {
          "package": {
            "name": "rpm"
          },
          "version": "4.14.3"
        },
        {
          "package": {
            "name": "rpm"
          },
          "version": "4.14.3"
        },
        {
          "package": {
            "name": "sed"
          },
          "version": "4.5"
        },
        {
          "package": {
            "name": "setup"
          },
          "version": "2.12.2"
        },
        {
          "package": {
            "name": "sqlite"
          },
          "version": "3.26.0"
        },
        {
          "package": {
            "name": "systemd"
          },
          "version": "239"
        },
        {
          "package": {
            "name": "tar"
          },
          "version": "1.30"
        },
        {
          "package": {
            "name": "tzdata"
          },
          "version": "2021e"
        },
        {
          "package": {
            "name": "tzdata"
          },
          "version": "2021e"
        },
        {
          "package": {
            "name": "which"
          },
          "version": "2.21"
        },
        {
          "package": {
            "name": "xz"
          },
          "version": "5.2.4"
        },
        {
          "package": {
            "name": "zlib"
          },
          "version": "1.2.11"
        }
      ]
    }
  ]
}
