{
  "version": "15.0.6",
  "vulnerabilities": [
    {
      "flags": [
        {
          "type": "flagged-as-likely-false-positive",
          "origin": "gitleaks",
          "description": "Not an actual secret"
        }
      ],
      "id": "ca2e630da4ff16c5956022e72b787c2ac42f56d0f8e0986f450066d05724876c",
      "name": "Twitch API token",
      "description": "Twitch API token",
      "severity": "Critical",
      "raw_source_code_extract": "zwqjvffo863374zioz1gd26thgsmu5",
      "location": {
        "file": "secrets.go",
        "commit": {
          "sha": "0000000"
        },
        "start_line": 112,
        "end_line": 112
      },
      "identifiers": [
        {
          "type": "gitleaks_rule_id",
          "name": "Gitleaks rule ID twitch-api-token",
          "value": "twitch-api-token"
        }
      ]
    },
    {
      "id": "3e7ceb66a6fc7dffd614e57c5b6ffcee051ffa189ba60d30b6458d654aa37711",
      "name": "Typeform API token",
      "description": "Typeform API token",
      "severity": "Critical",
      "raw_source_code_extract": "tfp_HeDK4ZeCwwCHdvSnVnzKtjiyB1rLFyzspa7Y3Fo9yAp8_3pcodefNH4DhnE",
      "location": {
        "file": "secrets.go",
        "commit": {
          "sha": "0000000"
        },
        "start_line": 114,
        "end_line": 114
      },
      "identifiers": [
        {
          "type": "gitleaks_rule_id",
          "name": "Gitleaks rule ID typeform-api-token",
          "value": "typeform-api-token"
        }
      ]
    },
    {
      "id": "c0e2a4d68eba7e91cc408c74f1603b32ccbac63a800734b106abbdb8d8a6352c",
      "name": "Generic API Key",
      "description": "Generic API Key",
      "severity": "Critical",
      "raw_source_code_extract": "live_5c03155f2266f3e00c20179c5b65502ab92",
      "location": {
        "file": "secrets.go",
        "commit": {
          "sha": "0000000"
        },
        "start_line": 66,
        "end_line": 66
      },
      "identifiers": [
        {
          "type": "gitleaks_rule_id",
          "name": "Gitleaks rule ID generic-api-key",
          "value": "generic-api-key"
        }
      ]
    },
    {
      "id": "fc1e641317be592401422d3a288c74d948676cffca47491561e62d13187a7a20",
      "name": "Generic API Key",
      "description": "Generic API Key",
      "severity": "Critical",
      "raw_source_code_extract": "live_pub_0e1fe852b24b86f5cbd57192df2cabb",
      "location": {
        "file": "secrets.go",
        "commit": {
          "sha": "0000000"
        },
        "start_line": 68,
        "end_line": 68
      },
      "identifiers": [
        {
          "type": "gitleaks_rule_id",
          "name": "Gitleaks rule ID generic-api-key",
          "value": "generic-api-key"
        }
      ]
    },
    {
      "id": "bc315b03465e0140cc44ab687eff5c0c6848f0e648ac633f476757324f3d8136",
      "name": "PGP private key",
      "description": "PGP private key",
      "severity": "Critical",
      "raw_source_code_extract": "-----BEGIN PGP PRIVATE KEY BLOCK-----",
      "location": {
        "file": "keys/pgp_rsa_key",
        "commit": {
          "sha": "0000000"
        },
        "start_line": 1,
        "end_line": 1
      },
      "identifiers": [
        {
          "type": "gitleaks_rule_id",
          "name": "Gitleaks rule ID PGP-PK",
          "value": "PGP-PK"
        }
      ]
    }
  ],
  "scan": {
    "start_time": "2022-05-19T12:47:33",
    "end_time": "2022-05-19T12:47:42",
    "status": "success",
    "type": "secret_detection",
    "scanner": {
      "id": "gitleaks",
      "name": "GitLeaks",
      "version": "1.0.0",
      "vendor": {
        "name": "GitLab"
      }
    },
    "analyzer": {
      "id": "gitleaks",
      "name": "GitLeaks",
      "version": "1.0.0",
      "vendor": {
        "name": "GitLab"
      }
    }
  }
}
