{
  "version": "2.1",
  "licenses": [
    {
      "id": "Apache-2.0",
      "name": "Apache License 2.0",
      "url": "https://opensource.org/licenses/Apache-2.0"
    },
    {
      "id": "BSD-2-Clause",
      "name": "BSD 2-Clause \"Simplified\" License",
      "url": "https://opensource.org/licenses/BSD-2-Clause"
    },
    {
      "id": "BSD-3-Clause",
      "name": "BSD 3-Clause \"New\" or \"Revised\" License",
      "url": "https://opensource.org/licenses/BSD-3-Clause"
    },
    {
      "id": "ISC",
      "name": "ISC License",
      "url": "https://opensource.org/licenses/ISC"
    },
    {
      "id": "MIT",
      "name": "MIT License",
      "url": "https://opensource.org/licenses/MIT"
    }
  ],
  "dependencies": [
    {
      "name": "github.com/astaxie/beego",
      "version": "v1.10.0",
      "package_manager": "go",
      "path": "go.sum",
      "licenses": [
        "MIT"
      ]
    },
    {
      "name": "github.com/davecgh/go-spew",
      "version": "v1.1.1",
      "package_manager": "go",
      "path": "go.sum",
      "licenses": [
        "ISC"
      ]
    },
    {
      "name": "github.com/konsorten/go-windows-terminal-sequences",
      "version": "v1.0.1",
      "package_manager": "go",
      "path": "go.sum",
      "licenses": [
        "MIT"
      ]
    },
    {
      "name": "github.com/minio/minio",
      "version": "v0.0.0-20180419184637-5a16671f721f",
      "package_manager": "go",
      "path": "go.sum",
      "licenses": [
        "Apache-2.0"
      ]
    },
    {
      "name": "github.com/minio/minio-go",
      "version": "v6.0.14+incompatible",
      "package_manager": "go",
      "path": "go.sum",
      "licenses": [
        "Apache-2.0"
      ]
    },
    {
      "name": "github.com/minio/sha256-simd",
      "version": "v0.1.1",
      "package_manager": "go",
      "path": "go.sum",
      "licenses": [
        "Apache-2.0"
      ]
    },
    {
      "name": "github.com/pmezard/go-difflib",
      "version": "v1.0.0",
      "package_manager": "go",
      "path": "go.sum",
      "licenses": [
        "BSD-3-Clause"
      ]
    },
    {
      "name": "github.com/sirupsen/logrus",
      "version": "v1.4.2",
      "package_manager": "go",
      "path": "go.sum",
      "licenses": [
        "MIT"
      ]
    },
    {
      "name": "github.com/stretchr/objx",
      "version": "v0.1.1",
      "package_manager": "go",
      "path": "go.sum",
      "licenses": [
        "MIT"
      ]
    },
    {
      "name": "github.com/stretchr/testify",
      "version": "v1.2.2",
      "package_manager": "go",
      "path": "go.sum",
      "licenses": [
        "MIT"
      ]
    },
    {
      "name": "golang.org/x/sys",
      "version": "v0.0.0-20191026070338-33540a1f6037",
      "package_manager": "go",
      "path": "go.sum",
      "licenses": [
        "BSD-3-Clause"
      ]
    },
    {
      "name": "gopkg.in/check.v1",
      "version": "v0.0.0-20161208181325-20d25e280405",
      "package_manager": "go",
      "path": "go.sum",
      "licenses": [
        "BSD-2-Clause"
      ]
    },
    {
      "name": "gopkg.in/yaml.v2",
      "version": "v2.2.2",
      "package_manager": "go",
      "path": "go.sum",
      "licenses": [
        "Apache-2.0",
        "MIT"
      ]
    }
  ]
}