{
    "schema" : "https://gitlab.com/gitlab-org/security-products/security-report-schemas/-/raw/v14.0.0/dist/sast-report-format.json",
    "version" : "15.0.0",
    "scan" : {
        "start_time" : "2020-08-24T07:30:25",
        "end_time" : "2020-08-24T07:54:47",
        "status" : "success",
        "type" : "sast",
        "scanner" : {
            "id" : "minac",
            "name" : "Minac scanner",
            "url" : "https://gitlab.com",
            "version" : "1.0.0",
            "vendor" : {
                "name" : "Minac"
            }
        },
        "analyzer": {
            "id": "minac",
            "name": "Minac manual analyzer",
            "version": "0.0.1",
            "vendor": {
                "name": "Minac"
            }
        }    
    },
    "vulnerabilities": [
        {
            "category" : "sast",
            "confidence" : "Low",
            "message" : "Test Vulnerability 1",
            "description" : "This is a test vulnerability",
            "id" : "b1cca3d4-85cd-450e-83c6-988cb31bb645",
            "identifiers" : [ 
                {
                    "name" : "CVE-2023-1923",
                    "type" : "cve",
                    "value" : "CVE-2023-1923"
                }
            ],
            "location" : {
                "file" : "lib/insecurity.js",
                "start_line" : 1
            },
            "scanner" : {
                "id" : "minac",
                "name" : "Minac scanner"
            },
            "severity" : "Low"
        },
        {
            "category" : "sast",
            "confidence" : "Low",
            "message" : "Test Vulnerability 1",
            "description" : "This is a test vulnerability",
            "id" : "b1cca3d4-85cd-450e-83c6-988cb31bb645",
            "identifiers" : [ 
                {
                    "name" : "CVE-2023-1923",
                    "type" : "cve",
                    "value" : "CVE-2023-1923"
                }
            ],
            "location" : {
                "file" : "lib/insecurity.js",
                "start_line" : 2
            },
            "scanner" : {
                "id" : "minac",
                "name" : "Minac scanner"
            },
            "severity" : "Low"
        },
        {
            "category" : "sast",
            "confidence" : "Low",
            "message" : "Test Vulnerability 1",
            "description" : "This is a test vulnerability",
            "id" : "b1cca3d4-85cd-450e-83c6-988cb31bb645",
            "identifiers" : [ 
                {
                    "name" : "CVE-2023-1923",
                    "type" : "cve",
                    "value" : "CVE-2023-1923"
                }
            ],
            "location" : {
                "file" : "lib/insecurity.js",
                "start_line" : 3
            },
            "scanner" : {
                "id" : "minac",
                "name" : "Minac scanner"
            },
            "severity" : "Low"
        }
    ],
    "remediations": []
}
