{
  "version": "2.1",
  "licenses": [
    {
      "id": "GPL-3.0-or-later",
      "name": "GNU General Public License v3.0 or later",
      "url": "https://opensource.org/license/gpl-3-0/"
    },
    {
      "id": "MIT",
      "name": "MIT License",
      "url": "https://opensource.org/licenses/MIT"
    }
  ],
  "dependencies": [
    {
      "name": "Component A",
      "url": "http://rubyonrails.org",
      "package_manager": "bundler",
      "path": "Gemfile.lock",
      "version": "1.0.0",
      "licenses": ["GPL-3.0-or-later"]
    },
    {
      "name": "Component B",
      "url": "http://rubyonrails.org",
      "package_manager": "bundler",
      "path": "Gemfile.lock",
      "version": "1.1.0",
      "licenses": ["MIT"]
    },
    {
      "name": "Component C",
      "url": "http://rubyonrails.org",
      "package_manager": "bundler",
      "path": "Gemfile.lock",
      "version": "1.2.0",
      "licenses": ["GPL-3.0-or-later"]
    }
  ]
}