{
  "scan":{
     "end_time":"2021-01-07T21:33:40",
     "messages":[
        
     ],
     "analyzer":{
        "id":"gitlab-api-fuzzing",
        "name":"GitLab API Fuzzing",
        "url":"https://docs.gitlab.com/ee/user/application_security/api_fuzzing/",
        "version":"1.6.71",
        "vendor":{
           "name":"GitLab"
        }
     },
     "scanner":{
        "id":"gitlab-api-fuzzing",
        "name":"GitLab API Fuzzing",
        "url":"https://docs.gitlab.com/ee/user/application_security/api_fuzzing/",
        "version":"1.6.71",
        "vendor":{
           "name":"GitLab"
        }
     },
     "start_time":"2021-01-07T21:32:35",
     "status":"success",
     "type":"api_fuzzing",
     "scanned_resources":[
        {
           "method":"DELETE",
           "url":"http://149.248.44.52:7777/api/users/2",
           "type":"url"
        },
        {
           "method":"DELETE",
           "url":"http://149.248.44.52:7777/api/users?user=dd",
           "type":"url"
        },
        {
           "method":"GET",
           "url":"http://149.248.44.52:7777/api/users",
           "type":"url"
        },
        {
           "method":"GET",
           "url":"http://149.248.44.52:7777/api/users/2",
           "type":"url"
        },
        {
           "method":"GET",
           "url":"http://149.248.44.52:7777/api/users?user=dd",
           "type":"url"
        },
        {
           "method":"POST",
           "url":"http://149.248.44.52:7777/api/users",
           "type":"url"
        },
        {
           "method":"PUT",
           "url":"http://149.248.44.52:7777/api/users/2",
           "type":"url"
        }
     ]
  },
  "schema":"https://gitlab.com/gitlab-org/security-products/security-report-schemas/-/blob/461227da6a5f42ef936815859b7ec9e6fc30bfb8/dist/dast-report-format.json",
  "version":"15.0.6",
  "vulnerabilities":[
     {
        "id":"2e1d70b1-9770-48e2-9a13-115c99897bde",
        "name":"Fuzzing injection via '/api' on 'POST 149.248.44.52:7777/api/users'",
        "description":"Fuzzing performes non-specific injections into target field in an attempt to cause unexpected behaviour of the target. Fuzzing can find injection style issues, buffer overflows, memory corruption, stability issues, and others.  Fuzzing consists of sending mutated/semi-malformed data injections in an automated fashion to the target.\n\nThe 'mutator' is the data generator in use when the issue was identified.\n\nMutator: StringCaseLower\nParameter Original Value: api\nParameter Mutated Value: api\n\n\n",
        "severity":"Unknown",
        "identifiers":[
           {
              "type":"ApiFuzzingCheck",
              "name":"Generic Fuzzing",
              "url":"https://docs.gitlab.com/ee/user/application_security/api_fuzzing/",
              "value":"bucket:param:Path: /api:check:Generic Fuzzing:check_arg::assert:Status Code:data:14c2529eb4498c5d1ffd6915d05bf58a91bdda796af59f41d480d11c099d0479"
           }
        ],
        "evidence":{
           "source":{
              "id":"assert:Status Code",
              "name":"Status Code"
           },
           "summary":"An invalid status code '500' was detected during testing.  Invalid status codes indicate an error or unexpected event occured.\n\n\n",
           "request":{
              "headers":[
                 {
                    "name":"Host",
                    "value":"149.248.44.52:7777"
                 },
                 {
                    "name":"Origin",
                    "value":"http://127.0.0.1:7777"
                 },
                 {
                    "name":"Accept-Encoding",
                    "value":"gzip,deflate,zlib"
                 },
                 {
                    "name":"Accept-Language",
                    "value":"en-US,en;q=0.8"
                 },
                 {
                    "name":"User-Agent",
                    "value":"Mozilla/5.0 (Windows NT 10.0; Win64; x64) AppleWebKit/537.36 (KHTML, like Gecko) Chrome/61.0.3163.100 Safari/537.36"
                 },
                 {
                    "name":"Content-Type",
                    "value":"application/json; charset=UTF-8"
                 },
                 {
                    "name":"Accept",
                    "value":"*/*"
                 },
                 {
                    "name":"Referer",
                    "value":"http://127.0.0.1:7777/"
                 },
                 {
                    "name":"Cookie",
                    "value":".AspNetCore.Antiforgery.a6BorKCfoC4=CfDJ8DL4GupRCDNGl_0OiAd3qWP5O9gu_LiedsgcLWhaCgn88Ru8oWwXGQvL3PXNdZ0n5TjUPody5ZI01g6DQyaaphE4U6osQ8UW4ek9hlOQX0XFvIg9G3vGuvPt1XiJkxzxEtoPMlepzIig3KblZd5YsOs"
                 },
                 {
                    "name":"Connection",
                    "value":"keep-alive"
                 },
                 {
                    "name":"Content-Length",
                    "value":"62"
                 },
                 {
                    "name":"authorization",
                    "value":"Token b5638ae7-6e77-4585-b035-7d9de2e3f6b3"
                 },
                 {
                    "name":"Via",
                    "value":"HTTP/1.1 GitLabApiSecurity 1.6.71"
                 }
              ],
              "method":"POST",
              "url":"http://149.248.44.52:7777/api/users",
              "body":"{\"user\":\"dd\",\"first\":\"mike\",\"last\":\"smith\",\"password\":\"hello\"}"
           },
           "response":{
              "headers":[
                 {
                    "name":"Server",
                    "value":"TwistedWeb/18.9.0"
                 },
                 {
                    "name":"Date",
                    "value":"Thu, 07 Jan 2021 21:33:10 GMT"
                 },
                 {
                    "name":"Content-Type",
                    "value":"application/json"
                 },
                 {
                    "name":"Content-Length",
                    "value":"170"
                 },
                 {
                    "name":"Access-Control-Allow-Origin",
                    "value":"http://127.0.0.1:7777"
                 },
                 {
                    "name":"Vary",
                    "value":"Origin"
                 },
                 {
                    "name":"X-Powered-By",
                    "value":"PHP/7.0.11"
                 }
              ],
              "reason_phrase":"INTERNAL SERVER ERROR",
              "status_code":500,
              "body":"{\"message\":\"The server encountered an internal error and was unable to complete your request. Either the server is overloaded or there is an error in the application.\"}"
           },
           "supporting_messages":[
              {
                 "name":"Origional",
                 "request":{
                    "headers":[
                       {
                          "name":"Host",
                          "value":"149.248.44.52:7777"
                       },
                       {
                          "name":"Origin",
                          "value":"http://127.0.0.1:7777"
                       },
                       {
                          "name":"Accept-Encoding",
                          "value":"gzip,deflate,zlib"
                       },
                       {
                          "name":"Accept-Language",
                          "value":"en-US,en;q=0.8"
                       },
                       {
                          "name":"User-Agent",
                          "value":"Mozilla/5.0 (Windows NT 10.0; Win64; x64) AppleWebKit/537.36 (KHTML, like Gecko) Chrome/61.0.3163.100 Safari/537.36"
                       },
                       {
                          "name":"Content-Type",
                          "value":"application/json; charset=UTF-8"
                       },
                       {
                          "name":"Accept",
                          "value":"*/*"
                       },
                       {
                          "name":"Referer",
                          "value":"http://127.0.0.1:7777/"
                       },
                       {
                          "name":"Cookie",
                          "value":".AspNetCore.Antiforgery.a6BorKCfoC4=CfDJ8DL4GupRCDNGl_0OiAd3qWP5O9gu_LiedsgcLWhaCgn88Ru8oWwXGQvL3PXNdZ0n5TjUPody5ZI01g6DQyaaphE4U6osQ8UW4ek9hlOQX0XFvIg9G3vGuvPt1XiJkxzxEtoPMlepzIig3KblZd5YsOs"
                       },
                       {
                          "name":"Connection",
                          "value":"keep-alive"
                       },
                       {
                          "name":"Content-Length",
                          "value":"62"
                       },
                       {
                          "name":"authorization",
                          "value":"Token b5638ae7-6e77-4585-b035-7d9de2e3f6b3"
                       }
                    ],
                    "method":"POST",
                    "url":"http://149.248.44.52:7777/api/users",
                    "body":"{\"user\":\"dd\",\"first\":\"mike\",\"last\":\"smith\",\"password\":\"hello\"}"
                 }
              },
              {
                 "name":"Recorded",
                 "request":{
                    "headers":[
                       {
                          "name":"Host",
                          "value":"149.248.44.52:7777"
                       },
                       {
                          "name":"Origin",
                          "value":"http://127.0.0.1:7777"
                       },
                       {
                          "name":"Accept-Encoding",
                          "value":"gzip,deflate,zlib"
                       },
                       {
                          "name":"Accept-Language",
                          "value":"en-US,en;q=0.8"
                       },
                       {
                          "name":"User-Agent",
                          "value":"Mozilla/5.0 (Windows NT 10.0; Win64; x64) AppleWebKit/537.36 (KHTML, like Gecko) Chrome/61.0.3163.100 Safari/537.36"
                       },
                       {
                          "name":"Content-Type",
                          "value":"application/json; charset=UTF-8"
                       },
                       {
                          "name":"Accept",
                          "value":"*/*"
                       },
                       {
                          "name":"Referer",
                          "value":"http://127.0.0.1:7777/"
                       },
                       {
                          "name":"Cookie",
                          "value":".AspNetCore.Antiforgery.a6BorKCfoC4=CfDJ8DL4GupRCDNGl_0OiAd3qWP5O9gu_LiedsgcLWhaCgn88Ru8oWwXGQvL3PXNdZ0n5TjUPody5ZI01g6DQyaaphE4U6osQ8UW4ek9hlOQX0XFvIg9G3vGuvPt1XiJkxzxEtoPMlepzIig3KblZd5YsOs"
                       },
                       {
                          "name":"Connection",
                          "value":"keep-alive"
                       },
                       {
                          "name":"Content-Length",
                          "value":"62"
                       },
                       {
                          "name":"authorization",
                          "value":"Token b5638ae7-6e77-4585-b035-7d9de2e3f6b3"
                       }
                    ],
                    "method":"POST",
                    "url":"http://149.248.44.52:7777/api/users",
                    "body":"{\"user\":\"dd\",\"first\":\"mike\",\"last\":\"smith\",\"password\":\"hello\"}"
                 },
                 "response":{
                    "headers":[
                       {
                          "name":"Server",
                          "value":"TwistedWeb/18.9.0"
                       },
                       {
                          "name":"Date",
                          "value":"Thu, 07 Jan 2021 21:33:07 GMT"
                       },
                       {
                          "name":"Content-Type",
                          "value":"application/json"
                       },
                       {
                          "name":"Content-Length",
                          "value":"170"
                       },
                       {
                          "name":"Access-Control-Allow-Origin",
                          "value":"http://127.0.0.1:7777"
                       },
                       {
                          "name":"Vary",
                          "value":"Origin"
                       },
                       {
                          "name":"X-Powered-By",
                          "value":"PHP/7.0.11"
                       }
                    ],
                    "reason_phrase":"INTERNAL SERVER ERROR",
                    "status_code":500,
                    "body":"{\"message\":\"The server encountered an internal error and was unable to complete your request. Either the server is overloaded or there is an error in the application.\"}"
                 }
              }
           ]
        },
        "location":{
           "hostname":"http://149.248.44.52:7777",
           "method":"POST",
           "param":"Path: /api",
           "path":"/api/users"
        },
        "assets":[
           {
              "type":"postman",
              "name":"Postman Collection",
              "url":"https://gitlab.com/gitlab-org/security-products/tests/api-fuzzing-e2e/har/-/jobs/950341333/artifacts/file/assets/vuln_2e1d70b1-9770-48e2-9a13-115c99897bde.postman_collection.json?inline=false"
           },
           {
              "type":"http_session",
              "name":"HTTP Messages",
              "url":"https://gitlab.com/gitlab-org/security-products/tests/api-fuzzing-e2e/har/-/jobs/950341333/artifacts/file/assets/vuln_2e1d70b1-9770-48e2-9a13-115c99897bde_messages.zip?inline=false"
           }
        ],
        "discovered_at":"2021-01-07T21:33:09.846"
     },
     {
        "id":"12585546-6f94-432e-97c5-9c38d7863869",
        "name":"Fuzzing injection via '/api/users' on 'POST 149.248.44.52:7777/api/users'",
        "description":"Fuzzing performes non-specific injections into target field in an attempt to cause unexpected behaviour of the target. Fuzzing can find injection style issues, buffer overflows, memory corruption, stability issues, and others.  Fuzzing consists of sending mutated/semi-malformed data injections in an automated fashion to the target.\n\nThe 'mutator' is the data generator in use when the issue was identified.\n\nMutator: StringCaseLower\nParameter Original Value: users\nParameter Mutated Value: users\n\n\n",
        "severity":"Unknown",
        "identifiers":[
           {
              "type":"ApiFuzzingCheck",
              "name":"Generic Fuzzing",
              "url":"https://docs.gitlab.com/ee/user/application_security/api_fuzzing/",
              "value":"bucket:param:Path: /api/users:check:Generic Fuzzing:check_arg::assert:Status Code:data:7dfb4cf67742cb0660305e56ef816c53fcec892cae7f6ee39b75f34e659d672c"
           }
        ],
        "evidence":{
           "source":{
              "id":"assert:Status Code",
              "name":"Status Code"
           },
           "summary":"An invalid status code '500' was detected during testing.  Invalid status codes indicate an error or unexpected event occured.\n\n\n",
           "request":{
              "headers":[
                 {
                    "name":"Host",
                    "value":"149.248.44.52:7777"
                 },
                 {
                    "name":"Origin",
                    "value":"http://127.0.0.1:7777"
                 },
                 {
                    "name":"Accept-Encoding",
                    "value":"gzip,deflate,zlib"
                 },
                 {
                    "name":"Accept-Language",
                    "value":"en-US,en;q=0.8"
                 },
                 {
                    "name":"User-Agent",
                    "value":"Mozilla/5.0 (Windows NT 10.0; Win64; x64) AppleWebKit/537.36 (KHTML, like Gecko) Chrome/61.0.3163.100 Safari/537.36"
                 },
                 {
                    "name":"Content-Type",
                    "value":"application/json; charset=UTF-8"
                 },
                 {
                    "name":"Accept",
                    "value":"*/*"
                 },
                 {
                    "name":"Referer",
                    "value":"http://127.0.0.1:7777/"
                 },
                 {
                    "name":"Cookie",
                    "value":".AspNetCore.Antiforgery.a6BorKCfoC4=CfDJ8DL4GupRCDNGl_0OiAd3qWP5O9gu_LiedsgcLWhaCgn88Ru8oWwXGQvL3PXNdZ0n5TjUPody5ZI01g6DQyaaphE4U6osQ8UW4ek9hlOQX0XFvIg9G3vGuvPt1XiJkxzxEtoPMlepzIig3KblZd5YsOs"
                 },
                 {
                    "name":"Connection",
                    "value":"keep-alive"
                 },
                 {
                    "name":"Content-Length",
                    "value":"62"
                 },
                 {
                    "name":"authorization",
                    "value":"Token b5638ae7-6e77-4585-b035-7d9de2e3f6b3"
                 },
                 {
                    "name":"Via",
                    "value":"HTTP/1.1 GitLabApiSecurity 1.6.71"
                 }
              ],
              "method":"POST",
              "url":"http://149.248.44.52:7777/api/users",
              "body":"{\"user\":\"dd\",\"first\":\"mike\",\"last\":\"smith\",\"password\":\"hello\"}"
           },
           "response":{
              "headers":[
                 {
                    "name":"Server",
                    "value":"TwistedWeb/18.9.0"
                 },
                 {
                    "name":"Date",
                    "value":"Thu, 07 Jan 2021 21:33:12 GMT"
                 },
                 {
                    "name":"Content-Type",
                    "value":"application/json"
                 },
                 {
                    "name":"Content-Length",
                    "value":"170"
                 },
                 {
                    "name":"Access-Control-Allow-Origin",
                    "value":"http://127.0.0.1:7777"
                 },
                 {
                    "name":"Vary",
                    "value":"Origin"
                 },
                 {
                    "name":"X-Powered-By",
                    "value":"PHP/7.0.11"
                 }
              ],
              "reason_phrase":"INTERNAL SERVER ERROR",
              "status_code":500,
              "body":"{\"message\":\"The server encountered an internal error and was unable to complete your request. Either the server is overloaded or there is an error in the application.\"}"
           },
           "supporting_messages":[
              {
                 "name":"Origional",
                 "request":{
                    "headers":[
                       {
                          "name":"Host",
                          "value":"149.248.44.52:7777"
                       },
                       {
                          "name":"Origin",
                          "value":"http://127.0.0.1:7777"
                       },
                       {
                          "name":"Accept-Encoding",
                          "value":"gzip,deflate,zlib"
                       },
                       {
                          "name":"Accept-Language",
                          "value":"en-US,en;q=0.8"
                       },
                       {
                          "name":"User-Agent",
                          "value":"Mozilla/5.0 (Windows NT 10.0; Win64; x64) AppleWebKit/537.36 (KHTML, like Gecko) Chrome/61.0.3163.100 Safari/537.36"
                       },
                       {
                          "name":"Content-Type",
                          "value":"application/json; charset=UTF-8"
                       },
                       {
                          "name":"Accept",
                          "value":"*/*"
                       },
                       {
                          "name":"Referer",
                          "value":"http://127.0.0.1:7777/"
                       },
                       {
                          "name":"Cookie",
                          "value":".AspNetCore.Antiforgery.a6BorKCfoC4=CfDJ8DL4GupRCDNGl_0OiAd3qWP5O9gu_LiedsgcLWhaCgn88Ru8oWwXGQvL3PXNdZ0n5TjUPody5ZI01g6DQyaaphE4U6osQ8UW4ek9hlOQX0XFvIg9G3vGuvPt1XiJkxzxEtoPMlepzIig3KblZd5YsOs"
                       },
                       {
                          "name":"Connection",
                          "value":"keep-alive"
                       },
                       {
                          "name":"Content-Length",
                          "value":"62"
                       },
                       {
                          "name":"authorization",
                          "value":"Token b5638ae7-6e77-4585-b035-7d9de2e3f6b3"
                       }
                    ],
                    "method":"POST",
                    "url":"http://149.248.44.52:7777/api/users",
                    "body":"{\"user\":\"dd\",\"first\":\"mike\",\"last\":\"smith\",\"password\":\"hello\"}"
                 }
              },
              {
                 "name":"Recorded",
                 "request":{
                    "headers":[
                       {
                          "name":"Host",
                          "value":"149.248.44.52:7777"
                       },
                       {
                          "name":"Origin",
                          "value":"http://127.0.0.1:7777"
                       },
                       {
                          "name":"Accept-Encoding",
                          "value":"gzip,deflate,zlib"
                       },
                       {
                          "name":"Accept-Language",
                          "value":"en-US,en;q=0.8"
                       },
                       {
                          "name":"User-Agent",
                          "value":"Mozilla/5.0 (Windows NT 10.0; Win64; x64) AppleWebKit/537.36 (KHTML, like Gecko) Chrome/61.0.3163.100 Safari/537.36"
                       },
                       {
                          "name":"Content-Type",
                          "value":"application/json; charset=UTF-8"
                       },
                       {
                          "name":"Accept",
                          "value":"*/*"
                       },
                       {
                          "name":"Referer",
                          "value":"http://127.0.0.1:7777/"
                       },
                       {
                          "name":"Cookie",
                          "value":".AspNetCore.Antiforgery.a6BorKCfoC4=CfDJ8DL4GupRCDNGl_0OiAd3qWP5O9gu_LiedsgcLWhaCgn88Ru8oWwXGQvL3PXNdZ0n5TjUPody5ZI01g6DQyaaphE4U6osQ8UW4ek9hlOQX0XFvIg9G3vGuvPt1XiJkxzxEtoPMlepzIig3KblZd5YsOs"
                       },
                       {
                          "name":"Connection",
                          "value":"keep-alive"
                       },
                       {
                          "name":"Content-Length",
                          "value":"62"
                       },
                       {
                          "name":"authorization",
                          "value":"Token b5638ae7-6e77-4585-b035-7d9de2e3f6b3"
                       }
                    ],
                    "method":"POST",
                    "url":"http://149.248.44.52:7777/api/users",
                    "body":"{\"user\":\"dd\",\"first\":\"mike\",\"last\":\"smith\",\"password\":\"hello\"}"
                 },
                 "response":{
                    "headers":[
                       {
                          "name":"Server",
                          "value":"TwistedWeb/18.9.0"
                       },
                       {
                          "name":"Date",
                          "value":"Thu, 07 Jan 2021 21:33:07 GMT"
                       },
                       {
                          "name":"Content-Type",
                          "value":"application/json"
                       },
                       {
                          "name":"Content-Length",
                          "value":"170"
                       },
                       {
                          "name":"Access-Control-Allow-Origin",
                          "value":"http://127.0.0.1:7777"
                       },
                       {
                          "name":"Vary",
                          "value":"Origin"
                       },
                       {
                          "name":"X-Powered-By",
                          "value":"PHP/7.0.11"
                       }
                    ],
                    "reason_phrase":"INTERNAL SERVER ERROR",
                    "status_code":500,
                    "body":"{\"message\":\"The server encountered an internal error and was unable to complete your request. Either the server is overloaded or there is an error in the application.\"}"
                 }
              }
           ]
        },
        "location":{
           "hostname":"http://149.248.44.52:7777",
           "method":"POST",
           "param":"Path: /api/users",
           "path":"/api/users"
        },
        "assets":[
           {
              "type":"postman",
              "name":"Postman Collection",
              "url":"https://gitlab.com/gitlab-org/security-products/tests/api-fuzzing-e2e/har/-/jobs/950341333/artifacts/file/assets/vuln_12585546-6f94-432e-97c5-9c38d7863869.postman_collection.json?inline=false"
           },
           {
              "type":"http_session",
              "name":"HTTP Messages",
              "url":"https://gitlab.com/gitlab-org/security-products/tests/api-fuzzing-e2e/har/-/jobs/950341333/artifacts/file/assets/vuln_12585546-6f94-432e-97c5-9c38d7863869_messages.zip?inline=false"
           }
        ],
        "discovered_at":"2021-01-07T21:33:12.294"
     },
     {
        "id":"c87fe63a-56c9-45e5-8faf-4d3aac33b3dc",
        "name":"Fuzzing injection via '/api/users/2' on 'GET 149.248.44.52:7777/api/users/2'",
        "description":"Fuzzing performes non-specific injections into target field in an attempt to cause unexpected behaviour of the target. Fuzzing can find injection style issues, buffer overflows, memory corruption, stability issues, and others.  Fuzzing consists of sending mutated/semi-malformed data injections in an automated fashion to the target.\n\nThe 'mutator' is the data generator in use when the issue was identified.\n\nMutator: StringStatic\nParameter Original Value: 2\nParameter Mutated Value: 65576\n\n\n",
        "severity":"Unknown",
        "identifiers":[
           {
              "type":"ApiFuzzingCheck",
              "name":"Generic Fuzzing",
              "url":"https://docs.gitlab.com/ee/user/application_security/api_fuzzing/",
              "value":"bucket:param:Path: /api/users/2:check:Generic Fuzzing:check_arg::assert:Response Body Analysis:data:1113193d7e8884ae4c56395d59fafbee5c2e39a9ca672e259c25c92a5876ef69"
           }
        ],
        "evidence":{
           "source":{
              "id":"assert:Response Body Analysis",
              "name":"Response Body Analysis"
           },
           "summary":"During testing a Error Message type value was identified in the HTTP response message. The value is a Generic error message..\n\nInformation leaked:\n\nInternal Server Error\n\n\n",
           "request":{
              "headers":[
                 {
                    "name":"Host",
                    "value":"149.248.44.52:7777"
                 },
                 {
                    "name":"Accept-Encoding",
                    "value":"gzip,deflate,zlib"
                 },
                 {
                    "name":"Accept-Language",
                    "value":"en-US,en;q=0.8"
                 },
                 {
                    "name":"User-Agent",
                    "value":"Mozilla/5.0 (Windows NT 10.0; Win64; x64) AppleWebKit/537.36 (KHTML, like Gecko) Chrome/61.0.3163.100 Safari/537.36"
                 },
                 {
                    "name":"Accept",
                    "value":"*/*"
                 },
                 {
                    "name":"Referer",
                    "value":"http://127.0.0.1:7777/"
                 },
                 {
                    "name":"Cookie",
                    "value":".AspNetCore.Antiforgery.a6BorKCfoC4=CfDJ8DL4GupRCDNGl_0OiAd3qWP5O9gu_LiedsgcLWhaCgn88Ru8oWwXGQvL3PXNdZ0n5TjUPody5ZI01g6DQyaaphE4U6osQ8UW4ek9hlOQX0XFvIg9G3vGuvPt1XiJkxzxEtoPMlepzIig3KblZd5YsOs"
                 },
                 {
                    "name":"Connection",
                    "value":"keep-alive"
                 },
                 {
                    "name":"authorization",
                    "value":"Token b5638ae7-6e77-4585-b035-7d9de2e3f6b3"
                 },
                 {
                    "name":"Via",
                    "value":"HTTP/1.1 GitLabApiSecurity 1.6.71"
                 }
              ],
              "method":"GET",
              "url":"http://149.248.44.52:7777/api/users/65576",
              "body":""
           },
           "response":{
              "headers":[
                 {
                    "name":"Server",
                    "value":"TwistedWeb/18.9.0"
                 },
                 {
                    "name":"Date",
                    "value":"Thu, 07 Jan 2021 21:32:55 GMT"
                 },
                 {
                    "name":"Content-Type",
                    "value":"application/json"
                 },
                 {
                    "name":"Content-Length",
                    "value":"37"
                 },
                 {
                    "name":"X-Powered-By",
                    "value":"PHP/7.0.11"
                 }
              ],
              "reason_phrase":"INTERNAL SERVER ERROR",
              "status_code":500,
              "body":"{\"message\":\"Internal Server Error\"}"
           },
           "supporting_messages":[
              {
                 "name":"Origional",
                 "request":{
                    "headers":[
                       {
                          "name":"Host",
                          "value":"149.248.44.52:7777"
                       },
                       {
                          "name":"Accept-Encoding",
                          "value":"gzip,deflate,zlib"
                       },
                       {
                          "name":"Accept-Language",
                          "value":"en-US,en;q=0.8"
                       },
                       {
                          "name":"User-Agent",
                          "value":"Mozilla/5.0 (Windows NT 10.0; Win64; x64) AppleWebKit/537.36 (KHTML, like Gecko) Chrome/61.0.3163.100 Safari/537.36"
                       },
                       {
                          "name":"Accept",
                          "value":"*/*"
                       },
                       {
                          "name":"Referer",
                          "value":"http://127.0.0.1:7777/"
                       },
                       {
                          "name":"Cookie",
                          "value":".AspNetCore.Antiforgery.a6BorKCfoC4=CfDJ8DL4GupRCDNGl_0OiAd3qWP5O9gu_LiedsgcLWhaCgn88Ru8oWwXGQvL3PXNdZ0n5TjUPody5ZI01g6DQyaaphE4U6osQ8UW4ek9hlOQX0XFvIg9G3vGuvPt1XiJkxzxEtoPMlepzIig3KblZd5YsOs"
                       },
                       {
                          "name":"Connection",
                          "value":"keep-alive"
                       },
                       {
                          "name":"authorization",
                          "value":"Token b5638ae7-6e77-4585-b035-7d9de2e3f6b3"
                       }
                    ],
                    "method":"GET",
                    "url":"http://149.248.44.52:7777/api/users/65576",
                    "body":""
                 }
              },
              {
                 "name":"Recorded",
                 "request":{
                    "headers":[
                       {
                          "name":"Host",
                          "value":"149.248.44.52:7777"
                       },
                       {
                          "name":"Accept-Encoding",
                          "value":"gzip,deflate,zlib"
                       },
                       {
                          "name":"Accept-Language",
                          "value":"en-US,en;q=0.8"
                       },
                       {
                          "name":"User-Agent",
                          "value":"Mozilla/5.0 (Windows NT 10.0; Win64; x64) AppleWebKit/537.36 (KHTML, like Gecko) Chrome/61.0.3163.100 Safari/537.36"
                       },
                       {
                          "name":"Accept",
                          "value":"*/*"
                       },
                       {
                          "name":"Referer",
                          "value":"http://127.0.0.1:7777/"
                       },
                       {
                          "name":"Cookie",
                          "value":".AspNetCore.Antiforgery.a6BorKCfoC4=CfDJ8DL4GupRCDNGl_0OiAd3qWP5O9gu_LiedsgcLWhaCgn88Ru8oWwXGQvL3PXNdZ0n5TjUPody5ZI01g6DQyaaphE4U6osQ8UW4ek9hlOQX0XFvIg9G3vGuvPt1XiJkxzxEtoPMlepzIig3KblZd5YsOs"
                       },
                       {
                          "name":"Connection",
                          "value":"keep-alive"
                       },
                       {
                          "name":"authorization",
                          "value":"Token b5638ae7-6e77-4585-b035-7d9de2e3f6b3"
                       }
                    ],
                    "method":"GET",
                    "url":"http://149.248.44.52:7777/api/users/65576",
                    "body":""
                 },
                 "response":{
                    "headers":[
                       {
                          "name":"Server",
                          "value":"TwistedWeb/18.9.0"
                       },
                       {
                          "name":"Date",
                          "value":"Thu, 07 Jan 2021 21:32:50 GMT"
                       },
                       {
                          "name":"Content-Type",
                          "value":"application/json"
                       },
                       {
                          "name":"Content-Length",
                          "value":"37"
                       },
                       {
                          "name":"X-Powered-By",
                          "value":"PHP/7.0.11"
                       }
                    ],
                    "reason_phrase":"INTERNAL SERVER ERROR",
                    "status_code":500,
                    "body":"{\"message\":\"Internal Server Error\"}"
                 }
              }
           ]
        },
        "location":{
           "hostname":"http://149.248.44.52:7777",
           "method":"GET",
           "param":"Path: /api/users/2",
           "path":"/api/users/65576"
        },
        "assets":[
           {
              "type":"postman",
              "name":"Postman Collection",
              "url":"https://gitlab.com/gitlab-org/security-products/tests/api-fuzzing-e2e/har/-/jobs/950341333/artifacts/file/assets/vuln_c87fe63a-56c9-45e5-8faf-4d3aac33b3dc.postman_collection.json?inline=false"
           },
           {
              "type":"http_session",
              "name":"HTTP Messages",
              "url":"https://gitlab.com/gitlab-org/security-products/tests/api-fuzzing-e2e/har/-/jobs/950341333/artifacts/file/assets/vuln_c87fe63a-56c9-45e5-8faf-4d3aac33b3dc_messages.zip?inline=false"
           }
        ],
        "discovered_at":"2021-01-07T21:32:54.902"
     },
     {
        "id":"e8c4cb3b-282d-47c2-8045-7c177d416f18",
        "name":"Fuzzing injection via 'first' on 'POST 149.248.44.52:7777/api/users'",
        "description":"Fuzzing performes non-specific injections into target field in an attempt to cause unexpected behaviour of the target. Fuzzing can find injection style issues, buffer overflows, memory corruption, stability issues, and others.  Fuzzing consists of sending mutated/semi-malformed data injections in an automated fashion to the target.\n\nThe 'mutator' is the data generator in use when the issue was identified.\n\nMutator: StringStatic\nParameter Original Value: mike\nParameter Mutated Value: 9223372036854775806\n\n\n",
        "severity":"Unknown",
        "identifiers":[
           {
              "type":"ApiFuzzingCheck",
              "name":"JSON Fuzzing",
              "url":"https://docs.gitlab.com/ee/user/application_security/api_fuzzing/",
              "value":"bucket:param:Body: first:check:JSON Fuzzing:check_arg::assert:Status Code:data:73b94a8ddf2cb06f9795f38faead5d3d3de7042f0285586efd9d75c3e53c3617"
           }
        ],
        "evidence":{
           "source":{
              "id":"assert:Status Code",
              "name":"Status Code"
           },
           "summary":"An invalid status code '500' was detected during testing.  Invalid status codes indicate an error or unexpected event occured.\n\n\n",
           "request":{
              "headers":[
                 {
                    "name":"Host",
                    "value":"149.248.44.52:7777"
                 },
                 {
                    "name":"Origin",
                    "value":"http://127.0.0.1:7777"
                 },
                 {
                    "name":"Accept-Encoding",
                    "value":"gzip,deflate,zlib"
                 },
                 {
                    "name":"Accept-Language",
                    "value":"en-US,en;q=0.8"
                 },
                 {
                    "name":"User-Agent",
                    "value":"Mozilla/5.0 (Windows NT 10.0; Win64; x64) AppleWebKit/537.36 (KHTML, like Gecko) Chrome/61.0.3163.100 Safari/537.36"
                 },
                 {
                    "name":"Content-Type",
                    "value":"application/json; charset=UTF-8"
                 },
                 {
                    "name":"Accept",
                    "value":"*/*"
                 },
                 {
                    "name":"Referer",
                    "value":"http://127.0.0.1:7777/"
                 },
                 {
                    "name":"Cookie",
                    "value":".AspNetCore.Antiforgery.a6BorKCfoC4=CfDJ8DL4GupRCDNGl_0OiAd3qWP5O9gu_LiedsgcLWhaCgn88Ru8oWwXGQvL3PXNdZ0n5TjUPody5ZI01g6DQyaaphE4U6osQ8UW4ek9hlOQX0XFvIg9G3vGuvPt1XiJkxzxEtoPMlepzIig3KblZd5YsOs"
                 },
                 {
                    "name":"Connection",
                    "value":"keep-alive"
                 },
                 {
                    "name":"Content-Length",
                    "value":"77"
                 },
                 {
                    "name":"authorization",
                    "value":"Token b5638ae7-6e77-4585-b035-7d9de2e3f6b3"
                 },
                 {
                    "name":"Via",
                    "value":"HTTP/1.1 GitLabApiSecurity 1.6.71"
                 }
              ],
              "method":"POST",
              "url":"http://149.248.44.52:7777/api/users",
              "body":"{\"user\":\"dd\",\"first\":\"9223372036854775806\",\"last\":\"smith\",\"password\":\"hello\"}"
           },
           "response":{
              "headers":[
                 {
                    "name":"Server",
                    "value":"TwistedWeb/18.9.0"
                 },
                 {
                    "name":"Date",
                    "value":"Thu, 07 Jan 2021 21:33:15 GMT"
                 },
                 {
                    "name":"Content-Type",
                    "value":"application/json"
                 },
                 {
                    "name":"Content-Length",
                    "value":"170"
                 },
                 {
                    "name":"Access-Control-Allow-Origin",
                    "value":"http://127.0.0.1:7777"
                 },
                 {
                    "name":"Vary",
                    "value":"Origin"
                 },
                 {
                    "name":"X-Powered-By",
                    "value":"PHP/7.0.11"
                 }
              ],
              "reason_phrase":"INTERNAL SERVER ERROR",
              "status_code":500,
              "body":"{\"message\":\"The server encountered an internal error and was unable to complete your request. Either the server is overloaded or there is an error in the application.\"}"
           },
           "supporting_messages":[
              {
                 "name":"Origional",
                 "request":{
                    "headers":[
                       {
                          "name":"Host",
                          "value":"149.248.44.52:7777"
                       },
                       {
                          "name":"Origin",
                          "value":"http://127.0.0.1:7777"
                       },
                       {
                          "name":"Accept-Encoding",
                          "value":"gzip,deflate,zlib"
                       },
                       {
                          "name":"Accept-Language",
                          "value":"en-US,en;q=0.8"
                       },
                       {
                          "name":"User-Agent",
                          "value":"Mozilla/5.0 (Windows NT 10.0; Win64; x64) AppleWebKit/537.36 (KHTML, like Gecko) Chrome/61.0.3163.100 Safari/537.36"
                       },
                       {
                          "name":"Content-Type",
                          "value":"application/json; charset=UTF-8"
                       },
                       {
                          "name":"Accept",
                          "value":"*/*"
                       },
                       {
                          "name":"Referer",
                          "value":"http://127.0.0.1:7777/"
                       },
                       {
                          "name":"Cookie",
                          "value":".AspNetCore.Antiforgery.a6BorKCfoC4=CfDJ8DL4GupRCDNGl_0OiAd3qWP5O9gu_LiedsgcLWhaCgn88Ru8oWwXGQvL3PXNdZ0n5TjUPody5ZI01g6DQyaaphE4U6osQ8UW4ek9hlOQX0XFvIg9G3vGuvPt1XiJkxzxEtoPMlepzIig3KblZd5YsOs"
                       },
                       {
                          "name":"Connection",
                          "value":"keep-alive"
                       },
                       {
                          "name":"Content-Length",
                          "value":"62"
                       },
                       {
                          "name":"authorization",
                          "value":"Token b5638ae7-6e77-4585-b035-7d9de2e3f6b3"
                       }
                    ],
                    "method":"POST",
                    "url":"http://149.248.44.52:7777/api/users",
                    "body":"{\"user\":\"dd\",\"first\":\"mike\",\"last\":\"smith\",\"password\":\"hello\"}"
                 }
              },
              {
                 "name":"Recorded",
                 "request":{
                    "headers":[
                       {
                          "name":"Host",
                          "value":"149.248.44.52:7777"
                       },
                       {
                          "name":"Origin",
                          "value":"http://127.0.0.1:7777"
                       },
                       {
                          "name":"Accept-Encoding",
                          "value":"gzip,deflate,zlib"
                       },
                       {
                          "name":"Accept-Language",
                          "value":"en-US,en;q=0.8"
                       },
                       {
                          "name":"User-Agent",
                          "value":"Mozilla/5.0 (Windows NT 10.0; Win64; x64) AppleWebKit/537.36 (KHTML, like Gecko) Chrome/61.0.3163.100 Safari/537.36"
                       },
                       {
                          "name":"Content-Type",
                          "value":"application/json; charset=UTF-8"
                       },
                       {
                          "name":"Accept",
                          "value":"*/*"
                       },
                       {
                          "name":"Referer",
                          "value":"http://127.0.0.1:7777/"
                       },
                       {
                          "name":"Cookie",
                          "value":".AspNetCore.Antiforgery.a6BorKCfoC4=CfDJ8DL4GupRCDNGl_0OiAd3qWP5O9gu_LiedsgcLWhaCgn88Ru8oWwXGQvL3PXNdZ0n5TjUPody5ZI01g6DQyaaphE4U6osQ8UW4ek9hlOQX0XFvIg9G3vGuvPt1XiJkxzxEtoPMlepzIig3KblZd5YsOs"
                       },
                       {
                          "name":"Connection",
                          "value":"keep-alive"
                       },
                       {
                          "name":"Content-Length",
                          "value":"62"
                       },
                       {
                          "name":"authorization",
                          "value":"Token b5638ae7-6e77-4585-b035-7d9de2e3f6b3"
                       }
                    ],
                    "method":"POST",
                    "url":"http://149.248.44.52:7777/api/users",
                    "body":"{\"user\":\"dd\",\"first\":\"mike\",\"last\":\"smith\",\"password\":\"hello\"}"
                 },
                 "response":{
                    "headers":[
                       {
                          "name":"Server",
                          "value":"TwistedWeb/18.9.0"
                       },
                       {
                          "name":"Date",
                          "value":"Thu, 07 Jan 2021 21:33:07 GMT"
                       },
                       {
                          "name":"Content-Type",
                          "value":"application/json"
                       },
                       {
                          "name":"Content-Length",
                          "value":"170"
                       },
                       {
                          "name":"Access-Control-Allow-Origin",
                          "value":"http://127.0.0.1:7777"
                       },
                       {
                          "name":"Vary",
                          "value":"Origin"
                       },
                       {
                          "name":"X-Powered-By",
                          "value":"PHP/7.0.11"
                       }
                    ],
                    "reason_phrase":"INTERNAL SERVER ERROR",
                    "status_code":500,
                    "body":"{\"message\":\"The server encountered an internal error and was unable to complete your request. Either the server is overloaded or there is an error in the application.\"}"
                 }
              }
           ]
        },
        "location":{
           "hostname":"http://149.248.44.52:7777",
           "method":"POST",
           "param":"Body: first",
           "path":"/api/users"
        },
        "assets":[
           {
              "type":"postman",
              "name":"Postman Collection",
              "url":"https://gitlab.com/gitlab-org/security-products/tests/api-fuzzing-e2e/har/-/jobs/950341333/artifacts/file/assets/vuln_e8c4cb3b-282d-47c2-8045-7c177d416f18.postman_collection.json?inline=false"
           },
           {
              "type":"http_session",
              "name":"HTTP Messages",
              "url":"https://gitlab.com/gitlab-org/security-products/tests/api-fuzzing-e2e/har/-/jobs/950341333/artifacts/file/assets/vuln_e8c4cb3b-282d-47c2-8045-7c177d416f18_messages.zip?inline=false"
           }
        ],
        "discovered_at":"2021-01-07T21:33:15.161"
     },
     {
        "id":"6bd738c9-84a5-4a75-8c81-ba6c7ee6bdc4",
        "name":"Fuzzing injection via 'last' on 'POST 149.248.44.52:7777/api/users'",
        "description":"Fuzzing performes non-specific injections into target field in an attempt to cause unexpected behaviour of the target. Fuzzing can find injection style issues, buffer overflows, memory corruption, stability issues, and others.  Fuzzing consists of sending mutated/semi-malformed data injections in an automated fashion to the target.\n\nThe 'mutator' is the data generator in use when the issue was identified.\n\nMutator: StringUnicodePlane0\nParameter Original Value: smith\nParameter Mutated Value: 鼬敞诚⟐絈ꪶঝ忲홥䄾篘ꊉ哔碣崐⛽잩䱭춍ഷ帶욇ꗙ敀Ư඿柷︸楑뤍჎ڴ鼅虹Ṅ씸雃뚗鹴튙౱ፗዕ惑넃ķ褊◜㈤䧬꒵燌鉞썈㝵葶梠한坊ﬄ໪ﰡ橖陧ܼ鞃츶㫭俓曎歈ȡඉ奖濎騴᭣搅ԏ熝≫뇼㇅拫유ጐ派竎䣷綝ɴ㹾ꔟ쁷槯ꍆ孏扜脢沊펿㒉쓥悐퀫躛஫蕶酞캶煠︞\u0014뮈瓏㄂흠﵈뢖릗绒଎⣌뉰῎⊥ᔩỜ칽ໜມ㋫냨蟣鐶ꨱ썦퓹ᬄ㣽뭃鐨㟥㪂끭䓐费롒倦첱⃵槇県葿\n\n\n",
        "severity":"Unknown",
        "identifiers":[
           {
              "type":"ApiFuzzingCheck",
              "name":"JSON Fuzzing",
              "url":"https://docs.gitlab.com/ee/user/application_security/api_fuzzing/",
              "value":"bucket:param:Body: last:check:JSON Fuzzing:check_arg::assert:Status Code:data:0533befe9c0c9f4321d99679b042da568d0f2d52a3708900682e999772d55193"
           }
        ],
        "evidence":{
           "source":{
              "id":"assert:Status Code",
              "name":"Status Code"
           },
           "summary":"An invalid status code '500' was detected during testing.  Invalid status codes indicate an error or unexpected event occured.\n\n\n",
           "request":{
              "headers":[
                 {
                    "name":"Host",
                    "value":"149.248.44.52:7777"
                 },
                 {
                    "name":"Origin",
                    "value":"http://127.0.0.1:7777"
                 },
                 {
                    "name":"Accept-Encoding",
                    "value":"gzip,deflate,zlib"
                 },
                 {
                    "name":"Accept-Language",
                    "value":"en-US,en;q=0.8"
                 },
                 {
                    "name":"User-Agent",
                    "value":"Mozilla/5.0 (Windows NT 10.0; Win64; x64) AppleWebKit/537.36 (KHTML, like Gecko) Chrome/61.0.3163.100 Safari/537.36"
                 },
                 {
                    "name":"Content-Type",
                    "value":"application/json; charset=UTF-8"
                 },
                 {
                    "name":"Accept",
                    "value":"*/*"
                 },
                 {
                    "name":"Referer",
                    "value":"http://127.0.0.1:7777/"
                 },
                 {
                    "name":"Cookie",
                    "value":".AspNetCore.Antiforgery.a6BorKCfoC4=CfDJ8DL4GupRCDNGl_0OiAd3qWP5O9gu_LiedsgcLWhaCgn88Ru8oWwXGQvL3PXNdZ0n5TjUPody5ZI01g6DQyaaphE4U6osQ8UW4ek9hlOQX0XFvIg9G3vGuvPt1XiJkxzxEtoPMlepzIig3KblZd5YsOs"
                 },
                 {
                    "name":"Connection",
                    "value":"keep-alive"
                 },
                 {
                    "name":"Content-Length",
                    "value":"515"
                 },
                 {
                    "name":"authorization",
                    "value":"Token b5638ae7-6e77-4585-b035-7d9de2e3f6b3"
                 },
                 {
                    "name":"Via",
                    "value":"HTTP/1.1 GitLabApiSecurity 1.6.71"
                 }
              ],
              "method":"POST",
              "url":"http://149.248.44.52:7777/api/users",
              "body":"{\"user\":\"dd\",\"first\":\"mike\",\"last\":\"鼬敞诚⟐絈ꪶঝ忲홥䄾篘ꊉ哔碣崐⛽잩䱭춍ഷ帶욇ꗙ敀Ư඿柷︸楑뤍჎ڴ鼅虹Ṅ씸雃뚗鹴튙౱ፗዕ惑넃ķ褊◜㈤䧬꒵燌鉞썈㝵葶梠한坊ﬄ໪ﰡ橖陧ܼ鞃츶㫭俓曎歈ȡඉ奖濎騴᭣搅ԏ熝≫뇼㇅拫유ጐ派竎䣷綝ɴ㹾ꔟ쁷槯ꍆ孏扜脢沊펿㒉쓥悐퀫躛஫蕶酞캶煠︞\\u0014뮈瓏㄂흠﵈뢖릗绒଎⣌뉰῎⊥ᔩỜ칽ໜມ㋫냨蟣鐶ꨱ썦퓹ᬄ㣽뭃鐨㟥㪂끭䓐费롒倦첱⃵槇県葿\",\"password\":\"hello\"}"
           },
           "response":{
              "headers":[
                 {
                    "name":"Server",
                    "value":"TwistedWeb/18.9.0"
                 },
                 {
                    "name":"Date",
                    "value":"Thu, 07 Jan 2021 21:33:20 GMT"
                 },
                 {
                    "name":"Content-Type",
                    "value":"application/json"
                 },
                 {
                    "name":"Content-Length",
                    "value":"170"
                 },
                 {
                    "name":"Access-Control-Allow-Origin",
                    "value":"http://127.0.0.1:7777"
                 },
                 {
                    "name":"Vary",
                    "value":"Origin"
                 },
                 {
                    "name":"X-Powered-By",
                    "value":"PHP/7.0.11"
                 }
              ],
              "reason_phrase":"INTERNAL SERVER ERROR",
              "status_code":500,
              "body":"{\"message\":\"The server encountered an internal error and was unable to complete your request. Either the server is overloaded or there is an error in the application.\"}"
           },
           "supporting_messages":[
              {
                 "name":"Origional",
                 "request":{
                    "headers":[
                       {
                          "name":"Host",
                          "value":"149.248.44.52:7777"
                       },
                       {
                          "name":"Origin",
                          "value":"http://127.0.0.1:7777"
                       },
                       {
                          "name":"Accept-Encoding",
                          "value":"gzip,deflate,zlib"
                       },
                       {
                          "name":"Accept-Language",
                          "value":"en-US,en;q=0.8"
                       },
                       {
                          "name":"User-Agent",
                          "value":"Mozilla/5.0 (Windows NT 10.0; Win64; x64) AppleWebKit/537.36 (KHTML, like Gecko) Chrome/61.0.3163.100 Safari/537.36"
                       },
                       {
                          "name":"Content-Type",
                          "value":"application/json; charset=UTF-8"
                       },
                       {
                          "name":"Accept",
                          "value":"*/*"
                       },
                       {
                          "name":"Referer",
                          "value":"http://127.0.0.1:7777/"
                       },
                       {
                          "name":"Cookie",
                          "value":".AspNetCore.Antiforgery.a6BorKCfoC4=CfDJ8DL4GupRCDNGl_0OiAd3qWP5O9gu_LiedsgcLWhaCgn88Ru8oWwXGQvL3PXNdZ0n5TjUPody5ZI01g6DQyaaphE4U6osQ8UW4ek9hlOQX0XFvIg9G3vGuvPt1XiJkxzxEtoPMlepzIig3KblZd5YsOs"
                       },
                       {
                          "name":"Connection",
                          "value":"keep-alive"
                       },
                       {
                          "name":"Content-Length",
                          "value":"62"
                       },
                       {
                          "name":"authorization",
                          "value":"Token b5638ae7-6e77-4585-b035-7d9de2e3f6b3"
                       }
                    ],
                    "method":"POST",
                    "url":"http://149.248.44.52:7777/api/users",
                    "body":"{\"user\":\"dd\",\"first\":\"mike\",\"last\":\"smith\",\"password\":\"hello\"}"
                 }
              },
              {
                 "name":"Recorded",
                 "request":{
                    "headers":[
                       {
                          "name":"Host",
                          "value":"149.248.44.52:7777"
                       },
                       {
                          "name":"Origin",
                          "value":"http://127.0.0.1:7777"
                       },
                       {
                          "name":"Accept-Encoding",
                          "value":"gzip,deflate,zlib"
                       },
                       {
                          "name":"Accept-Language",
                          "value":"en-US,en;q=0.8"
                       },
                       {
                          "name":"User-Agent",
                          "value":"Mozilla/5.0 (Windows NT 10.0; Win64; x64) AppleWebKit/537.36 (KHTML, like Gecko) Chrome/61.0.3163.100 Safari/537.36"
                       },
                       {
                          "name":"Content-Type",
                          "value":"application/json; charset=UTF-8"
                       },
                       {
                          "name":"Accept",
                          "value":"*/*"
                       },
                       {
                          "name":"Referer",
                          "value":"http://127.0.0.1:7777/"
                       },
                       {
                          "name":"Cookie",
                          "value":".AspNetCore.Antiforgery.a6BorKCfoC4=CfDJ8DL4GupRCDNGl_0OiAd3qWP5O9gu_LiedsgcLWhaCgn88Ru8oWwXGQvL3PXNdZ0n5TjUPody5ZI01g6DQyaaphE4U6osQ8UW4ek9hlOQX0XFvIg9G3vGuvPt1XiJkxzxEtoPMlepzIig3KblZd5YsOs"
                       },
                       {
                          "name":"Connection",
                          "value":"keep-alive"
                       },
                       {
                          "name":"Content-Length",
                          "value":"62"
                       },
                       {
                          "name":"authorization",
                          "value":"Token b5638ae7-6e77-4585-b035-7d9de2e3f6b3"
                       }
                    ],
                    "method":"POST",
                    "url":"http://149.248.44.52:7777/api/users",
                    "body":"{\"user\":\"dd\",\"first\":\"mike\",\"last\":\"smith\",\"password\":\"hello\"}"
                 },
                 "response":{
                    "headers":[
                       {
                          "name":"Server",
                          "value":"TwistedWeb/18.9.0"
                       },
                       {
                          "name":"Date",
                          "value":"Thu, 07 Jan 2021 21:33:07 GMT"
                       },
                       {
                          "name":"Content-Type",
                          "value":"application/json"
                       },
                       {
                          "name":"Content-Length",
                          "value":"170"
                       },
                       {
                          "name":"Access-Control-Allow-Origin",
                          "value":"http://127.0.0.1:7777"
                       },
                       {
                          "name":"Vary",
                          "value":"Origin"
                       },
                       {
                          "name":"X-Powered-By",
                          "value":"PHP/7.0.11"
                       }
                    ],
                    "reason_phrase":"INTERNAL SERVER ERROR",
                    "status_code":500,
                    "body":"{\"message\":\"The server encountered an internal error and was unable to complete your request. Either the server is overloaded or there is an error in the application.\"}"
                 }
              }
           ]
        },
        "location":{
           "hostname":"http://149.248.44.52:7777",
           "method":"POST",
           "param":"Body: last",
           "path":"/api/users"
        },
        "assets":[
           {
              "type":"postman",
              "name":"Postman Collection",
              "url":"https://gitlab.com/gitlab-org/security-products/tests/api-fuzzing-e2e/har/-/jobs/950341333/artifacts/file/assets/vuln_6bd738c9-84a5-4a75-8c81-ba6c7ee6bdc4.postman_collection.json?inline=false"
           },
           {
              "type":"http_session",
              "name":"HTTP Messages",
              "url":"https://gitlab.com/gitlab-org/security-products/tests/api-fuzzing-e2e/har/-/jobs/950341333/artifacts/file/assets/vuln_6bd738c9-84a5-4a75-8c81-ba6c7ee6bdc4_messages.zip?inline=false"
           }
        ],
        "discovered_at":"2021-01-07T21:33:19.939"
     },
     {
        "id":"8742fec1-5cd8-4ae8-aef4-ec7fdc91e530",
        "name":"Fuzzing injection via 'password' on 'POST 149.248.44.52:7777/api/users'",
        "description":"Fuzzing performes non-specific injections into target field in an attempt to cause unexpected behaviour of the target. Fuzzing can find injection style issues, buffer overflows, memory corruption, stability issues, and others.  Fuzzing consists of sending mutated/semi-malformed data injections in an automated fashion to the target.\n\nThe 'mutator' is the data generator in use when the issue was identified.\n\nMutator: StringUtf8BomLength\nParameter Original Value: hello\nParameter Mutated Value: \n00000000   68 65 6C 6C 6F 68 65 6C  6C 6F 68 65 6C 6C 6F 68   hellohellohelloh\n00000010   65 6C 6C 6F 68 65 6C 6C  6F 68 65 6C 6C 6F 68 65   ellohellohellohe\n00000020   6C 6C 6F 68 65 6C 6C 6F  68 65 6C 6C 6F 68 65 6C   llohellohellohel\n00000030   6C 6F 68 65 6C 6C 6F 68  65 6C 6C 6F 68 65 6C 6C   lohellohellohell\n00000040   6F 68 65 6C 6C 6F 68 65  6C 6C 6F 68 65 6C 6C 6F   ohellohellohello\n00000050   68 65 6C 6C 6F 68 65 6C  6C 6F 68 65 6C 6C 6F 68   hellohellohelloh\n00000060   65 6C 6C 6F 68 65 6C 6C  6F 68 65 6C 6C 6F 68 65   ellohellohellohe\n00000070   6C 6C 6F 68 65 6C 6C 6F  68 65 6C 6C 6F 68 65 6C   llohellohellohel\n00000080   6C 6F 68 65 6C 6C 6F 68  65 6C 6C 6F 68 65 6C 6C   lohellohellohell\n00000090   6F 68 65 6C 6C 6F 68 65  6C 6C 6F 68 65 6C 6C 6F   ohellohellohello\n000000A0   68 65 6C 6C 6F 68 65 6C  6C 6F 68 65 6C 6C 6F 68   hellohellohelloh\n000000B0   65 6C 6C 6F 68 65 6C 6C  6F 68 65 6C 6C 6F 68 65   ellohellohellohe\n000000C0   6C 6C 6F 68 65 6C 6C 6F  68 65 6C 6C 6F 68 65 6C   llohellohellohel\n000000D0   6C 6F 68 65 6C 6C 6F 68  65 6C EB BB BF 6C 6F 68   lohellohel...loh\n000000E0   65 6C 6C 6F 68 65 6C 6C  6F 68 65 6C 6C 6F 68 65   ellohellohellohe\n000000F0   6C 6C 6F 68 65 6C 6C 6F  68 65 6C 6C 6F 68 65 6C   llohellohellohel\n00000100   6C 6F 68 65 6C 6C 6F 68  65 6C 6C 6F 68 65 6C 6C   lohellohellohell\n00000110   6F 68 65 6C 6C 6F 68 65  6C 6C 6F 68 65 6C 6C 6F   ohellohellohello\n00000120   68 65 6C 6C 6F 68 65 6C  6C 6F 68 65 6C 6C 6F 68   hellohellohelloh\n00000130   65 6C 6C 6F 68 65 6C 6C  6F 68 65 6C 6C 6F 68 65   ellohellohellohe\n00000140   6C 6C 6F 68 65 6C 6C 6F  68 65 6C 6C 6F 68 65 6C   llohellohellohel\n00000150   6C 6F 68 65 6C 6C 6F 68  65 6C 6C 6F 68 65 6C 6C   lohellohellohell\n00000160   6F 68 65 6C 6C 6F 68 65  6C 6C 6F 68 65 6C 6C 6F   ohellohellohello\n00000170   68 65 6C 6C 6F 68 65 6C  6C 6F 68 65 6C 6C 6F 68   hellohellohelloh\n00000180   65 6C 6C 6F 68 65 6C 6C  6F 68 65 6C 6C 6F 68 65   ellohellohellohe\n00000190   6C 6C 6F 68 65 6C 6C 6F  68 65 6C 6C 6F 68 65 6C   llohellohellohel\n000001A0   6C 6F 68 65 6C 6C 6F 68  65 6C 6C 6F 68 65 6C 6C   lohellohellohell\n000001B0   6F 68 65 6C 6C 6F 68 65  6C 6C 6F 68 65 6C 6C 6F   ohellohellohello\n000001C0   68 65 6C 6C 6F 68 65 6C  6C 6F 68 65 6C 6C 6F 68   hellohellohelloh\n000001D0   65 6C 6C 6F 68 65 6C 6C  6F 68 65 6C 6C 6F 68 65   ellohellohellohe\n000001E0   6C 6C 6F 68 65 6C 6C 6F  68 65 6C 6C 6F 68 65 6C   llohellohellohel\n000001F0   6C 6F 68 65 6C 6C 6F 68  65 6C 6C 6F 68 65 6C 6C   lohellohellohell\n00000200   6F 68 65 6C 6C 6F 68 65  6C 6C 6F 68 65 6C 6C 6F   ohellohellohello\n00000210   68 65 6C 6C 6F 68 65 6C  6C 6F 68 65 6C 6C 6F 68   hellohellohelloh\n00000220   65 EB BB BF 6C 6C 6F 68  65 6C 6C 6F 68 65 6C 6C   e...llohellohell\n00000230   6F 68 65 6C 6C 6F 68 65  6C 6C 6F 68 65 6C 6C 6F   ohellohellohello\n00000240   68 65 6C 6C 6F 68 65 6C  6C 6F 68 65 6C 6C 6F 68   hellohellohelloh\n00000250   65 6C 6C 6F 68 65 6C 6C  6F 68 65 6C 6C 6F 68 65   ellohellohellohe\n00000260   6C 6C 6F 68 65 6C 6C 6F  68 65 6C 6C 6F 68 65 6C   llohellohellohel\n00000270   6C 6F 68 65 6C 6C 6F 68  65 6C 6C 6F 68 65 6C 6C   lohellohellohell\n00000280   6F 68 65 6C 6C 6F 68 65  6C 6C 6F 68 65 6C 6C 6F   ohellohellohello\n00000290   68 65 6C 6C 6F 68 65 6C  6C 6F 68 65 6C 6C 6F 68   hellohellohelloh\n000002A0   65 6C 6C 6F 68 65 6C 6C  6F 68 65 6C 6C 6F 68 65   ellohellohellohe\n000002B0   6C 6C 6F 68 65 6C 6C 6F  68 65 6C 6C 6F 68 65 6C   llohellohellohel\n000002C0   6C 6F 68 65 6C 6C 6F 68  65 6C 6C 6F 68 65 6C 6C   lohellohellohell\n000002D0   6F 68 65 6C 6C 6F 68 65  6C 6C 6F 68 65 6C 6C 6F   ohellohellohello\n000002E0   68 65 6C 6C 6F 68 65 6C  6C 6F 68 65 6C 6C 6F 68   hellohellohelloh\n000002F0   65 6C 6C 6F 68 65 6C 6C  6F 68 65 6C 6C 6F 68 65   ellohellohellohe\n00000300   6C 6C 6F 68 65 6C 6C 6F  68 65 6C 6C 6F 68 65 6C   llohellohellohel\n00000310   6C 6F 68 65 6C 6C 6F 68  65                        lohellohe       \\\n\n\n",
        "severity":"Unknown",
        "identifiers":[
           {
              "type":"ApiFuzzingCheck",
              "name":"JSON Fuzzing",
              "url":"https://docs.gitlab.com/ee/user/application_security/api_fuzzing/",
              "value":"bucket:param:Body: password:check:JSON Fuzzing:check_arg::assert:Status Code:data:f6a66393ef3cea6717c9f2a71d8547d6aa37ffaac881e79c346d8bd7addb02df"
           }
        ],
        "evidence":{
           "source":{
              "id":"assert:Status Code",
              "name":"Status Code"
           },
           "summary":"An invalid status code '500' was detected during testing.  Invalid status codes indicate an error or unexpected event occured.\n\n\n",
           "request":{
              "headers":[
                 {
                    "name":"Host",
                    "value":"149.248.44.52:7777"
                 },
                 {
                    "name":"Origin",
                    "value":"http://127.0.0.1:7777"
                 },
                 {
                    "name":"Accept-Encoding",
                    "value":"gzip,deflate,zlib"
                 },
                 {
                    "name":"Accept-Language",
                    "value":"en-US,en;q=0.8"
                 },
                 {
                    "name":"User-Agent",
                    "value":"Mozilla/5.0 (Windows NT 10.0; Win64; x64) AppleWebKit/537.36 (KHTML, like Gecko) Chrome/61.0.3163.100 Safari/537.36"
                 },
                 {
                    "name":"Content-Type",
                    "value":"application/json; charset=UTF-8"
                 },
                 {
                    "name":"Accept",
                    "value":"*/*"
                 },
                 {
                    "name":"Referer",
                    "value":"http://127.0.0.1:7777/"
                 },
                 {
                    "name":"Cookie",
                    "value":".AspNetCore.Antiforgery.a6BorKCfoC4=CfDJ8DL4GupRCDNGl_0OiAd3qWP5O9gu_LiedsgcLWhaCgn88Ru8oWwXGQvL3PXNdZ0n5TjUPody5ZI01g6DQyaaphE4U6osQ8UW4ek9hlOQX0XFvIg9G3vGuvPt1XiJkxzxEtoPMlepzIig3KblZd5YsOs"
                 },
                 {
                    "name":"Connection",
                    "value":"keep-alive"
                 },
                 {
                    "name":"Content-Length",
                    "value":"850"
                 },
                 {
                    "name":"authorization",
                    "value":"Token b5638ae7-6e77-4585-b035-7d9de2e3f6b3"
                 },
                 {
                    "name":"Via",
                    "value":"HTTP/1.1 GitLabApiSecurity 1.6.71"
                 }
              ],
              "method":"POST",
              "url":"http://149.248.44.52:7777/api/users",
              "body":"{\"user\":\"dd\",\"first\":\"mike\",\"last\":\"smith\",\"password\":\"hellohellohellohellohellohellohellohellohellohellohellohellohellohellohellohellohellohellohellohellohellohellohellohellohellohellohellohellohellohellohellohellohellohellohellohellohellohellohellohellohellohellohellohel뻿lohellohellohellohellohellohellohellohellohellohellohellohellohellohellohellohellohellohellohellohellohellohellohellohellohellohellohellohellohellohellohellohellohellohellohellohellohellohellohellohellohellohellohellohellohellohellohellohellohellohellohellohellohellohellohellohellohellohellohellohellohellohellohellohellohe뻿llohellohellohellohellohellohellohellohellohellohellohellohellohellohellohellohellohellohellohellohellohellohellohellohellohellohellohellohellohellohellohellohellohellohellohellohellohellohellohellohellohellohellohellohellohellohellohellohellohe\"}"
           },
           "response":{
              "headers":[
                 {
                    "name":"Server",
                    "value":"TwistedWeb/18.9.0"
                 },
                 {
                    "name":"Date",
                    "value":"Thu, 07 Jan 2021 21:33:21 GMT"
                 },
                 {
                    "name":"Content-Type",
                    "value":"application/json"
                 },
                 {
                    "name":"Content-Length",
                    "value":"170"
                 },
                 {
                    "name":"Access-Control-Allow-Origin",
                    "value":"http://127.0.0.1:7777"
                 },
                 {
                    "name":"Vary",
                    "value":"Origin"
                 },
                 {
                    "name":"X-Powered-By",
                    "value":"PHP/7.0.11"
                 }
              ],
              "reason_phrase":"INTERNAL SERVER ERROR",
              "status_code":500,
              "body":"{\"message\":\"The server encountered an internal error and was unable to complete your request. Either the server is overloaded or there is an error in the application.\"}"
           },
           "supporting_messages":[
              {
                 "name":"Origional",
                 "request":{
                    "headers":[
                       {
                          "name":"Host",
                          "value":"149.248.44.52:7777"
                       },
                       {
                          "name":"Origin",
                          "value":"http://127.0.0.1:7777"
                       },
                       {
                          "name":"Accept-Encoding",
                          "value":"gzip,deflate,zlib"
                       },
                       {
                          "name":"Accept-Language",
                          "value":"en-US,en;q=0.8"
                       },
                       {
                          "name":"User-Agent",
                          "value":"Mozilla/5.0 (Windows NT 10.0; Win64; x64) AppleWebKit/537.36 (KHTML, like Gecko) Chrome/61.0.3163.100 Safari/537.36"
                       },
                       {
                          "name":"Content-Type",
                          "value":"application/json; charset=UTF-8"
                       },
                       {
                          "name":"Accept",
                          "value":"*/*"
                       },
                       {
                          "name":"Referer",
                          "value":"http://127.0.0.1:7777/"
                       },
                       {
                          "name":"Cookie",
                          "value":".AspNetCore.Antiforgery.a6BorKCfoC4=CfDJ8DL4GupRCDNGl_0OiAd3qWP5O9gu_LiedsgcLWhaCgn88Ru8oWwXGQvL3PXNdZ0n5TjUPody5ZI01g6DQyaaphE4U6osQ8UW4ek9hlOQX0XFvIg9G3vGuvPt1XiJkxzxEtoPMlepzIig3KblZd5YsOs"
                       },
                       {
                          "name":"Connection",
                          "value":"keep-alive"
                       },
                       {
                          "name":"Content-Length",
                          "value":"62"
                       },
                       {
                          "name":"authorization",
                          "value":"Token b5638ae7-6e77-4585-b035-7d9de2e3f6b3"
                       }
                    ],
                    "method":"POST",
                    "url":"http://149.248.44.52:7777/api/users",
                    "body":"{\"user\":\"dd\",\"first\":\"mike\",\"last\":\"smith\",\"password\":\"hello\"}"
                 }
              },
              {
                 "name":"Recorded",
                 "request":{
                    "headers":[
                       {
                          "name":"Host",
                          "value":"149.248.44.52:7777"
                       },
                       {
                          "name":"Origin",
                          "value":"http://127.0.0.1:7777"
                       },
                       {
                          "name":"Accept-Encoding",
                          "value":"gzip,deflate,zlib"
                       },
                       {
                          "name":"Accept-Language",
                          "value":"en-US,en;q=0.8"
                       },
                       {
                          "name":"User-Agent",
                          "value":"Mozilla/5.0 (Windows NT 10.0; Win64; x64) AppleWebKit/537.36 (KHTML, like Gecko) Chrome/61.0.3163.100 Safari/537.36"
                       },
                       {
                          "name":"Content-Type",
                          "value":"application/json; charset=UTF-8"
                       },
                       {
                          "name":"Accept",
                          "value":"*/*"
                       },
                       {
                          "name":"Referer",
                          "value":"http://127.0.0.1:7777/"
                       },
                       {
                          "name":"Cookie",
                          "value":".AspNetCore.Antiforgery.a6BorKCfoC4=CfDJ8DL4GupRCDNGl_0OiAd3qWP5O9gu_LiedsgcLWhaCgn88Ru8oWwXGQvL3PXNdZ0n5TjUPody5ZI01g6DQyaaphE4U6osQ8UW4ek9hlOQX0XFvIg9G3vGuvPt1XiJkxzxEtoPMlepzIig3KblZd5YsOs"
                       },
                       {
                          "name":"Connection",
                          "value":"keep-alive"
                       },
                       {
                          "name":"Content-Length",
                          "value":"62"
                       },
                       {
                          "name":"authorization",
                          "value":"Token b5638ae7-6e77-4585-b035-7d9de2e3f6b3"
                       }
                    ],
                    "method":"POST",
                    "url":"http://149.248.44.52:7777/api/users",
                    "body":"{\"user\":\"dd\",\"first\":\"mike\",\"last\":\"smith\",\"password\":\"hello\"}"
                 },
                 "response":{
                    "headers":[
                       {
                          "name":"Server",
                          "value":"TwistedWeb/18.9.0"
                       },
                       {
                          "name":"Date",
                          "value":"Thu, 07 Jan 2021 21:33:07 GMT"
                       },
                       {
                          "name":"Content-Type",
                          "value":"application/json"
                       },
                       {
                          "name":"Content-Length",
                          "value":"170"
                       },
                       {
                          "name":"Access-Control-Allow-Origin",
                          "value":"http://127.0.0.1:7777"
                       },
                       {
                          "name":"Vary",
                          "value":"Origin"
                       },
                       {
                          "name":"X-Powered-By",
                          "value":"PHP/7.0.11"
                       }
                    ],
                    "reason_phrase":"INTERNAL SERVER ERROR",
                    "status_code":500,
                    "body":"{\"message\":\"The server encountered an internal error and was unable to complete your request. Either the server is overloaded or there is an error in the application.\"}"
                 }
              }
           ]
        },
        "location":{
           "hostname":"http://149.248.44.52:7777",
           "method":"POST",
           "param":"Body: password",
           "path":"/api/users"
        },
        "assets":[
           {
              "type":"postman",
              "name":"Postman Collection",
              "url":"https://gitlab.com/gitlab-org/security-products/tests/api-fuzzing-e2e/har/-/jobs/950341333/artifacts/file/assets/vuln_8742fec1-5cd8-4ae8-aef4-ec7fdc91e530.postman_collection.json?inline=false"
           },
           {
              "type":"http_session",
              "name":"HTTP Messages",
              "url":"https://gitlab.com/gitlab-org/security-products/tests/api-fuzzing-e2e/har/-/jobs/950341333/artifacts/file/assets/vuln_8742fec1-5cd8-4ae8-aef4-ec7fdc91e530_messages.zip?inline=false"
           }
        ],
        "discovered_at":"2021-01-07T21:33:21.810"
     }
  ]
}
