{
  "version": "15.0.6",
  "vulnerabilities": [
    {
      "name": "XSS in `put_resp_content_type`",
      "description": "Cross-Site Scripting (XSS) vulnerabilities are a result of rendering untrusted input on a page without proper encoding. XSS may allow an attacker to perform actions on behalf of other users, steal session tokens, or access private data. Read more about XSS here: https://www.owasp.org/index.php/Cross-site_Scripting_(XSS)",
      "id": "lib/sample_app_web/controllers/page_controller.ex:10:xss_in_put_resp_content_type",
      "severity": "Unknown",
      "location": {
        "file": "lib/sample_app_web/controllers/page_controller.ex",
        "start_line": 10
      },
      "identifiers": [
        {
          "type": "sobelow_rule_id",
          "name": "Sobelow Rule ID xss_in_put_resp_content_type",
          "value": "xss_in_put_resp_content_type"
        }
      ]
    },
    {
      "name": "SQL injection",
      "description": "SQL injection occurs when untrusted input is interpolated directly into a SQL query. In a typical Phoenix application, this would mean using the `Ecto.Adapters.SQL.query` method and not using the parameterization feature. Read more about SQL injection here: https://www.owasp.org/index.php/SQL_Injection",
      "id": "lib/sample_app_web/controllers/page_controller.ex:16:sql_injection",
      "severity": "Unknown",
      "location": {
        "file": "lib/sample_app_web/controllers/page_controller.ex",
        "start_line": 16
      },
      "identifiers": [
        {
          "type": "sobelow_rule_id",
          "name": "Sobelow Rule ID sql_injection",
          "value": "sql_injection"
        }
      ]
    },
    {
      "name": "Code Execution in `EEx.eval_string`",
      "description": "Insecure EEx evaluation. If user input is passed to EEx eval functions, it may result in arbitrary code execution. The root cause of these issues is often directory traversal.",
      "id": "lib/sample_app_web/controllers/page_controller.ex:24:rce_in_eex_eval_string",
      "severity": "Unknown",
      "location": {
        "file": "lib/sample_app_web/controllers/page_controller.ex",
        "start_line": 24
      },
      "identifiers": [
        {
          "type": "sobelow_rule_id",
          "name": "Sobelow Rule ID rce_in_eex_eval_string",
          "value": "rce_in_eex_eval_string"
        }
      ]
    },
    {
      "name": "Unsafe `String.to_atom`",
      "description": "Denial of Service via `String.to_atom` In Elixir, atoms are not garbage collected. As such, if user input is passed to the `String.to_atom` function, it may result in memory exhaustion. Prefer the `String.to_existing_atom` function for untrusted user input.",
      "id": "lib/sample_app_web/controllers/page_controller.ex:32:dos_unsafe_string_to_atom",
      "severity": "Unknown",
      "location": {
        "file": "lib/sample_app_web/controllers/page_controller.ex",
        "start_line": 32
      },
      "identifiers": [
        {
          "type": "sobelow_rule_id",
          "name": "Sobelow Rule ID dos_unsafe_string_to_atom",
          "value": "dos_unsafe_string_to_atom"
        }
      ]
    },
    {
      "name": "Command Injection in `:os.cmd`",
      "description": "Command Injection vulnerabilities are a result of passing untrusted input to an operating system shell, and may result in complete system compromise. Read more about Command Injection here: https://www.owasp.org/index.php/Command_Injection",
      "id": "lib/sample_app_web/controllers/page_controller.ex:37:ci_in_os_cmd",
      "severity": "Unknown",
      "location": {
        "file": "lib/sample_app_web/controllers/page_controller.ex",
        "start_line": 37
      },
      "identifiers": [
        {
          "type": "sobelow_rule_id",
          "name": "Sobelow Rule ID ci_in_os_cmd",
          "value": "ci_in_os_cmd"
        }
      ]
    }
  ],
  "remediations": [],
  "scan": {
    "analyzer": {
      "id": "sobelow",
      "name": "Sobelow",
      "url": "https://github.com/nccgroup/sobelow",
      "vendor": {
        "name": "GitLab"
      },
      "version": "0.10.4"
    },
    "scanner": {
      "id": "sobelow",
      "name": "Sobelow",
      "url": "https://github.com/nccgroup/sobelow",
      "vendor": {
        "name": "GitLab"
      },
      "version": "0.10.4"
    },
    "type": "sast",
    "status": "success",
    "start_time": "2022-02-22T22:20:22",
    "end_time": "2022-02-22T22:22:22"
  }
}
