{
  "version": "2.1",
  "licenses": [
    {
      "id": "Apache-2.0",
      "name": "Apache License 2.0",
      "url": "https://opensource.org/licenses/Apache-2.0"
    },
    {
      "id": "BSD-3-Clause",
      "name": "BSD 3-Clause \"New\" or \"Revised\" License",
      "url": "https://opensource.org/licenses/BSD-3-Clause"
    },
    {
      "id": "GPL-2.0-or-later",
      "name": "GNU General Public License v2.0 or later",
      "url": "https://opensource.org/licenses/GPL-2.0"
    }
  ],
  "dependencies": [
    {
      "name": "jerryscript",
      "version": "2.2.0",
      "package_manager": "conan",
      "path": "conanfile.txt",
      "licenses": [
        "Apache-2.0"
      ]
    },
    {
      "name": "wolfssl",
      "version": "4.4.0",
      "package_manager": "conan",
      "path": "conanfile.txt",
      "licenses": [
        "GPL-2.0-or-later"
      ]
    },
    {
      "name": "zstd",
      "version": "1.4.4",
      "package_manager": "conan",
      "path": "conanfile.txt",
      "licenses": [
        "BSD-3-Clause"
      ]
    }
  ]
}