{
    "schema": "https://gitlab.com/gitlab-org/security-products/security-report-schemas/-/raw/v14.0.0/dist/sast-report-format.json",
    "version": "15.0.0",
    "scan": {
      "start_time": "2020-08-24T07:30:25",
      "end_time": "2020-08-24T07:54:47",
      "status": "success",
      "type": "sast",
      "scanner": {
        "id": "minac-new-version",
        "name": "Minac manual scanner",
        "url": "https://gitlab.com/minac",
        "version": "0.0.1",
        "vendor": {
          "name": "Minac-new-version"
        }
      },
      "analyzer": {
        "id": "minac",
        "name": "Minac manual analyzer",
        "version": "0.0.1",
        "vendor": {
          "name": "Minac"
        }
      }
    },
    "vulnerabilities": [
      {
        "message": "Test vulnerability - 0",
        "category": "sast",
        "description": "Test vulnerability description",
        "id": "d1b90d3d-607b-4b92-a68a-552f7ba83deb",
        "cve": "d1b90d3d-607b-4b92-a68a-552f7ba83deb",
        "severity": "Critical",
        "identifiers": [
          {
            "name": "Test CVE identifier",
            "type": "CVE",
            "value": "CVE-2023-XXXX"
          },
          {
            "name": "CWE identifier",
            "type": "CWE",
            "value": "CWE-79"
          }
        ],
        "location": {
          "file": "README.md",
          "start_line": 0
        },
        "scanner": {
          "id": "minac",
          "name": "Minac"
        },
        "solution": "No solution"
      }
    ],
    "remediations": []
}
  
