{
  "headers" : {},
  "body" : {
    "object_kind": "build",
    "ref": "webhook-event-test1",
    "tag": false,
    "before_sha": "0000000000000000000000000000000000000000",
    "sha": "cf66af95eca3cc89b38cf3acfb13ee1251ea7dfb",
    "build_id": 201995216,
    "build_name": "package",
    "build_stage": "build_unit_test",
    "build_status": "running",
    "build_started_at": "2019-04-25 01:24:18 UTC",
    "build_finished_at": null,
    "build_duration": 0.964450698,
    "build_allow_failure": false,
    "build_failure_reason": "unknown_failure",
    "project_id": 3601513,
    "project_name": "GitLab.org / gitter / webapp",
    "user": {
      "id": 892863,
      "name": "Eric Eastwood",
      "email": "contact@ericeastwood.com"
    },
    "commit": {
      "id": 58290853,
      "sha": "cf66af95eca3cc89b38cf3acfb13ee1251ea7dfb",
      "message": "Test webhook push event\n",
      "author_name": "Eric Eastwood",
      "author_email": "contact@ericeastwood.com",
      "author_url": "https://gitlab.com/MadLittleMods",
      "status": "running",
      "duration": null,
      "started_at": "2019-04-25 01:24:18 UTC",
      "finished_at": null
    },
    "repository": {
      "name": "webapp",
      "url": "git@gitlab.com:gitlab-org/gitter/webapp.git",
      "description": "[Gitter](https://gitter.im) is a community for software developers. This project is the main monolith web application.",
      "homepage": "https://gitlab.com/gitlab-org/gitter/webapp",
      "git_http_url": "https://gitlab.com/gitlab-org/gitter/webapp.git",
      "git_ssh_url": "git@gitlab.com:gitlab-org/gitter/webapp.git",
      "visibility_level": 20
    }
  }
}
