Run make mocks

43 jobs for update-mocks in 55 minutes and 18 seconds (queued for 1 second)
latest
Status Job ID Name Coverage
  Prebuild
passed #341259010
check feature flags docs

00:00:33

passed #341259007
clone test repo

00:01:08

passed #341259009
dep check

00:01:19

passed #341259006
docker
helper images

00:04:39

passed #341259008
gitlab-org
tests definitions

00:04:05

 
  Test
passed #341259012
code_quality

00:01:43

passed #341259023
docs lint

00:00:57

passed #341259035
git 1.7.1

00:01:59

passed #341259011
license_management

00:05:56

passed #341259013
docker
unit test 1/5

00:02:04

passed #341259014
docker
unit test 2/5

00:12:08

passed #341259015
docker
unit test 3/5

00:03:48

passed #341259016
docker
unit test 4/5

00:02:07

passed #341259017
docker
unit test 5/5

00:03:06

failed #341259018
docker allowed to fail
unit test with race 1/5

00:03:32

failed #341259019
docker allowed to fail
unit test with race 2/5

00:15:32

failed #341259020
docker allowed to fail
unit test with race 3/5

00:04:42

passed #341259021
docker
unit test with race 4/5

00:02:45

passed #341259022
docker
unit test with race 5/5

00:03:16

failed #341259024
shell windows-1803 allowed to fail
windows 1803 tests 1/3

00:16:49

failed #341259025
shell windows-1803 allowed to fail
windows 1803 tests 2/3

00:31:46

failed #341259026
shell windows-1803 allowed to fail
windows 1803 tests 3/3

00:06:35

failed #341259027
shell windows-1809 allowed to fail
windows 1809 tests 1/3

00:04:57

failed #341259030
shell windows-1809 allowed to fail
windows 1809 tests 2/3

00:23:05

failed #341259032
shell windows-1809 allowed to fail
windows 1809 tests 3/3

00:05:01

 
  Coverage
passed #341259039
check windows 1803 test failures

00:01:10

passed #341259040
check windows 1809 test failures

00:01:37

passed #341259037
race conditions detector

00:00:32

passed #341259036
test coverage report

00:01:25

65.3%
passed #341259038
test junit report

00:02:30

 
  Build
passed #341259041
gitlab-org
binaries darwin/386 darwin/amd64

00:03:54

passed #341259042
gitlab-org
binaries freebsd/386 freebsd/amd64 freebsd/arm

00:05:17

passed #341259043
gitlab-org
binaries linux/386 linux/amd64 linux/arm

00:04:50

passed #341259044
gitlab-org
binaries windows/386 windows/amd64

00:04:03

 
  Package
passed #341259045
gitlab-org
package-deb

00:02:14

passed #341259046
gitlab-org
package-rpm

00:02:06

 
  Release
passed #341259047
release
development S3

00:00:52

passed #341259048
docker
development docker images

00:03:51

passed #341259049
shell windows-1803
development servercore1803 helper docker image

00:08:46

passed #341259050
shell windows-1809
development servercore1809 helper docker image

00:03:09

passed #341259051
static QA

00:00:37

 
  Docs
manual #341259054
allowed to fail manual
review-docs-cleanup
manual #341259052
allowed to fail manual
review-docs-deploy
 
Name Stage Failure
failed
unit test with race 1/5 Test
coverage: 5.8% of statements
ok gitlab.com/gitlab-org/gitlab-runner/common 1.060s coverage: 5.8% of statements
Makefile:122: recipe for target 'parallel_test_execute' failed
make: *** [parallel_test_execute] Error 1
Uploading artifacts...
.cover/*: found 15 matching files
.testoutput/*: found 15 matching files

Uploading artifacts to coordinator... ok
id=341259018 responseStatus=201 Created token=x1XiFhH8
ERROR: Job failed: exit code 1
failed
unit test with race 3/5 Test
coverage: 51.4% of statements
ok gitlab.com/gitlab-org/gitlab-runner/helpers 1.032s coverage: 51.4% of statements
Makefile:122: recipe for target 'parallel_test_execute' failed
make: *** [parallel_test_execute] Error 1
Uploading artifacts...
.cover/*: found 15 matching files
.testoutput/*: found 15 matching files

Uploading artifacts to coordinator... ok
id=341259020 responseStatus=201 Created token=wBtXDLo-
ERROR: Job failed: exit code 1
failed
windows 1809 tests 1/3 Test
GO version:   go1.8.7
Built: 2019-02-22T08:01:13+0000
OS/Arch: windows/amd64
Uploading artifacts...
Runtime platform
arch=amd64 os=windows pid=6480 revision=4745a6f3 version=11.8.0
.testoutput/*: found 24 matching files

WARNING: Failed to load system CertPool:crypto/x509: system root pool is not available on Windows
Uploading artifacts to coordinator... ok
id=341259027 responseStatus=201 Created token=-xsyeVyg
ERROR: Job failed: exit status 1
failed
windows 1809 tests 3/3 Test
GO version:   go1.8.7
Built: 2019-02-22T08:01:13+0000
OS/Arch: windows/amd64
Uploading artifacts...
Runtime platform
arch=amd64 os=windows pid=7204 revision=4745a6f3 version=11.8.0
.testoutput/*: found 24 matching files

WARNING: Failed to load system CertPool:crypto/x509: system root pool is not available on Windows
Uploading artifacts to coordinator... ok
id=341259032 responseStatus=201 Created token=yzys-ZBq
ERROR: Job failed: exit status 1
failed
windows 1803 tests 3/3 Test
GO version:   go1.8.7
Built: 2019-02-22T08:01:13+0000
OS/Arch: windows/amd64
Uploading artifacts...
Runtime platform
arch=amd64 os=windows pid=33180 revision=4745a6f3 version=11.8.0
.testoutput/*: found 24 matching files

WARNING: Failed to load system CertPool:crypto/x509: system root pool is not available on Windows
Uploading artifacts to coordinator... ok
id=341259026 responseStatus=201 Created token=334vA9dx
ERROR: Job failed: exit status 1
failed
unit test with race 2/5 Test
coverage: 24.2% of statements
ok gitlab.com/gitlab-org/gitlab-runner/executors/docker/internal/volumes 1.061s coverage: 24.2% of statements
Makefile:122: recipe for target 'parallel_test_execute' failed
make: *** [parallel_test_execute] Error 1
Uploading artifacts...
.cover/*: found 15 matching files
.testoutput/*: found 15 matching files

Uploading artifacts to coordinator... ok
id=341259019 responseStatus=201 Created token=HLU1YPAD
ERROR: Job failed: exit code 1
failed
windows 1803 tests 1/3 Test
GO version:   go1.8.7
Built: 2019-02-22T08:01:13+0000
OS/Arch: windows/amd64
Uploading artifacts...
Runtime platform
arch=amd64 os=windows pid=32752 revision=4745a6f3 version=11.8.0
.testoutput/*: found 24 matching files

WARNING: Failed to load system CertPool:crypto/x509: system root pool is not available on Windows
Uploading artifacts to coordinator... ok
id=341259024 responseStatus=201 Created token=PaBXQm9i
ERROR: Job failed: exit status 1
failed
windows 1809 tests 2/3 Test
GO version:   go1.8.7
Built: 2019-02-22T08:01:13+0000
OS/Arch: windows/amd64
Uploading artifacts...
Runtime platform
arch=amd64 os=windows pid=6408 revision=4745a6f3 version=11.8.0
.testoutput/*: found 24 matching files

WARNING: Failed to load system CertPool:crypto/x509: system root pool is not available on Windows
Uploading artifacts to coordinator... ok
id=341259030 responseStatus=201 Created token=EB5dP1mL
ERROR: Job failed: exit status 1
failed
windows 1803 tests 2/3 Test
GO version:   go1.8.7
Built: 2019-02-22T08:01:13+0000
OS/Arch: windows/amd64
Uploading artifacts...
Runtime platform
arch=amd64 os=windows pid=31064 revision=4745a6f3 version=11.8.0
.testoutput/*: found 24 matching files

WARNING: Failed to load system CertPool:crypto/x509: system root pool is not available on Windows
Uploading artifacts to coordinator... ok
id=341259025 responseStatus=201 Created token=oTjByx3x
ERROR: Job failed: exit status 1