Update Git LFS to 2.8.0

Changelog: https://github.com/git-lfs/git-lfs/releases/tag/v2.8.0
43 jobs for update-git-lfs-version in 54 minutes and 31 seconds (queued for 3 seconds)
latest
Status Job ID Name Coverage
  Prebuild
passed #285689900
check feature flags docs

00:01:58

passed #285689895
clone test repo

00:01:25

passed #285689898
dep check

00:01:43

passed #285689891
docker
helper images

00:06:05

passed #285689897
gitlab-org
tests definitions

00:03:19

 
  Test
passed #285689904
code_quality

00:02:14

passed #285689925
docs lint

00:01:18

passed #285689939
git 1.7.1

00:02:22

passed #285689901
license_management

00:03:54

failed #285689908
docker
unit test 1/5

00:01:36

failed #285689910
docker
unit test 2/5

00:02:20

failed #285689912
docker
unit test 3/5

00:01:27

failed #285689913
docker
unit test 4/5

00:01:36

failed #285689915
docker
unit test 5/5

00:01:23

failed #285689917
docker allowed to fail
unit test with race 1/5

00:01:23

failed #285689918
docker allowed to fail
unit test with race 2/5

00:02:22

failed #285689919
docker allowed to fail
unit test with race 3/5

00:01:28

failed #285689921
docker allowed to fail
unit test with race 4/5

00:01:22

failed #285689923
docker allowed to fail
unit test with race 5/5

00:01:25

failed #285689927
shell windows-1803 allowed to fail
windows 1803 tests 1/3

00:32:04

failed #285689930
shell windows-1803 allowed to fail
windows 1803 tests 2/3

00:46:28

failed #285689933
shell windows-1803 allowed to fail
windows 1803 tests 3/3

00:18:36

failed #285689935
shell windows-1809 allowed to fail
windows 1809 tests 1/3

00:24:14

failed #285689936
shell windows-1809 allowed to fail
windows 1809 tests 2/3

00:37:36

failed #285689938
shell windows-1809 allowed to fail
windows 1809 tests 3/3

00:12:13

 
  Coverage
passed #285689945
check windows 1803 test failures

00:01:54

passed #285689946
check windows 1809 test failures

00:01:22

passed #285689942
race conditions detector

00:01:11

failed #285689941
test coverage report

00:01:35

failed #285689943
test junit report

00:01:26

 
  Build
skipped #285689947
gitlab-org
binaries darwin/386 darwin/amd64
skipped #285689949
gitlab-org
binaries freebsd/386 freebsd/amd64 freebsd/arm
skipped #285689950
gitlab-org
binaries linux/386 linux/amd64 linux/arm
skipped #285689953
gitlab-org
binaries windows/386 windows/amd64
 
  Package
skipped #285689954
gitlab-org
package-deb
skipped #285689955
gitlab-org
package-rpm
 
  Release
skipped #285689959
release
development S3
skipped #285689969
docker
development docker images
skipped #285689971
shell windows-1803
development servercore1803 helper docker image
skipped #285689974
shell windows-1809
development servercore1809 helper docker image
skipped #285689978
static QA
 
  Docs
skipped #285689988
allowed to fail manual
review-docs-cleanup
skipped #285689982
allowed to fail manual
review-docs-deploy
 
Name Stage Failure
failed
unit test 1/5 Test
2019-09-02 15:04:42 (35.8 MB/s) - ‘/tmp/git-lfs.tar.gz’ saved [4067327/4067327]

/tmp/git-lfs.tar.gz: FAILED
sha256sum: WARNING: 1 computed checksum did NOT match
Uploading artifacts...
WARNING: .cover/*: no matching files
WARNING: .testoutput/*: no matching files
ERROR: No files to upload
ERROR: Job failed: exit code 1
failed
windows 1809 tests 1/3 Test
GO version:   go1.8.7
Built: 2019-02-22T08:01:13+0000
OS/Arch: windows/amd64
Uploading artifacts...
Runtime platform
arch=amd64 os=windows pid=8068 revision=4745a6f3 version=11.8.0
.testoutput/*: found 24 matching files

WARNING: Failed to load system CertPool:crypto/x509: system root pool is not available on Windows
Uploading artifacts to coordinator... ok
id=285689935 responseStatus=201 Created token=ExzfKKNF
ERROR: Job failed: exit status 1
failed
unit test 2/5 Test
2019-09-02 15:04:37 (32.7 MB/s) - ‘/tmp/git-lfs.tar.gz’ saved [4067327/4067327]

/tmp/git-lfs.tar.gz: FAILED
sha256sum: WARNING: 1 computed checksum did NOT match
Uploading artifacts...
WARNING: .cover/*: no matching files
WARNING: .testoutput/*: no matching files
ERROR: No files to upload
ERROR: Job failed: exit code 1
failed
unit test with race 2/5 Test
2019-09-02 15:04:42 (29.8 MB/s) - ‘/tmp/git-lfs.tar.gz’ saved [4067327/4067327]

/tmp/git-lfs.tar.gz: FAILED
sha256sum: WARNING: 1 computed checksum did NOT match
Uploading artifacts...
WARNING: .cover/*: no matching files
WARNING: .testoutput/*: no matching files
ERROR: No files to upload
ERROR: Job failed: exit code 1
failed
unit test with race 1/5 Test
2019-09-02 15:04:37 (27.8 MB/s) - ‘/tmp/git-lfs.tar.gz’ saved [4067327/4067327]

/tmp/git-lfs.tar.gz: FAILED
sha256sum: WARNING: 1 computed checksum did NOT match
Uploading artifacts...
WARNING: .cover/*: no matching files
WARNING: .testoutput/*: no matching files
ERROR: No files to upload
ERROR: Job failed: exit code 1
failed
unit test 5/5 Test
2019-09-02 15:04:37 (35.2 MB/s) - ‘/tmp/git-lfs.tar.gz’ saved [4067327/4067327]

/tmp/git-lfs.tar.gz: FAILED
sha256sum: WARNING: 1 computed checksum did NOT match
Uploading artifacts...
WARNING: .cover/*: no matching files
WARNING: .testoutput/*: no matching files
ERROR: No files to upload
ERROR: Job failed: exit code 1
failed
unit test with race 4/5 Test
2019-09-02 15:04:39 (35.0 MB/s) - ‘/tmp/git-lfs.tar.gz’ saved [4067327/4067327]

sha256sum: WARNING: 1 computed checksum did NOT match
/tmp/git-lfs.tar.gz: FAILED
Uploading artifacts...
WARNING: .cover/*: no matching files
WARNING: .testoutput/*: no matching files
ERROR: No files to upload
ERROR: Job failed: exit code 1
failed
unit test 4/5 Test
2019-09-02 15:04:47 (34.6 MB/s) - ‘/tmp/git-lfs.tar.gz’ saved [4067327/4067327]

sha256sum: WARNING: 1 computed checksum did NOT match
/tmp/git-lfs.tar.gz: FAILED
Uploading artifacts...
WARNING: .cover/*: no matching files
WARNING: .testoutput/*: no matching files
ERROR: No files to upload
ERROR: Job failed: exit code 1
failed
unit test with race 5/5 Test
2019-09-02 15:04:40 (29.5 MB/s) - ‘/tmp/git-lfs.tar.gz’ saved [4067327/4067327]

/tmp/git-lfs.tar.gz: FAILED
sha256sum: WARNING: 1 computed checksum did NOT match
Uploading artifacts...
WARNING: .cover/*: no matching files
WARNING: .testoutput/*: no matching files
ERROR: No files to upload
ERROR: Job failed: exit code 1
failed
unit test 3/5 Test
2019-09-02 15:04:41 (33.1 MB/s) - ‘/tmp/git-lfs.tar.gz’ saved [4067327/4067327]

/tmp/git-lfs.tar.gz: FAILED
sha256sum: WARNING: 1 computed checksum did NOT match
Uploading artifacts...
WARNING: .cover/*: no matching files
WARNING: .testoutput/*: no matching files
ERROR: No files to upload
ERROR: Job failed: exit code 1
failed
unit test with race 3/5 Test
2019-09-02 15:04:43 (36.4 MB/s) - ‘/tmp/git-lfs.tar.gz’ saved [4067327/4067327]

sha256sum: WARNING: 1 computed checksum did NOT match
/tmp/git-lfs.tar.gz: FAILED
Uploading artifacts...
WARNING: .cover/*: no matching files
WARNING: .testoutput/*: no matching files
ERROR: No files to upload
ERROR: Job failed: exit code 1
failed
windows 1809 tests 3/3 Test
GO version:   go1.8.7
Built: 2019-02-22T08:01:13+0000
OS/Arch: windows/amd64
Uploading artifacts...
Runtime platform
arch=amd64 os=windows pid=7384 revision=4745a6f3 version=11.8.0
.testoutput/*: found 23 matching files

WARNING: Failed to load system CertPool:crypto/x509: system root pool is not available on Windows
Uploading artifacts to coordinator... ok
id=285689938 responseStatus=201 Created token=y2MVsRo5
ERROR: Job failed: exit status 1
failed
windows 1803 tests 3/3 Test
GO version:   go1.8.7
Built: 2019-02-22T08:01:13+0000
OS/Arch: windows/amd64
Uploading artifacts...
Runtime platform
arch=amd64 os=windows pid=17936 revision=4745a6f3 version=11.8.0
.testoutput/*: found 23 matching files

WARNING: Failed to load system CertPool:crypto/x509: system root pool is not available on Windows
Uploading artifacts to coordinator... ok
id=285689933 responseStatus=201 Created token=FksGcvsg
ERROR: Job failed: exit status 1
failed
windows 1803 tests 1/3 Test
GO version:   go1.8.7
Built: 2019-02-22T08:01:13+0000
OS/Arch: windows/amd64
Uploading artifacts...
Runtime platform
arch=amd64 os=windows pid=21900 revision=4745a6f3 version=11.8.0
.testoutput/*: found 24 matching files

WARNING: Failed to load system CertPool:crypto/x509: system root pool is not available on Windows
Uploading artifacts to coordinator... ok
id=285689927 responseStatus=201 Created token=rxCDVbJz
ERROR: Job failed: exit status 1
failed
windows 1809 tests 2/3 Test
GO version:   go1.8.7
Built: 2019-02-22T08:01:13+0000
OS/Arch: windows/amd64
Uploading artifacts...
Runtime platform
arch=amd64 os=windows pid=6668 revision=4745a6f3 version=11.8.0
.testoutput/*: found 24 matching files

WARNING: Failed to load system CertPool:crypto/x509: system root pool is not available on Windows
Uploading artifacts to coordinator... ok
id=285689936 responseStatus=201 Created token=2S2GzYsV
ERROR: Job failed: exit status 1
failed
windows 1803 tests 2/3 Test
GO version:   go1.8.7
Built: 2019-02-22T08:01:13+0000
OS/Arch: windows/amd64
Uploading artifacts...
Runtime platform
arch=amd64 os=windows pid=6252 revision=4745a6f3 version=11.8.0
.testoutput/*: found 24 matching files

WARNING: Failed to load system CertPool:crypto/x509: system root pool is not available on Windows
Uploading artifacts to coordinator... ok
id=285689930 responseStatus=201 Created token=CZyrXNNT
ERROR: Job failed: exit status 1
failed
test coverage report Coverage
$ source ci/touch_make_dependencies
$ make parallel_test_coverage_report
mkdir -p /builds/gitlab-org/gitlab-runner/.gopath/src/gitlab.com/gitlab-org
ln -s ../../../.. /builds/gitlab-org/gitlab-runner/.gopath/src/gitlab.com/gitlab-org/gitlab-runner
# Preparing coverage report
grep: .cover/*.count.cover.txt: No such file or directory
Makefile:125: recipe for target 'parallel_test_coverage_report' failed
make: *** [parallel_test_coverage_report] Error 2
ERROR: Job failed: exit code 1
failed
test junit report Coverage
ln -s ../../../.. /builds/gitlab-org/gitlab-runner/.gopath/src/gitlab.com/gitlab-org/gitlab-runner
# Preparing jUnit test report
cat: .testoutput/*.regular.output.txt: No such file or directory
Makefile:129: recipe for target 'parallel_test_junit_report' failed
make: *** [parallel_test_junit_report] Error 1
Uploading artifacts...
WARNING: out/junit/report.xml: no matching files
ERROR: No files to upload
ERROR: Job failed: exit code 1