Add CI job checking changes in Windows tests failures

51 jobs for track-windows-test-failures in 79 minutes and 39 seconds (queued for 13 seconds)
Status Job ID Name Coverage
  Prebuild
passed #254294890
check feature flags docs

00:02:22

passed #254294882
clone test repo

00:01:07

passed #254294888
dep check

00:02:22

passed #254294881
docker
helper images

00:05:25

manual #254294883
allowed to fail manual
review-docs-deploy
passed #254294886
gitlab-org
tests definitions

00:03:25

 
  Test
passed #254294892
code_quality

00:01:35

passed #254294931
docs lint

00:01:19

passed #254294940
git 1.7.1

00:02:19

passed #254294891
allowed to fail
license_management

00:04:01

passed #254294894
docker
unit test 1/5

00:10:10

passed #254294896
docker
unit test 2/5

00:15:35

passed #254294898
docker
unit test 3/5

00:13:10

passed #254294900
docker
unit test 4/5

00:04:52

passed #254294904
docker
unit test 5/5

00:05:35

failed #254294907
docker allowed to fail
unit test with race 1/5

00:09:47

failed #254294909
docker allowed to fail
unit test with race 2/5

00:17:02

failed #254294911
docker allowed to fail
unit test with race 3/5

00:11:25

passed #254294918
docker allowed to fail
unit test with race 4/5

00:04:22

passed #254294924
docker allowed to fail
unit test with race 5/5

00:06:40

failed #255395156
windows-1803 shell allowed to fail
windows 1803 tests 1/3

00:26:51

failed #255395167
windows-1803 shell allowed to fail
windows 1803 tests 2/3

00:41:09

failed #255395197
windows-1803 shell allowed to fail
windows 1803 tests 3/3

00:14:55

failed #255395242
windows-1809 shell allowed to fail
windows 1809 tests 1/3

00:22:11

failed #255395539
windows-1809 shell allowed to fail
windows 1809 tests 2/3

00:35:59

failed #255395546
windows-1809 shell allowed to fail
windows 1809 tests 3/3

00:11:58

failed #254294933
shell windows-1803 allowed to fail
windows 1803 tests 1/3

00:26:10

failed #254294934
shell windows-1803 allowed to fail
windows 1803 tests 2/3

00:40:32

failed #254294935
shell windows-1803 allowed to fail
windows 1803 tests 3/3

00:14:26

failed #254294936
shell windows-1809 allowed to fail
windows 1809 tests 1/3

00:22:37

failed #254294938
shell windows-1809 allowed to fail
windows 1809 tests 2/3

00:36:34

failed #254294939
shell windows-1809 allowed to fail
windows 1809 tests 3/3

00:11:40

 
  Coverage
passed #256254625
check windows 1803 test failures

00:02:08

passed #256254639
check windows 1809 test failures

00:01:30

passed #254294942
race conditions detector

00:00:54

passed #254294941
test coverage report

00:00:57

63.4%
passed #254294945
test junit report

00:01:17

passed #254294947
check windows 1803 test failures

00:01:01

passed #254294948
check windows 1809 test failures

00:01:04

 
  Build
passed #254294950
gitlab-org
binaries darwin/386 darwin/amd64

00:04:06

passed #254294951
gitlab-org
binaries freebsd/386 freebsd/amd64 freebsd/arm

00:05:09

passed #254294952
gitlab-org
binaries linux/386 linux/amd64 linux/arm

00:05:01

passed #254294953
gitlab-org
binaries windows/386 windows/amd64

00:03:59

 
  Package
passed #254294955
gitlab-org
package-deb

00:02:06

passed #254294957
gitlab-org
package-rpm

00:02:12

 
  Release
passed #254294960
release
development S3

00:01:08

passed #254294966
docker
development docker images

00:03:11

passed #254294968
shell windows-1803
development servercore1803 helper docker image

00:04:42

passed #254294970
shell windows-1809
development servercore1809 helper docker image

00:02:04

passed #254294974
static QA

00:00:34

 
  Cleanup
manual #254294976
allowed to fail manual
review-docs-cleanup
 
Name Stage Failure
failed
windows 1803 tests 2/3 Test
GO version:   go1.8.7
Built: 2019-02-22T08:01:13+0000
OS/Arch: windows/amd64
Uploading artifacts...
Runtime platform
arch=amd64 os=windows pid=13060 revision=4745a6f3 version=11.8.0
.testoutput/*: found 23 matching files

WARNING: Failed to load system CertPool:crypto/x509: system root pool is not available on Windows
Uploading artifacts to coordinator... ok
id=255395167 responseStatus=201 Created token=ttcLaq_W
ERROR: Job failed: exit status 1
failed
windows 1809 tests 2/3 Test
GO version:   go1.8.7
Built: 2019-02-22T08:01:13+0000
OS/Arch: windows/amd64
Uploading artifacts...
Runtime platform
arch=amd64 os=windows pid=6952 revision=4745a6f3 version=11.8.0
.testoutput/*: found 23 matching files

WARNING: Failed to load system CertPool:crypto/x509: system root pool is not available on Windows
Uploading artifacts to coordinator... ok
id=255395539 responseStatus=201 Created token=EA1mxC1H
ERROR: Job failed: exit status 1
failed
windows 1803 tests 1/3 Test
GO version:   go1.8.7
Built: 2019-02-22T08:01:13+0000
OS/Arch: windows/amd64
Uploading artifacts...
Runtime platform
arch=amd64 os=windows pid=7092 revision=4745a6f3 version=11.8.0
.testoutput/*: found 23 matching files

WARNING: Failed to load system CertPool:crypto/x509: system root pool is not available on Windows
Uploading artifacts to coordinator... ok
id=255395156 responseStatus=201 Created token=9N3VRCtH
ERROR: Job failed: exit status 1
failed
windows 1809 tests 1/3 Test
GO version:   go1.8.7
Built: 2019-02-22T08:01:13+0000
OS/Arch: windows/amd64
Uploading artifacts...
Runtime platform
arch=amd64 os=windows pid=1104 revision=4745a6f3 version=11.8.0
.testoutput/*: found 23 matching files

WARNING: Failed to load system CertPool:crypto/x509: system root pool is not available on Windows
Uploading artifacts to coordinator... ok
id=255395242 responseStatus=201 Created token=FnfSHuv6
ERROR: Job failed: exit status 1
failed
windows 1803 tests 3/3 Test
GO version:   go1.8.7
Built: 2019-02-22T08:01:13+0000
OS/Arch: windows/amd64
Uploading artifacts...
Runtime platform
arch=amd64 os=windows pid=12772 revision=4745a6f3 version=11.8.0
.testoutput/*: found 23 matching files

WARNING: Failed to load system CertPool:crypto/x509: system root pool is not available on Windows
Uploading artifacts to coordinator... ok
id=255395197 responseStatus=201 Created token=nz-qm--2
ERROR: Job failed: exit status 1
failed
windows 1809 tests 3/3 Test
GO version:   go1.8.7
Built: 2019-02-22T08:01:13+0000
OS/Arch: windows/amd64
Uploading artifacts...
Runtime platform
arch=amd64 os=windows pid=6008 revision=4745a6f3 version=11.8.0
.testoutput/*: found 23 matching files

WARNING: Failed to load system CertPool:crypto/x509: system root pool is not available on Windows
Uploading artifacts to coordinator... ok
id=255395546 responseStatus=201 Created token=zNsqy2_Z
ERROR: Job failed: exit status 1
failed
unit test with race 2/5 Test
coverage: 47.6% of statements
ok gitlab.com/gitlab-org/gitlab-runner/executors/docker/internal/volumes 1.127s
Makefile:121: recipe for target 'parallel_test_execute' failed
make: *** [parallel_test_execute] Error 1
Uploading artifacts...
.cover/*: found 14 matching files
.testoutput/*: found 14 matching files

Uploading artifacts to coordinator... ok
id=254294909 responseStatus=201 Created token=vHykMgej
ERROR: Job failed: exit code 1
failed
unit test with race 3/5 Test
coverage: 73.7% of statements
ok gitlab.com/gitlab-org/gitlab-runner/executors/ssh 1.081s
make: *** [parallel_test_execute] Error 1
Makefile:121: recipe for target 'parallel_test_execute' failed
Uploading artifacts...
.cover/*: found 14 matching files
.testoutput/*: found 14 matching files

Uploading artifacts to coordinator... ok
id=254294911 responseStatus=201 Created token=WcuR2N4L
ERROR: Job failed: exit code 1
failed
unit test with race 1/5 Test
coverage: 6.0% of statements
ok gitlab.com/gitlab-org/gitlab-runner/common 1.065s
Makefile:121: recipe for target 'parallel_test_execute' failed
make: *** [parallel_test_execute] Error 1
Uploading artifacts...
.cover/*: found 14 matching files
.testoutput/*: found 14 matching files

Uploading artifacts to coordinator... ok
id=254294907 responseStatus=201 Created token=eyCmCp5r
ERROR: Job failed: exit code 1