Move debug server to it's own package

42 jobs for debug-server-refactorization in 95 minutes and 27 seconds (queued for 2 seconds)
Status Job ID Name Coverage
  Prebuild
passed #253732868
check feature flags docs

00:01:17

passed #253732864
clone test repo

00:00:59

passed #253732867
dep check

00:01:37

passed #253732863
docker
helper images

00:05:36

manual #253732865
allowed to fail manual
review-docs-deploy
passed #253732866
gitlab-org
tests definitions

00:03:51

 
  Test
passed #253732870
code_quality

00:01:34

passed #253732884
docs lint

00:00:59

passed #253732892
git 1.7.1

00:02:01

passed #253732869
allowed to fail
license_management

00:03:16

passed #253732872
docker
unit test 1/5

00:11:12

passed #253732874
docker
unit test 2/5

00:16:11

passed #253835416
docker
unit test 3/5

00:11:45

passed #253732877
docker
unit test 4/5

00:05:07

passed #253732878
docker
unit test 5/5

00:06:15

failed #253732879
docker allowed to fail
unit test with race 1/5

00:13:43

failed #253732880
docker allowed to fail
unit test with race 2/5

00:19:38

failed #253732881
docker allowed to fail
unit test with race 3/5

00:13:55

passed #253732882
docker allowed to fail
unit test with race 4/5

00:05:00

passed #253732883
docker allowed to fail
unit test with race 5/5

00:07:16

failed #253732885
shell windows-1803 allowed to fail
windows 1803 tests 1/3

00:39:52

failed #253732886
shell windows-1803 allowed to fail
windows 1803 tests 2/3

00:47:30

failed #253732887
shell windows-1803 allowed to fail
windows 1803 tests 3/3

00:09:14

failed #253732888
shell windows-1809 allowed to fail
windows 1809 tests 1/3

00:33:48

failed #253732890
shell windows-1809 allowed to fail
windows 1809 tests 2/3

00:42:00

failed #253732891
shell windows-1809 allowed to fail
windows 1809 tests 3/3

00:08:12

failed #253732876
docker
unit test 3/5

00:12:19

 
  Coverage
passed #253732894
race conditions detector

00:01:02

passed #253732893
test coverage report

00:00:51

64.7%
passed #253732895
test junit report

00:01:57

 
  Build
passed #253732896
gitlab-org
binaries darwin/386 darwin/amd64

00:03:56

passed #253732897
gitlab-org
binaries freebsd/386 freebsd/amd64 freebsd/arm

00:05:17

passed #253732898
gitlab-org
binaries linux/386 linux/amd64 linux/arm

00:05:14

passed #253732899
gitlab-org
binaries windows/386 windows/amd64

00:03:56

 
  Package
passed #253732900
gitlab-org
package-deb

00:02:03

passed #253732901
gitlab-org
package-rpm

00:01:58

 
  Release
passed #253732902
release
development S3

00:01:05

passed #253732903
docker
development docker images

00:03:16

passed #253732904
shell windows-1803
development servercore1803 helper docker image

00:04:46

passed #253732905
shell windows-1809
development servercore1809 helper docker image

00:02:14

failed #253732906
static QA

00:00:32

 
  Cleanup
skipped #253732907
allowed to fail manual
review-docs-cleanup
 
Name Stage Failure
failed
static QA Release
    "categories": [
"Style"
],
"engine_name": "golint",
"fingerprint": "14af87ae240ad7698536f60843132483",
"severity": "minor"
}
]
ERROR: Job failed: exit code 1
failed
windows 1803 tests 2/3 Test
gitlab.com/gitlab-org/gitlab-runner/executors/shell-2

gitlab.com/gitlab-org/gitlab-runner/executors/shell-3
gitlab.com/gitlab-org/gitlab-runner/helpers/archives-0
gitlab.com/gitlab-org/gitlab-runner/helpers/archives-1


Running after script...
$ if (Test-Path $PKG_BUILD_DIR) { $(Get-Item $PKG_BUILD_DIR).Delete() }
ERROR: Job failed: exit status 1
failed
windows 1809 tests 2/3 Test
gitlab.com/gitlab-org/gitlab-runner/executors/shell-2

gitlab.com/gitlab-org/gitlab-runner/executors/shell-3
gitlab.com/gitlab-org/gitlab-runner/helpers/archives-0
gitlab.com/gitlab-org/gitlab-runner/helpers/archives-1


Running after script...
$ if (Test-Path $PKG_BUILD_DIR) { $(Get-Item $PKG_BUILD_DIR).Delete() }
ERROR: Job failed: exit status 1
failed
windows 1803 tests 3/3 Test
ok  	gitlab.com/gitlab-org/gitlab-runner/shells	1.570s

WARNING: Failed packages:
WARNING: gitlab.com/gitlab-org/gitlab-runner/helpers/docker-0


Running after script...
$ if (Test-Path $PKG_BUILD_DIR) { $(Get-Item $PKG_BUILD_DIR).Delete() }
ERROR: Job failed: exit status 1
failed
windows 1803 tests 1/3 Test

WARNING: Failed packages:
WARNING: gitlab.com/gitlab-org/gitlab-runner/common-2
gitlab.com/gitlab-org/gitlab-runner/executors/docker-2


Running after script...
$ if (Test-Path $PKG_BUILD_DIR) { $(Get-Item $PKG_BUILD_DIR).Delete() }
ERROR: Job failed: exit status 1
failed
windows 1809 tests 3/3 Test
ok  	gitlab.com/gitlab-org/gitlab-runner/shells	0.589s

WARNING: Failed packages:
WARNING: gitlab.com/gitlab-org/gitlab-runner/helpers/docker-0


Running after script...
$ if (Test-Path $PKG_BUILD_DIR) { $(Get-Item $PKG_BUILD_DIR).Delete() }
ERROR: Job failed: exit status 1
failed
windows 1809 tests 1/3 Test

WARNING: Failed packages:
WARNING: gitlab.com/gitlab-org/gitlab-runner/common-2
gitlab.com/gitlab-org/gitlab-runner/executors/docker-2


Running after script...
$ if (Test-Path $PKG_BUILD_DIR) { $(Get-Item $PKG_BUILD_DIR).Delete() }
ERROR: Job failed: exit status 1
failed
unit test with race 2/5 Test
coverage: 64.2% of statements
ok gitlab.com/gitlab-org/gitlab-runner/executors/docker/internal/volumes/parser 1.035s
Makefile:121: recipe for target 'parallel_test_execute' failed
make: *** [parallel_test_execute] Error 1
Uploading artifacts...
.cover/*: found 15 matching files
.testoutput/*: found 15 matching files

Uploading artifacts to coordinator... ok
id=253732880 responseStatus=201 Created token=jM-cJMXb
ERROR: Job failed: exit code 1
failed
unit test with race 3/5 Test
coverage: 52.0% of statements
ok gitlab.com/gitlab-org/gitlab-runner/helpers/archives 1.050s
Makefile:121: recipe for target 'parallel_test_execute' failed
make: *** [parallel_test_execute] Error 1
Uploading artifacts...
.cover/*: found 15 matching files
.testoutput/*: found 15 matching files

Uploading artifacts to coordinator... ok
id=253732881 responseStatus=201 Created token=xRXzqm3p
ERROR: Job failed: exit code 1
failed
unit test with race 1/5 Test
coverage: 2.6% of statements
ok gitlab.com/gitlab-org/gitlab-runner/common 1.062s
Makefile:121: recipe for target 'parallel_test_execute' failed
make: *** [parallel_test_execute] Error 1
Uploading artifacts...
.cover/*: found 15 matching files
.testoutput/*: found 15 matching files

Uploading artifacts to coordinator... ok
id=253732879 responseStatus=201 Created token=Lyy-cjx8
ERROR: Job failed: exit code 1