Update Docker Machine to 0.16.1

The docker machine that we bundle with Docker is 0.14.0 which is two
versions old.
44 jobs for update-docker-machine in 84 minutes and 9 seconds (queued for 2 seconds)
latest
Status Job ID Name Coverage
  Prebuild
passed #243074021
check feature flags docs

00:01:47

passed #243074017
clone test repo

00:02:28

passed #243074020
dep check

00:01:46

passed #243074016
docker
helper images

00:05:39

manual #243074018
allowed to fail manual
review-docs-deploy
passed #243074019
gitlab-org
tests definitions

00:03:28

 
  Test
passed #243074023
code_quality

00:02:21

passed #243074035
docs lint

00:01:30

passed #243291262
git 1.7.1

00:02:45

passed #243074022
allowed to fail
license_management

00:05:29

passed #243074024
docker
unit test 1/5

00:10:10

passed #243074025
docker
unit test 2/5

00:19:44

passed #243291241
docker
unit test 3/5

00:09:38

passed #243074027
docker
unit test 4/5

00:05:08

passed #243074028
docker
unit test 5/5

00:06:13

failed #243074029
docker allowed to fail
unit test with race 1/5

00:11:13

failed #243074030
docker allowed to fail
unit test with race 2/5

00:21:04

failed #243074031
docker allowed to fail
unit test with race 3/5

00:17:32

passed #243074032
docker allowed to fail
unit test with race 4/5

00:06:14

passed #243074033
docker allowed to fail
unit test with race 5/5

00:06:53

failed #243074036
shell windows-1803 allowed to fail
windows 1803 tests 1/3

00:22:55

failed #243074037
shell windows-1803 allowed to fail
windows 1803 tests 2/3

00:42:12

failed #243074038
shell windows-1803 allowed to fail
windows 1803 tests 3/3

00:15:04

failed #243074039
shell windows-1809 allowed to fail
windows 1809 tests 1/3

00:20:18

failed #243074040
shell windows-1809 allowed to fail
windows 1809 tests 2/3

00:42:23

failed #243074042
shell windows-1809 allowed to fail
windows 1809 tests 3/3

00:13:26

failed #243092295
git 1.7.1

00:05:36

failed #243074044
git 1.7.1

00:06:11

failed #243074026
docker
unit test 3/5

00:15:35

 
  Coverage
passed #243074046
race conditions detector

00:13:54

passed #243074045
test coverage report

00:04:45

62.5%
passed #243074047
test junit report

00:03:40

 
  Build
passed #243074048
gitlab-org
binaries darwin/386 darwin/amd64

00:04:04

passed #243074049
gitlab-org
binaries freebsd/386 freebsd/amd64 freebsd/arm

00:05:23

passed #243074050
gitlab-org
binaries linux/386 linux/amd64 linux/arm

00:05:08

passed #243074051
gitlab-org
binaries windows/386 windows/amd64

00:04:13

 
  Package
passed #243074052
gitlab-org
package-deb

00:02:09

passed #243074053
gitlab-org
package-rpm

00:01:39

 
  Release
passed #243074054
release
development S3

00:02:07

passed #243074055
docker
development docker images

00:03:40

passed #243074056
shell windows-1803
development servercore1803 helper docker image

00:04:10

passed #243074057
shell windows-1809
development servercore1809 helper docker image

00:02:07

passed #243074058
static QA

00:00:37

 
  Cleanup
manual #243074059
allowed to fail manual
review-docs-cleanup
 
Name Stage Failure
failed
windows 1809 tests 2/3 Test
gitlab.com/gitlab-org/gitlab-runner/executors/shell-2

gitlab.com/gitlab-org/gitlab-runner/executors/shell-3
gitlab.com/gitlab-org/gitlab-runner/helpers/archives-0
gitlab.com/gitlab-org/gitlab-runner/helpers/archives-1


Running after script...
$ if (Test-Path $PKG_BUILD_DIR) { $(Get-Item $PKG_BUILD_DIR).Delete() }
ERROR: Job failed: exit status 1
failed
windows 1803 tests 2/3 Test
gitlab.com/gitlab-org/gitlab-runner/executors/shell-2

gitlab.com/gitlab-org/gitlab-runner/executors/shell-3
gitlab.com/gitlab-org/gitlab-runner/helpers/archives-0
gitlab.com/gitlab-org/gitlab-runner/helpers/archives-1


Running after script...
$ if (Test-Path $PKG_BUILD_DIR) { $(Get-Item $PKG_BUILD_DIR).Delete() }
ERROR: Job failed: exit status 1
failed
unit test with race 2/5 Test
exit status 1
FAIL gitlab.com/gitlab-org/gitlab-runner/executors/docker/machine 0.111s
Makefile:134: recipe for target 'parallel_test_execute' failed
make: *** [parallel_test_execute] Error 1
Uploading artifacts...
.cover/*: found 14 matching files
.testoutput/*: found 14 matching files

Uploading artifacts to coordinator... ok
id=243074030 responseStatus=201 Created token=yxxCx7No
ERROR: Job failed: exit code 1
failed
unit test with race 3/5 Test
coverage: 62.4% of statements
ok gitlab.com/gitlab-org/gitlab-runner/helpers/archives 1.037s
Makefile:134: recipe for target 'parallel_test_execute' failed
make: *** [parallel_test_execute] Error 1
Uploading artifacts...
.cover/*: found 14 matching files
.testoutput/*: found 14 matching files

Uploading artifacts to coordinator... ok
id=243074031 responseStatus=201 Created token=_mSDeNYH
ERROR: Job failed: exit code 1
failed
windows 1803 tests 1/3 Test
gitlab.com/gitlab-org/gitlab-runner/executors/docker-2

gitlab.com/gitlab-org/gitlab-runner/executors/docker-4
gitlab.com/gitlab-org/gitlab-runner/executors/docker-5
gitlab.com/gitlab-org/gitlab-runner/executors/docker-6


Running after script...
$ if (Test-Path $PKG_BUILD_DIR) { $(Get-Item $PKG_BUILD_DIR).Delete() }
ERROR: Job failed: exit status 1
failed
unit test with race 1/5 Test
coverage: 6.0% of statements
ok gitlab.com/gitlab-org/gitlab-runner/common 1.063s
Makefile:134: recipe for target 'parallel_test_execute' failed
make: *** [parallel_test_execute] Error 1
Uploading artifacts...
.cover/*: found 14 matching files
.testoutput/*: found 14 matching files

Uploading artifacts to coordinator... ok
id=243074029 responseStatus=201 Created token=ug6XyD-g
ERROR: Job failed: exit code 1
failed
windows 1809 tests 1/3 Test
gitlab.com/gitlab-org/gitlab-runner/executors/docker-2

gitlab.com/gitlab-org/gitlab-runner/executors/docker-4
gitlab.com/gitlab-org/gitlab-runner/executors/docker-5
gitlab.com/gitlab-org/gitlab-runner/executors/docker-6


Running after script...
$ if (Test-Path $PKG_BUILD_DIR) { $(Get-Item $PKG_BUILD_DIR).Delete() }
ERROR: Job failed: exit status 1
failed
windows 1803 tests 3/3 Test
ok  	gitlab.com/gitlab-org/gitlab-runner/shells	7.861s

WARNING: Failed packages:
WARNING: gitlab.com/gitlab-org/gitlab-runner/helpers/docker-0


Running after script...
$ if (Test-Path $PKG_BUILD_DIR) { $(Get-Item $PKG_BUILD_DIR).Delete() }
ERROR: Job failed: exit status 1
failed
windows 1809 tests 3/3 Test
ok  	gitlab.com/gitlab-org/gitlab-runner/shells	8.667s

WARNING: Failed packages:
WARNING: gitlab.com/gitlab-org/gitlab-runner/helpers/docker-0


Running after script...
$ if (Test-Path $PKG_BUILD_DIR) { $(Get-Item $PKG_BUILD_DIR).Delete() }
ERROR: Job failed: exit status 1