Print correlation_id for GitLab requests

Log the `X-Request-Id` better known as `correlation_id` when we get a
response from GitLab coordinator. This will allow administrators use the
correlation_id and use distributed tracing to find out the strack trace
in rails, and other applications involved. More information can be found
in
https://docs.gitlab.com/ee/development/distributed_tracing.html#using-jaeger-in-the-gitlab-development-kit,
this can also be used to filter in sentry.
41 jobs for add-correlation-id in 59 minutes and 54 seconds (queued for 6 seconds)
latest
Status Job ID Name Coverage
  Prebuild
passed #238838589
check feature flags docs

00:01:07

passed #238838585
clone test repo

00:01:06

passed #238838588
dep check

00:01:30

passed #238838584
docker
helper images

00:04:57

manual #238838586
allowed to fail manual
review-docs-deploy
passed #238838587
gitlab-org
tests definitions

00:03:32

 
  Test
passed #238838592
code_quality

00:01:26

passed #238838607
docs lint

00:01:18

passed #238838615
git 1.7.1

00:02:22

passed #238838591
allowed to fail
license_management

00:05:19

passed #238838593
docker
unit test 1/5

00:08:26

passed #238838594
docker
unit test 2/5

00:12:30

passed #238838595
docker
unit test 3/5

00:08:53

passed #238838597
docker
unit test 4/5

00:03:40

passed #238838599
docker
unit test 5/5

00:04:36

failed #238838601
docker allowed to fail
unit test with race 1/5

00:10:48

failed #238838603
docker allowed to fail
unit test with race 2/5

00:15:30

failed #238838604
docker allowed to fail
unit test with race 3/5

00:10:50

passed #238838605
docker allowed to fail
unit test with race 4/5

00:03:53

passed #238838606
docker allowed to fail
unit test with race 5/5

00:05:33

failed #238838608
shell windows-1803 allowed to fail
windows 1803 tests 1/3

00:23:24

failed #238838609
shell windows-1803 allowed to fail
windows 1803 tests 2/3

00:38:51

failed #238838610
shell windows-1803 allowed to fail
windows 1803 tests 3/3

00:15:21

failed #238838611
shell windows-1809 allowed to fail
windows 1809 tests 1/3

00:19:37

failed #238838613
shell windows-1809 allowed to fail
windows 1809 tests 2/3

00:34:03

failed #238838614
shell windows-1809 allowed to fail
windows 1809 tests 3/3

00:12:07

 
  Coverage
passed #238838618
race conditions detector

00:02:09

passed #238838616
test coverage report

00:01:32

62.7%
passed #238838619
test junit report

00:01:24

 
  Build
passed #238838621
gitlab-org
binaries darwin/386 darwin/amd64

00:04:37

passed #238838622
gitlab-org
binaries freebsd/386 freebsd/amd64 freebsd/arm

00:05:55

passed #238838624
gitlab-org
binaries linux/386 linux/amd64 linux/arm

00:04:42

passed #238838627
gitlab-org
binaries windows/386 windows/amd64

00:04:06

 
  Package
passed #238838630
gitlab-org
package-deb

00:02:04

passed #238838632
gitlab-org
package-rpm

00:02:11

 
  Release
passed #238838635
release
development S3

00:02:01

passed #238838637
docker
development docker images

00:02:55

passed #238838638
shell windows-1803
development servercore1803 helper docker image

00:04:33

passed #238838639
shell windows-1809
development servercore1809 helper docker image

00:02:10

passed #238838641
static QA

00:00:33

 
  Cleanup
manual #238838642
allowed to fail manual
review-docs-cleanup
 
Name Stage Failure
failed
windows 1803 tests 2/3 Test
gitlab.com/gitlab-org/gitlab-runner/executors/shell-2

gitlab.com/gitlab-org/gitlab-runner/executors/shell-3
gitlab.com/gitlab-org/gitlab-runner/helpers/archives-0
gitlab.com/gitlab-org/gitlab-runner/helpers/archives-1


Running after script...
$ if (Test-Path $PKG_BUILD_DIR) { $(Get-Item $PKG_BUILD_DIR).Delete() }
ERROR: Job failed: exit status 1
failed
windows 1809 tests 2/3 Test
gitlab.com/gitlab-org/gitlab-runner/executors/shell-2

gitlab.com/gitlab-org/gitlab-runner/executors/shell-3
gitlab.com/gitlab-org/gitlab-runner/helpers/archives-0
gitlab.com/gitlab-org/gitlab-runner/helpers/archives-1


Running after script...
$ if (Test-Path $PKG_BUILD_DIR) { $(Get-Item $PKG_BUILD_DIR).Delete() }
ERROR: Job failed: exit status 1
failed
windows 1803 tests 1/3 Test
gitlab.com/gitlab-org/gitlab-runner/executors/docker-2

gitlab.com/gitlab-org/gitlab-runner/executors/docker-4
gitlab.com/gitlab-org/gitlab-runner/executors/docker-5
gitlab.com/gitlab-org/gitlab-runner/executors/docker-6


Running after script...
$ if (Test-Path $PKG_BUILD_DIR) { $(Get-Item $PKG_BUILD_DIR).Delete() }
ERROR: Job failed: exit status 1
failed
windows 1809 tests 1/3 Test
gitlab.com/gitlab-org/gitlab-runner/executors/docker-2

gitlab.com/gitlab-org/gitlab-runner/executors/docker-4
gitlab.com/gitlab-org/gitlab-runner/executors/docker-5
gitlab.com/gitlab-org/gitlab-runner/executors/docker-6


Running after script...
$ if (Test-Path $PKG_BUILD_DIR) { $(Get-Item $PKG_BUILD_DIR).Delete() }
ERROR: Job failed: exit status 1
failed
unit test with race 2/5 Test
exit status 1
FAIL gitlab.com/gitlab-org/gitlab-runner/executors/docker/machine 0.111s
Makefile:134: recipe for target 'parallel_test_execute' failed
make: *** [parallel_test_execute] Error 1
Uploading artifacts...
.cover/*: found 14 matching files
.testoutput/*: found 14 matching files

Uploading artifacts to coordinator... ok
id=238838603 responseStatus=201 Created token=EoL2mGyi
ERROR: Job failed: exit code 1
failed
windows 1803 tests 3/3 Test

WARNING: Failed packages:
WARNING: gitlab.com/gitlab-org/gitlab-runner/helpers/docker-0
gitlab.com/gitlab-org/gitlab-runner/network-4


Running after script...
$ if (Test-Path $PKG_BUILD_DIR) { $(Get-Item $PKG_BUILD_DIR).Delete() }
ERROR: Job failed: exit status 1
failed
windows 1809 tests 3/3 Test

WARNING: Failed packages:
WARNING: gitlab.com/gitlab-org/gitlab-runner/helpers/docker-0
gitlab.com/gitlab-org/gitlab-runner/network-4


Running after script...
$ if (Test-Path $PKG_BUILD_DIR) { $(Get-Item $PKG_BUILD_DIR).Delete() }
ERROR: Job failed: exit status 1
failed
unit test with race 1/5 Test
coverage: 6.0% of statements
ok gitlab.com/gitlab-org/gitlab-runner/common 1.062s
Makefile:134: recipe for target 'parallel_test_execute' failed
make: *** [parallel_test_execute] Error 1
Uploading artifacts...
.cover/*: found 14 matching files
.testoutput/*: found 14 matching files

Uploading artifacts to coordinator... ok
id=238838601 responseStatus=201 Created token=NuasjNZ_
ERROR: Job failed: exit code 1
failed
unit test with race 3/5 Test
coverage: 62.4% of statements
ok gitlab.com/gitlab-org/gitlab-runner/helpers/archives 1.031s
Makefile:134: recipe for target 'parallel_test_execute' failed
make: *** [parallel_test_execute] Error 1
Uploading artifacts...
.cover/*: found 14 matching files
.testoutput/*: found 14 matching files

Uploading artifacts to coordinator... ok
id=238838604 responseStatus=201 Created token=9rjdkosS
ERROR: Job failed: exit code 1