Log ContainerInspect errors in FindOrCleanExisting()

41 jobs for extract-docker-volume-operations-from-executor in 86 minutes and 5 seconds (queued for 2 seconds)
Status Job ID Name Coverage
  Prebuild
passed #206926302
check feature flags docs

00:01:42

passed #206926298
clone test repo

00:01:45

passed #206926301
dep check

00:02:09

passed #206926297
docker
helper images

00:04:42

manual #206926299
allowed to fail manual
review-docs-deploy
passed #206926300
gitlab-org
tests definitions

00:02:47

 
  Test
passed #206926303
code_quality

00:01:14

passed #206926314
docs check links

00:01:59

passed #206926325
git 1.7.1

00:01:58

passed #206926304
docker
unit test 1/5

00:07:35

passed #206926305
docker
unit test 2/5

00:13:24

passed #206948518
docker
unit test 3/5

00:08:34

passed #206926307
docker
unit test 4/5

00:03:59

passed #206926308
docker
unit test 5/5

00:05:05

failed #206926309
docker allowed to fail
unit test with race 1/5

00:09:33

failed #206926310
docker allowed to fail
unit test with race 2/5

00:15:30

failed #206926311
docker allowed to fail
unit test with race 3/5

00:10:36

passed #206926312
docker allowed to fail
unit test with race 4/5

00:03:43

passed #206926313
docker allowed to fail
unit test with race 5/5

00:06:17

failed #206926315
shell windows-1803 allowed to fail
windows 1803 tests 1/3

00:31:16

failed #206926318
shell windows-1803 allowed to fail
windows 1803 tests 2/3

00:59:01

failed #206926320
shell windows-1803 allowed to fail
windows 1803 tests 3/3

00:15:56

failed #206926322
shell windows-1809 allowed to fail
windows 1809 tests 1/3

00:23:50

failed #206926323
shell windows-1809 allowed to fail
windows 1809 tests 2/3

00:48:31

failed #206926324
shell windows-1809 allowed to fail
windows 1809 tests 3/3

00:11:07

failed #206926306
docker
unit test 3/5

00:09:53

 
  Coverage
passed #206926327
race conditions detector

00:00:52

passed #206926326
test coverage report

00:01:02

61.1%
passed #206926328
test junit report

00:01:12

 
  Build
passed #206926329
gitlab-org
binaries darwin/386 darwin/amd64

00:03:58

passed #206926330
gitlab-org
binaries freebsd/386 freebsd/amd64 freebsd/arm

00:05:00

passed #206926331
gitlab-org
binaries linux/386 linux/amd64 linux/arm

00:05:08

passed #206926333
gitlab-org
binaries windows/386 windows/amd64

00:03:15

 
  Package
passed #206926334
gitlab-org
package-deb

00:02:27

passed #206926335
gitlab-org
package-rpm

00:02:17

 
  Release
passed #206926336
release
development S3

00:01:27

passed #206926337
docker
development docker images

00:02:31

passed #206926338
shell windows-1803
development servercore1803 helper docker image

00:04:40

passed #206926339
shell windows-1809
development servercore1809 helper docker image

00:02:40

passed #206926340
static QA

00:01:27

 
  Cleanup
manual #206926341
allowed to fail manual
review-docs-cleanup
 
Name Stage Failure
failed
windows 1803 tests 2/3 Test
gitlab.com/gitlab-org/gitlab-runner/executors/shell-1

gitlab.com/gitlab-org/gitlab-runner/executors/shell-2
gitlab.com/gitlab-org/gitlab-runner/executors/shell-3
gitlab.com/gitlab-org/gitlab-runner/helpers/archives-0


Running after script...
$ if (Test-Path $PKG_BUILD_DIR) { $(Get-Item $PKG_BUILD_DIR).Delete() }
ERROR: Job failed: exit status 1
failed
windows 1809 tests 2/3 Test
gitlab.com/gitlab-org/gitlab-runner/executors/shell-1

gitlab.com/gitlab-org/gitlab-runner/executors/shell-2
gitlab.com/gitlab-org/gitlab-runner/executors/shell-3
gitlab.com/gitlab-org/gitlab-runner/helpers/archives-0


Running after script...
$ if (Test-Path $PKG_BUILD_DIR) { $(Get-Item $PKG_BUILD_DIR).Delete() }
ERROR: Job failed: exit status 1
failed
windows 1803 tests 1/3 Test
WARNING: gitlab.com/gitlab-org/gitlab-runner/common-2

gitlab.com/gitlab-org/gitlab-runner/executors/docker-1
gitlab.com/gitlab-org/gitlab-runner/executors/docker-2
gitlab.com/gitlab-org/gitlab-runner/executors/docker-4


Running after script...
$ if (Test-Path $PKG_BUILD_DIR) { $(Get-Item $PKG_BUILD_DIR).Delete() }
ERROR: Job failed: exit status 1
failed
windows 1809 tests 1/3 Test
WARNING: gitlab.com/gitlab-org/gitlab-runner/common-2

gitlab.com/gitlab-org/gitlab-runner/executors/docker-1
gitlab.com/gitlab-org/gitlab-runner/executors/docker-2
gitlab.com/gitlab-org/gitlab-runner/executors/docker-4


Running after script...
$ if (Test-Path $PKG_BUILD_DIR) { $(Get-Item $PKG_BUILD_DIR).Delete() }
ERROR: Job failed: exit status 1
failed
windows 1803 tests 3/3 Test

WARNING: Failed packages:
WARNING: gitlab.com/gitlab-org/gitlab-runner/helpers/archives-1
gitlab.com/gitlab-org/gitlab-runner/helpers/docker-0


Running after script...
$ if (Test-Path $PKG_BUILD_DIR) { $(Get-Item $PKG_BUILD_DIR).Delete() }
ERROR: Job failed: exit status 1
failed
unit test with race 2/5 Test
coverage: 41.5% of statements
ok gitlab.com/gitlab-org/gitlab-runner/executors/docker/machine 1.066s
make: *** [parallel_test_execute] Error 1
Makefile:134: recipe for target 'parallel_test_execute' failed
Uploading artifacts...
.cover/*: found 13 matching files
.testoutput/*: found 13 matching files

Uploading artifacts to coordinator... ok
id=206926310 responseStatus=201 Created token=nMiWso8h
ERROR: Job failed: exit code 1
failed
windows 1809 tests 3/3 Test

WARNING: Failed packages:
WARNING: gitlab.com/gitlab-org/gitlab-runner/helpers/archives-1
gitlab.com/gitlab-org/gitlab-runner/helpers/docker-0


Running after script...
$ if (Test-Path $PKG_BUILD_DIR) { $(Get-Item $PKG_BUILD_DIR).Delete() }
ERROR: Job failed: exit status 1
failed
unit test with race 3/5 Test
coverage: 52.2% of statements
ok gitlab.com/gitlab-org/gitlab-runner/helpers 1.032s
Makefile:134: recipe for target 'parallel_test_execute' failed
make: *** [parallel_test_execute] Error 1
Uploading artifacts...
.cover/*: found 13 matching files
.testoutput/*: found 13 matching files

Uploading artifacts to coordinator... ok
id=206926311 responseStatus=201 Created token=6AtZYC4e
ERROR: Job failed: exit code 1
failed
unit test with race 1/5 Test
coverage: 20.6% of statements
ok gitlab.com/gitlab-org/gitlab-runner/common 2.100s
Makefile:134: recipe for target 'parallel_test_execute' failed
make: *** [parallel_test_execute] Error 1
Uploading artifacts...
.cover/*: found 13 matching files
.testoutput/*: found 13 matching files

Uploading artifacts to coordinator... ok
id=206926309 responseStatus=201 Created token=bTf6DpEb
ERROR: Job failed: exit code 1