Merge branch 'docs/update-cmd-output-example' into 'master'

Update cmd script example

See merge request !1333
41 jobs for master in 92 minutes and 51 seconds (queued for 4 seconds)
Status Job ID Name Coverage
  Prebuild
passed #202175991
check feature flags docs

00:01:26

passed #202175986
clone test repo

00:01:18

passed #202175990
dep check

00:01:39

passed #202175985
docker
helper images

00:05:49

manual #202175987
allowed to fail manual
review-docs-deploy
passed #202175989
gitlab-org
tests definitions

00:03:05

 
  Test
passed #202175993
code_quality

00:01:17

passed #202176006
docs check links

00:00:55

passed #202176016
git 1.7.1

00:01:46

passed #202175995
docker
unit test 1/5

00:07:29

passed #202175996
docker
unit test 2/5

00:13:26

passed #202175997
docker
unit test 3/5

00:08:52

passed #202175998
docker
unit test 4/5

00:02:51

passed #202175999
docker
unit test 5/5

00:05:13

failed #202176000
docker allowed to fail
unit test with race 1/5

00:08:32

failed #202176001
docker allowed to fail
unit test with race 2/5

00:14:31

failed #202176002
docker allowed to fail
unit test with race 3/5

00:10:41

passed #202176003
docker allowed to fail
unit test with race 4/5

00:03:48

passed #202176005
docker allowed to fail
unit test with race 5/5

00:06:11

failed #202176007
shell windows-1803 allowed to fail
windows 1803 tests 1/3

00:28:31

failed #202176008
shell windows-1803 allowed to fail
windows 1803 tests 2/3

01:05:38

failed #202176010
shell windows-1803 allowed to fail
windows 1803 tests 3/3

00:15:31

failed #202176013
shell windows-1809 allowed to fail
windows 1809 tests 1/3

00:23:56

failed #202176014
shell windows-1809 allowed to fail
windows 1809 tests 2/3

00:53:50

failed #202176015
shell windows-1809 allowed to fail
windows 1809 tests 3/3

00:12:49

 
  Coverage
passed #202176018
race conditions detector

00:01:05

passed #202176017
test coverage report

00:01:03

57.4%
passed #202176019
test junit report

00:01:32

 
  Build
passed #202176020
gitlab-org
binaries darwin/386 darwin/amd64

00:03:57

passed #202176023
gitlab-org
binaries freebsd/386 freebsd/amd64 freebsd/arm

00:05:04

passed #202176024
gitlab-org
binaries linux/386 linux/amd64 linux/arm

00:05:39

passed #202176025
gitlab-org
binaries windows/386 windows/amd64

00:04:56

 
  Package
passed #202176026
gitlab-org
package-deb

00:01:39

passed #202176027
gitlab-org
package-rpm

00:02:10

 
  Release
passed #202176028
release
bleeding edge S3

00:01:10

passed #202176032
release
bleeding edge docker images

00:03:09

passed #202176031
release
bleeding edge packagecloud

00:06:57

passed #202176034
shell windows-1803
bleeding edge servercore1803 docker images

00:10:03

passed #202176035
shell windows-1809
bleeding edge servercore1809 docker images

00:04:49

passed #202176036
static QA

00:00:43

 
  Cleanup
manual #202176037
allowed to fail manual
review-docs-cleanup
 
Name Stage Failure
failed
windows 1803 tests 2/3 Test
gitlab.com/gitlab-org/gitlab-runner/executors/shell-2

gitlab.com/gitlab-org/gitlab-runner/executors/shell-3
gitlab.com/gitlab-org/gitlab-runner/helpers/archives-0
gitlab.com/gitlab-org/gitlab-runner/helpers/archives-1


Running after script...
$ if (Test-Path $PKG_BUILD_DIR) { $(Get-Item $PKG_BUILD_DIR).Delete() }
ERROR: Job failed: exit status 1
failed
windows 1809 tests 2/3 Test
gitlab.com/gitlab-org/gitlab-runner/executors/shell-2

gitlab.com/gitlab-org/gitlab-runner/executors/shell-3
gitlab.com/gitlab-org/gitlab-runner/helpers/archives-0
gitlab.com/gitlab-org/gitlab-runner/helpers/archives-1


Running after script...
$ if (Test-Path $PKG_BUILD_DIR) { $(Get-Item $PKG_BUILD_DIR).Delete() }
ERROR: Job failed: exit status 1
failed
windows 1803 tests 1/3 Test
WARNING: Failed packages:
WARNING: gitlab.com/gitlab-org/gitlab-runner/common-2
gitlab.com/gitlab-org/gitlab-runner/executors/docker-2
gitlab.com/gitlab-org/gitlab-runner/executors/docker-4


Running after script...
$ if (Test-Path $PKG_BUILD_DIR) { $(Get-Item $PKG_BUILD_DIR).Delete() }
ERROR: Job failed: exit status 1
failed
windows 1809 tests 1/3 Test
WARNING: Failed packages:
WARNING: gitlab.com/gitlab-org/gitlab-runner/common-2
gitlab.com/gitlab-org/gitlab-runner/executors/docker-2
gitlab.com/gitlab-org/gitlab-runner/executors/docker-4


Running after script...
$ if (Test-Path $PKG_BUILD_DIR) { $(Get-Item $PKG_BUILD_DIR).Delete() }
ERROR: Job failed: exit status 1
failed
windows 1803 tests 3/3 Test
ok  	gitlab.com/gitlab-org/gitlab-runner/shells	8.862s

WARNING: Failed packages:
WARNING: gitlab.com/gitlab-org/gitlab-runner/helpers/docker-0


Running after script...
$ if (Test-Path $PKG_BUILD_DIR) { $(Get-Item $PKG_BUILD_DIR).Delete() }
ERROR: Job failed: exit status 1
failed
unit test with race 2/5 Test
coverage: 41.5% of statements
ok gitlab.com/gitlab-org/gitlab-runner/executors/docker/machine 1.063s
make: *** [parallel_test_execute] Error 1
Makefile:134: recipe for target 'parallel_test_execute' failed
Uploading artifacts...
.cover/*: found 12 matching files
.testoutput/*: found 12 matching files
Uploading artifacts to coordinator... ok id=202176001 responseStatus=201 Created token=Lf2z_JD-
ERROR: Job failed: exit code 1
failed
windows 1809 tests 3/3 Test
ok  	gitlab.com/gitlab-org/gitlab-runner/shells	14.727s

WARNING: Failed packages:
WARNING: gitlab.com/gitlab-org/gitlab-runner/helpers/docker-0


Running after script...
$ if (Test-Path $PKG_BUILD_DIR) { $(Get-Item $PKG_BUILD_DIR).Delete() }
ERROR: Job failed: exit status 1
failed
unit test with race 3/5 Test
coverage: 3.7% of statements
ok gitlab.com/gitlab-org/gitlab-runner/executors/virtualbox 1.053s
Makefile:134: recipe for target 'parallel_test_execute' failed
make: *** [parallel_test_execute] Error 1
Uploading artifacts...
.cover/*: found 12 matching files
.testoutput/*: found 12 matching files
Uploading artifacts to coordinator... ok id=202176002 responseStatus=201 Created token=rhvG1hJT
ERROR: Job failed: exit code 1
failed
unit test with race 1/5 Test
coverage: 32.3% of statements
ok gitlab.com/gitlab-org/gitlab-runner/common 1.156s
make: *** [parallel_test_execute] Error 1
Makefile:134: recipe for target 'parallel_test_execute' failed
Uploading artifacts...
.cover/*: found 12 matching files
.testoutput/*: found 12 matching files
Uploading artifacts to coordinator... ok id=202176000 responseStatus=201 Created token=xhh6j_vE
ERROR: Job failed: exit code 1